[package - main-amd64-default][devel/9base] Failed for 9base-20170701_1 in build

From: <pkg-fallout_at_FreeBSD.org>
Date: Sat, 22 Jun 2024 05:08:10 UTC
You are receiving this mail as a port that you maintain
is failing to build on the FreeBSD package build server.
Please investigate the failure and submit a PR to fix
build.

Maintainer:     sbz@FreeBSD.org
Log URL:        https://pkg-status.freebsd.org/beefy18/data/main-amd64-default/pf558721194b8_s42c545c5f8a/logs/9base-20170701_1.log
Build URL:      https://pkg-status.freebsd.org/beefy18/build.html?mastername=main-amd64-default&build=pf558721194b8_s42c545c5f8a
Log:

=>> Building devel/9base
build started at Sat Jun 22 05:07:25 UTC 2024
port directory: /usr/ports/devel/9base
package name: 9base-20170701_1
building for: FreeBSD main-amd64-default-job-07 15.0-CURRENT FreeBSD 15.0-CURRENT 1500019 amd64
maintained by: sbz@FreeBSD.org
Makefile datestamp: -rw-r--r--  1 root wheel 1046 Jan 20 01:01 /usr/ports/devel/9base/Makefile
Ports top last git commit: f558721194b
Ports top unclean checkout: no
Port dir last git commit: 13621e4e3ac
Port dir unclean checkout: no
Poudriere version: poudriere-git-3.4.1-30-g79e3edcd
Host OSVERSION: 1500018
Jail OSVERSION: 1500019
Job Id: 07




!!! Jail is newer than host. (Jail: 1500019, Host: 1500018) !!!
!!! This is not supported. !!!
!!! Host kernel must be same or newer than jail. !!!
!!! Expect build failures. !!!



---Begin Environment---
SHELL=/bin/sh
OSVERSION=1500019
UNAME_v=FreeBSD 15.0-CURRENT 1500019
UNAME_r=15.0-CURRENT
BLOCKSIZE=K
MAIL=/var/mail/root
MM_CHARSET=UTF-8
LANG=C.UTF-8
STATUS=1
HOME=/root
PATH=/sbin:/bin:/usr/sbin:/usr/bin:/usr/local/sbin:/usr/local/bin:/root/bin
MAKE_OBJDIR_CHECK_WRITABLE=0
LOCALBASE=/usr/local
USER=root
POUDRIERE_NAME=poudriere-git
LIBEXECPREFIX=/usr/local/libexec/poudriere
POUDRIERE_VERSION=3.4.1-30-g79e3edcd
MASTERMNT=/usr/local/poudriere/data/.m/main-amd64-default/ref
LC_COLLATE=C
POUDRIERE_BUILD_TYPE=bulk
PACKAGE_BUILDING=yes
SAVED_TERM=
OUTPUT_REDIRECTED_STDERR=4
OUTPUT_REDIRECTED=1
PWD=/usr/local/poudriere/data/.m/main-amd64-default/07/.p
OUTPUT_REDIRECTED_STDOUT=3
P_PORTS_FEATURES=FLAVORS SUBPACKAGES SELECTED_OPTIONS
MASTERNAME=main-amd64-default
SCRIPTPREFIX=/usr/local/share/poudriere
SCRIPTNAME=bulk.sh
OLDPWD=/usr/local/poudriere/data/.m/main-amd64-default/ref/.p/pool
POUDRIERE_PKGNAME=poudriere-git-3.4.1-30-g79e3edcd
SCRIPTPATH=/usr/local/share/poudriere/bulk.sh
POUDRIEREPATH=/usr/local/bin/poudriere
---End Environment---

---Begin Poudriere Port Flags/Env---
PORT_FLAGS=
PKGENV=
FLAVOR=
MAKE_ARGS=
---End Poudriere Port Flags/Env---

---Begin OPTIONS List---
---End OPTIONS List---

--MAINTAINER--
sbz@FreeBSD.org
--End MAINTAINER--

--CONFIGURE_ARGS--

--End CONFIGURE_ARGS--

--CONFIGURE_ENV--
XDG_DATA_HOME=/wrkdirs/usr/ports/devel/9base/work  XDG_CONFIG_HOME=/wrkdirs/usr/ports/devel/9base/work  XDG_CACHE_HOME=/wrkdirs/usr/ports/devel/9base/work/.cache  HOME=/wrkdirs/usr/ports/devel/9base/work TMPDIR="/tmp" PATH=/wrkdirs/usr/ports/devel/9base/work/.bin:/sbin:/bin:/usr/sbin:/usr/bin:/usr/local/sbin:/usr/local/bin:/root/bin PKG_CONFIG_LIBDIR=/wrkdirs/usr/ports/devel/9base/work/.pkgconfig:/usr/local/libdata/pkgconfig:/usr/local/share/pkgconfig:/usr/libdata/pkgconfig SHELL=/bin/sh CONFIG_SHELL=/bin/sh
--End CONFIGURE_ENV--

--MAKE_ENV--
XDG_DATA_HOME=/wrkdirs/usr/ports/devel/9base/work  XDG_CONFIG_HOME=/wrkdirs/usr/ports/devel/9base/work  XDG_CACHE_HOME=/wrkdirs/usr/ports/devel/9base/work/.cache  HOME=/wrkdirs/usr/ports/devel/9base/work TMPDIR="/tmp" PATH=/wrkdirs/usr/ports/devel/9base/work/.bin:/sbin:/bin:/usr/sbin:/usr/bin:/usr/local/sbin:/usr/local/bin:/root/bin PKG_CONFIG_LIBDIR=/wrkdirs/usr/ports/devel/9base/work/.pkgconfig:/usr/local/libdata/pkgconfig:/usr/local/share/pkgconfig:/usr/libdata/pkgconfig MK_DEBUG_FILES=no MK_KERNEL_SYMBOLS=no SHELL=/bin/sh NO_LINT=YES PREFIX=/usr/local  LOCALBASE=/usr/local  CC="cc" CFLAGS="-O2 -pipe  -fcommon -fstack-protector-strong -fno-strict-aliasing "  CPP="cpp" CPPFLAGS=""  LDFLAGS=" -fstack-protector-strong " LIBS=""  CXX="c++" CXXFLAGS="-O2 -pipe -fcommon -fstack-protector-strong -fno-strict-aliasing  " BSD_INSTALL_PROGRAM="install  -s -m 555"  BSD_INSTALL_LIB="install  -s -m 0644"  BSD_INSTALL_SCRIPT="install  -m 555"  BSD_INSTALL_DATA="install  -m 0644"  BSD_IN
STALL_MAN="install  -m 444"
--End MAKE_ENV--

--PLIST_SUB--
OSREL=15.0 PREFIX=%D LOCALBASE=/usr/local  RESETPREFIX=/usr/local LIB32DIR=lib DOCSDIR="share/doc/9base"  EXAMPLESDIR="share/examples/9base"  DATADIR="share/9base"  WWWDIR="www/9base"  ETCDIR="etc/9base"
--End PLIST_SUB--

--SUB_LIST--
PREFIX=/usr/local LOCALBASE=/usr/local  DATADIR=/usr/local/share/9base DOCSDIR=/usr/local/share/doc/9base EXAMPLESDIR=/usr/local/share/examples/9base  WWWDIR=/usr/local/www/9base ETCDIR=/usr/local/etc/9base
--End SUB_LIST--

---Begin make.conf---
# XXX: We really need this but cannot use it while 'make checksum' does not
# try the next mirror on checksum failure.  It currently retries the same
# failed mirror and then fails rather then trying another.  It *does*
# try the next if the size is mismatched though.
#MASTER_SITE_FREEBSD=yes
# Build ALLOW_MAKE_JOBS_PACKAGES with 3 jobs
MAKE_JOBS_NUMBER=3
USE_PACKAGE_DEPENDS=yes
BATCH=yes
WRKDIRPREFIX=/wrkdirs
PORTSDIR=/usr/ports
PACKAGES=/packages
DISTDIR=/distfiles
PACKAGE_BUILDING=yes
PACKAGE_BUILDING_FLAVORS=yes
####  ####
# XXX: We really need this but cannot use it while 'make checksum' does not
# try the next mirror on checksum failure.  It currently retries the same
# failed mirror and then fails rather then trying another.  It *does*
# try the next if the size is mismatched though.
#MASTER_SITE_FREEBSD=yes
# Build ALLOW_MAKE_JOBS_PACKAGES with 3 jobs
MAKE_JOBS_NUMBER=3
#### Misc Poudriere ####
.include "/etc/make.conf.ports_env"
GID=0
UID=0
---End make.conf---
--Resource limits--
cpu time               (seconds, -t)  unlimited
file size           (512-blocks, -f)  unlimited
data seg size           (kbytes, -d)  33554432
stack size              (kbytes, -s)  524288
core file size      (512-blocks, -c)  unlimited
max memory size         (kbytes, -m)  unlimited
locked memory           (kbytes, -l)  unlimited
max user processes              (-u)  89999
open files                      (-n)  8192
virtual mem size        (kbytes, -v)  unlimited
swap limit              (kbytes, -w)  unlimited
socket buffer size       (bytes, -b)  unlimited
pseudo-terminals                (-p)  unlimited
kqueues                         (-k)  unlimited
umtx shared locks               (-o)  unlimited
--End resource limits--
=======================<phase: check-sanity   >============================
===== env: NO_DEPENDS=yes USER=root UID=0 GID=0
===>  License MIT accepted by the user
===========================================================================
=======================<phase: pkg-depends    >============================
===== env: USE_PACKAGE_DEPENDS_ONLY=1 USER=root UID=0 GID=0
===>   9base-20170701_1 depends on file: /usr/local/sbin/pkg - not found
===>   Installing existing package /packages/All/pkg-1.21.3.pkg
[main-amd64-default-job-07] Installing pkg-1.21.3...
[main-amd64-default-job-07] Extracting pkg-1.21.3: .......... done
===>   9base-20170701_1 depends on file: /usr/local/sbin/pkg - found
===>   Returning to build of 9base-20170701_1
===========================================================================
=======================<phase: fetch-depends  >============================
===== env: USE_PACKAGE_DEPENDS_ONLY=1 USER=root UID=0 GID=0
===========================================================================
=======================<phase: fetch          >============================
===== env: NO_DEPENDS=yes USER=root UID=0 GID=0
===>  License MIT accepted by the user
===> Fetching all distfiles required by 9base-20170701_1 for building
===========================================================================
=======================<phase: checksum       >============================
===== env: NO_DEPENDS=yes USER=root UID=0 GID=0
===>  License MIT accepted by the user
===> Fetching all distfiles required by 9base-20170701_1 for building
=> SHA256 Checksum OK for 9base-6.tar.gz.
===========================================================================
=======================<phase: extract-depends>============================
===== env: USE_PACKAGE_DEPENDS_ONLY=1 USER=root UID=0 GID=0
===========================================================================
=======================<phase: extract        >============================
===== env: NO_DEPENDS=yes USER=root UID=0 GID=0
===>  License MIT accepted by the user
===> Fetching all distfiles required by 9base-20170701_1 for building
===>  Extracting for 9base-20170701_1
=> SHA256 Checksum OK for 9base-6.tar.gz.
===========================================================================
=======================<phase: patch-depends  >============================
===== env: USE_PACKAGE_DEPENDS_ONLY=1 USER=root UID=0 GID=0
===========================================================================
=======================<phase: patch          >============================
===== env: NO_DEPENDS=yes USER=root UID=0 GID=0
===>  Patching for 9base-20170701_1
===========================================================================
=======================<phase: build-depends  >============================
===== env: USE_PACKAGE_DEPENDS_ONLY=1 USER=root UID=0 GID=0
===========================================================================
=======================<phase: lib-depends    >============================
===== env: USE_PACKAGE_DEPENDS_ONLY=1 USER=root UID=0 GID=0
===========================================================================
=======================<phase: configure      >============================
===== env: NO_DEPENDS=yes USER=root UID=0 GID=0
===>  Configuring for 9base-20170701_1
===========================================================================
=======================<phase: build          >============================
===== env: NO_DEPENDS=yes USER=root UID=0 GID=0
<snip>
      |                 ^      
      |               (        )
sed.c:1048:10: note: use '==' to turn this assignment into an equality comparison
 1048 |         while(c = *rp++) {
      |                 ^
      |                 ==
sed.c:1070:15: warning: using the result of an assignment as a condition without parentheses [-Wparentheses]
 1070 |         while (*sp++ = *lp++)
      |                ~~~~~~^~~~~~~
sed.c:1070:15: note: place parentheses around the assignment to silence this warning
 1070 |         while (*sp++ = *lp++)
      |                      ^      
      |                (            )
sed.c:1070:15: note: use '==' to turn this assignment into an equality comparison
 1070 |         while (*sp++ = *lp++)
      |                      ^
      |                      ==
sed.c:1075:15: warning: using the result of an assignment as a condition without parentheses [-Wparentheses]
 1075 |         while (*lp++ = *sp++)
      |                ~~~~~~^~~~~~~
sed.c:1075:15: note: place parentheses around the assignment to silence this warning
 1075 |         while (*lp++ = *sp++)
      |                      ^      
      |                (            )
sed.c:1075:15: note: use '==' to turn this assignment into an equality comparison
 1075 |         while (*lp++ = *sp++)
      |                      ^
      |                      ==
sed.c:1155:16: warning: using the result of an assignment as a condition without parentheses [-Wparentheses]
 1155 |                         while(*p2++ = *p1++)
      |                               ~~~~~~^~~~~~~
sed.c:1155:16: note: place parentheses around the assignment to silence this warning
 1155 |                         while(*p2++ = *p1++)
      |                                     ^      
      |                               (            )
sed.c:1155:16: note: use '==' to turn this assignment into an equality comparison
 1155 |                         while(*p2++ = *p1++)
      |                                     ^
      |                                     ==
sed.c:1166:16: warning: using the result of an assignment as a condition without parentheses [-Wparentheses]
 1166 |                         while(*p1++ = *p2++)
      |                               ~~~~~~^~~~~~~
sed.c:1166:16: note: place parentheses around the assignment to silence this warning
 1166 |                         while(*p1++ = *p2++)
      |                                     ^      
      |                               (            )
sed.c:1166:16: note: use '==' to turn this assignment into an equality comparison
 1166 |                         while(*p1++ = *p2++)
      |                                     ^
      |                                     ==
sed.c:1174:16: warning: using the result of an assignment as a condition without parentheses [-Wparentheses]
 1174 |                         while(*p1++ = *p2++)
      |                               ~~~~~~^~~~~~~
sed.c:1174:16: note: place parentheses around the assignment to silence this warning
 1174 |                         while(*p1++ = *p2++)
      |                                     ^      
      |                               (            )
sed.c:1174:16: note: use '==' to turn this assignment into an equality comparison
 1174 |                         while(*p1++ = *p2++)
      |                                     ^
      |                                     ==
sed.c:1182:16: warning: using the result of an assignment as a condition without parentheses [-Wparentheses]
 1182 |                         while(*p1++ = *p2++);
      |                               ~~~~~~^~~~~~~
sed.c:1182:16: note: place parentheses around the assignment to silence this warning
 1182 |                         while(*p1++ = *p2++);
      |                                     ^      
      |                               (            )
sed.c:1182:16: note: use '==' to turn this assignment into an equality comparison
 1182 |                         while(*p1++ = *p2++);
      |                                     ^
      |                                     ==
sed.c:1189:16: warning: using the result of an assignment as a condition without parentheses [-Wparentheses]
 1189 |                         while(*p1++ = *p2++)
      |                               ~~~~~~^~~~~~~
sed.c:1189:16: note: place parentheses around the assignment to silence this warning
 1189 |                         while(*p1++ = *p2++)
      |                                     ^      
      |                               (            )
sed.c:1189:16: note: use '==' to turn this assignment into an equality comparison
 1189 |                         while(*p1++ = *p2++)
      |                                     ^
      |                                     ==
sed.c:1276:5: warning: add explicit braces to avoid dangling else [-Wdangling-else]
 1276 |                                 else
      |                                 ^
sed.c:1295:16: warning: using the result of an assignment as a condition without parentheses [-Wparentheses]
 1295 |                         while(*p2++ = *p1++);
      |                               ~~~~~~^~~~~~~
sed.c:1295:16: note: place parentheses around the assignment to silence this warning
 1295 |                         while(*p2++ = *p1++);
      |                                     ^      
      |                               (            )
sed.c:1295:16: note: use '==' to turn this assignment into an equality comparison
 1295 |                         while(*p2++ = *p1++);
      |                                     ^
      |                                     ==
sed.c:1298:16: warning: using the result of an assignment as a condition without parentheses [-Wparentheses]
 1298 |                         while(*p2++ = *p1++);
      |                               ~~~~~~^~~~~~~
sed.c:1298:16: note: place parentheses around the assignment to silence this warning
 1298 |                         while(*p2++ = *p1++);
      |                                     ^      
      |                               (            )
sed.c:1298:16: note: use '==' to turn this assignment into an equality comparison
 1298 |                         while(*p2++ = *p1++);
      |                                     ^
      |                                     ==
sed.c:1302:16: warning: using the result of an assignment as a condition without parentheses [-Wparentheses]
 1302 |                         while(*p2++ = *p1++);
      |                               ~~~~~~^~~~~~~
sed.c:1302:16: note: place parentheses around the assignment to silence this warning
 1302 |                         while(*p2++ = *p1++);
      |                                     ^      
      |                               (            )
sed.c:1302:16: note: use '==' to turn this assignment into an equality comparison
 1302 |                         while(*p2++ = *p1++);
      |                                     ^
      |                                     ==
20 warnings generated.
LD sed
built sed
CC seq.c
LD seq
built seq
CC sleep.c
LD sleep
built sleep
CC sort.c
sort.c:111:5: error: conflicting types for 'kcmp'
  111 | int     kcmp(Key*, Key*);
      |         ^
/usr/include/unistd.h:526:6: note: previous declaration is here
  526 | int      kcmp(pid_t pid1, pid_t pid2, int type, uintptr_t idx1, uintptr_t idx2);
      |          ^
sort.c:205:28: error: too few arguments to function call, expected 5, have 2
  205 |                         n = kcmp(ol->key, l->key);
      |                             ~~~~                ^
/usr/include/unistd.h:526:6: note: 'kcmp' declared here
  526 | int      kcmp(pid_t pid1, pid_t pid2, int type, uintptr_t idx1, uintptr_t idx2);
      |          ^    ~~~~~~~~~~~~~~~~~~~~~~~~~~~~~~~~~~~~~~~~~~~~~~~~~~~~~~~~~~~~~~~~
sort.c:451:42: error: too few arguments to function call, expected 5, have 2
  451 |                         if(args.uflag && ok && kcmp(ok, l->key) == 0) {
      |                                                ~~~~           ^
/usr/include/unistd.h:526:6: note: 'kcmp' declared here
  526 | int      kcmp(pid_t pid1, pid_t pid2, int type, uintptr_t idx1, uintptr_t idx2);
      |          ^    ~~~~~~~~~~~~~~~~~~~~~~~~~~~~~~~~~~~~~~~~~~~~~~~~~~~~~~~~~~~~~~~~
sort.c:470:46: error: too few arguments to function call, expected 5, have 2
  470 |                         if(nn > 1 && kcmp(mmp[0]->key, mmp[1]->key) > 0)
      |                                      ~~~~                         ^
/usr/include/unistd.h:526:6: note: 'kcmp' declared here
  526 | int      kcmp(pid_t pid1, pid_t pid2, int type, uintptr_t idx1, uintptr_t idx2);
      |          ^    ~~~~~~~~~~~~~~~~~~~~~~~~~~~~~~~~~~~~~~~~~~~~~~~~~~~~~~~~~~~~~~~~
sort.c:488:1: error: conflicting types for 'kcmp'
  488 | kcmp(Key *ka, Key *kb)
      | ^
/usr/include/unistd.h:526:6: note: previous declaration is here
  526 | int      kcmp(pid_t pid1, pid_t pid2, int type, uintptr_t idx1, uintptr_t idx2);
      |          ^
sort.c:514:41: error: too few arguments to function call, expected 5, have 2
  514 |                 if(args.uflag && ok && kcmp(ok, l->key) == 0)
      |                                        ~~~~           ^
/usr/include/unistd.h:526:6: note: 'kcmp' declared here
  526 | int      kcmp(pid_t pid1, pid_t pid2, int type, uintptr_t idx1, uintptr_t idx2);
      |          ^    ~~~~~~~~~~~~~~~~~~~~~~~~~~~~~~~~~~~~~~~~~~~~~~~~~~~~~~~~~~~~~~~~
sort.c:715:12: warning: using the result of an assignment as a condition without parentheses [-Wparentheses]
  715 |                         while(c = *s++)
      |                               ~~^~~~~~
sort.c:715:12: note: place parentheses around the assignment to silence this warning
  715 |                         while(c = *s++)
      |                                 ^     
      |                               (       )
sort.c:715:12: note: use '==' to turn this assignment into an equality comparison
  715 |                         while(c = *s++)
      |                                 ^
      |                                 ==
sort.c:1697:20: warning: using the result of an assignment as a condition without parentheses [-Wparentheses]
 1697 |         for(cp1=clist+1; n=cp1[0]; cp1+=2) {
      |                          ~^~~~~~~
sort.c:1697:20: note: place parentheses around the assignment to silence this warning
 1697 |         for(cp1=clist+1; n=cp1[0]; cp1+=2) {
      |                           ^      
      |                          (       )
sort.c:1697:20: note: use '==' to turn this assignment into an equality comparison
 1697 |         for(cp1=clist+1; n=cp1[0]; cp1+=2) {
      |                           ^
      |                           ==
2 warnings and 6 errors generated.
*** Error code 1

Stop.
make[1]: stopped in /wrkdirs/usr/ports/devel/9base/work/9base-6/sort
*** Error code 1

Stop.
make: stopped in /wrkdirs/usr/ports/devel/9base/work/9base-6
*** Error code 1

Stop.
make: stopped in /usr/ports/devel/9base