[package - main-amd64-default][sysutils/ods2] Failed for ods2-1.3_1 in build

From: <pkg-fallout_at_FreeBSD.org>
Date: Sat, 22 Jun 2024 01:22:24 UTC
You are receiving this mail as a port that you maintain
is failing to build on the FreeBSD package build server.
Please investigate the failure and submit a PR to fix
build.

Maintainer:     pzn.unixbsd@gmail.com
Log URL:        https://pkg-status.freebsd.org/beefy18/data/main-amd64-default/pf558721194b8_s42c545c5f8a/logs/ods2-1.3_1.log
Build URL:      https://pkg-status.freebsd.org/beefy18/build.html?mastername=main-amd64-default&build=pf558721194b8_s42c545c5f8a
Log:

=>> Building sysutils/ods2
build started at Sat Jun 22 01:22:20 UTC 2024
port directory: /usr/ports/sysutils/ods2
package name: ods2-1.3_1
building for: FreeBSD main-amd64-default-job-03 15.0-CURRENT FreeBSD 15.0-CURRENT 1500019 amd64
maintained by: pzn.unixbsd@gmail.com
Makefile datestamp: -rw-r--r--  1 root wheel 751 Sep  8  2022 /usr/ports/sysutils/ods2/Makefile
Ports top last git commit: f558721194b
Ports top unclean checkout: no
Port dir last git commit: fb16dfecae4
Port dir unclean checkout: no
Poudriere version: poudriere-git-3.4.1-30-g79e3edcd
Host OSVERSION: 1500018
Jail OSVERSION: 1500019
Job Id: 03




!!! Jail is newer than host. (Jail: 1500019, Host: 1500018) !!!
!!! This is not supported. !!!
!!! Host kernel must be same or newer than jail. !!!
!!! Expect build failures. !!!



---Begin Environment---
SHELL=/bin/sh
OSVERSION=1500019
UNAME_v=FreeBSD 15.0-CURRENT 1500019
UNAME_r=15.0-CURRENT
BLOCKSIZE=K
MAIL=/var/mail/root
MM_CHARSET=UTF-8
LANG=C.UTF-8
STATUS=1
HOME=/root
PATH=/sbin:/bin:/usr/sbin:/usr/bin:/usr/local/sbin:/usr/local/bin:/root/bin
MAKE_OBJDIR_CHECK_WRITABLE=0
LOCALBASE=/usr/local
USER=root
POUDRIERE_NAME=poudriere-git
LIBEXECPREFIX=/usr/local/libexec/poudriere
POUDRIERE_VERSION=3.4.1-30-g79e3edcd
MASTERMNT=/usr/local/poudriere/data/.m/main-amd64-default/ref
LC_COLLATE=C
POUDRIERE_BUILD_TYPE=bulk
PACKAGE_BUILDING=yes
SAVED_TERM=
OUTPUT_REDIRECTED_STDERR=4
OUTPUT_REDIRECTED=1
PWD=/usr/local/poudriere/data/.m/main-amd64-default/03/.p
OUTPUT_REDIRECTED_STDOUT=3
P_PORTS_FEATURES=FLAVORS SUBPACKAGES SELECTED_OPTIONS
MASTERNAME=main-amd64-default
SCRIPTPREFIX=/usr/local/share/poudriere
SCRIPTNAME=bulk.sh
OLDPWD=/usr/local/poudriere/data/.m/main-amd64-default/ref/.p/pool
POUDRIERE_PKGNAME=poudriere-git-3.4.1-30-g79e3edcd
SCRIPTPATH=/usr/local/share/poudriere/bulk.sh
POUDRIEREPATH=/usr/local/bin/poudriere
---End Environment---

---Begin Poudriere Port Flags/Env---
PORT_FLAGS=
PKGENV=
FLAVOR=
MAKE_ARGS=
---End Poudriere Port Flags/Env---

---Begin OPTIONS List---
===> The following configuration options are available for ods2-1.3_1:
     DOCS=on: Build and/or install documentation
===> Use 'make config' to modify these settings
---End OPTIONS List---

--MAINTAINER--
pzn.unixbsd@gmail.com
--End MAINTAINER--

--CONFIGURE_ARGS--

--End CONFIGURE_ARGS--

--CONFIGURE_ENV--
XDG_DATA_HOME=/wrkdirs/usr/ports/sysutils/ods2/work  XDG_CONFIG_HOME=/wrkdirs/usr/ports/sysutils/ods2/work  XDG_CACHE_HOME=/wrkdirs/usr/ports/sysutils/ods2/work/.cache  HOME=/wrkdirs/usr/ports/sysutils/ods2/work TMPDIR="/tmp" PATH=/wrkdirs/usr/ports/sysutils/ods2/work/.bin:/sbin:/bin:/usr/sbin:/usr/bin:/usr/local/sbin:/usr/local/bin:/root/bin PKG_CONFIG_LIBDIR=/wrkdirs/usr/ports/sysutils/ods2/work/.pkgconfig:/usr/local/libdata/pkgconfig:/usr/local/share/pkgconfig:/usr/libdata/pkgconfig SHELL=/bin/sh CONFIG_SHELL=/bin/sh
--End CONFIGURE_ENV--

--MAKE_ENV--
XDG_DATA_HOME=/wrkdirs/usr/ports/sysutils/ods2/work  XDG_CONFIG_HOME=/wrkdirs/usr/ports/sysutils/ods2/work  XDG_CACHE_HOME=/wrkdirs/usr/ports/sysutils/ods2/work/.cache  HOME=/wrkdirs/usr/ports/sysutils/ods2/work TMPDIR="/tmp" PATH=/wrkdirs/usr/ports/sysutils/ods2/work/.bin:/sbin:/bin:/usr/sbin:/usr/bin:/usr/local/sbin:/usr/local/bin:/root/bin PKG_CONFIG_LIBDIR=/wrkdirs/usr/ports/sysutils/ods2/work/.pkgconfig:/usr/local/libdata/pkgconfig:/usr/local/share/pkgconfig:/usr/libdata/pkgconfig MK_DEBUG_FILES=no MK_KERNEL_SYMBOLS=no SHELL=/bin/sh NO_LINT=YES PREFIX=/usr/local  LOCALBASE=/usr/local  CC="cc" CFLAGS="-O2 -pipe  -fstack-protector-strong -fno-strict-aliasing "  CPP="cpp" CPPFLAGS=""  LDFLAGS=" -fstack-protector-strong " LIBS=""  CXX="c++" CXXFLAGS="-O2 -pipe -fstack-protector-strong -fno-strict-aliasing  " BSD_INSTALL_PROGRAM="install  -s -m 555"  BSD_INSTALL_LIB="install  -s -m 0644"  BSD_INSTALL_SCRIPT="install  -m 555"  BSD_INSTALL_DATA="install  -m 0644"  BSD_INSTALL_
MAN="install  -m 444"
--End MAKE_ENV--

--PLIST_SUB--
PORTDOCS="" OSREL=15.0 PREFIX=%D LOCALBASE=/usr/local  RESETPREFIX=/usr/local LIB32DIR=lib DOCSDIR="share/doc/ods2"  EXAMPLESDIR="share/examples/ods2"  DATADIR="share/ods2"  WWWDIR="www/ods2"  ETCDIR="etc/ods2"
--End PLIST_SUB--

--SUB_LIST--
 PREFIX=/usr/local LOCALBASE=/usr/local  DATADIR=/usr/local/share/ods2 DOCSDIR=/usr/local/share/doc/ods2 EXAMPLESDIR=/usr/local/share/examples/ods2  WWWDIR=/usr/local/www/ods2 ETCDIR=/usr/local/etc/ods2
--End SUB_LIST--

---Begin make.conf---
# XXX: We really need this but cannot use it while 'make checksum' does not
# try the next mirror on checksum failure.  It currently retries the same
# failed mirror and then fails rather then trying another.  It *does*
# try the next if the size is mismatched though.
#MASTER_SITE_FREEBSD=yes
# Build ALLOW_MAKE_JOBS_PACKAGES with 3 jobs
MAKE_JOBS_NUMBER=3
USE_PACKAGE_DEPENDS=yes
BATCH=yes
WRKDIRPREFIX=/wrkdirs
PORTSDIR=/usr/ports
PACKAGES=/packages
DISTDIR=/distfiles
PACKAGE_BUILDING=yes
PACKAGE_BUILDING_FLAVORS=yes
####  ####
# XXX: We really need this but cannot use it while 'make checksum' does not
# try the next mirror on checksum failure.  It currently retries the same
# failed mirror and then fails rather then trying another.  It *does*
# try the next if the size is mismatched though.
#MASTER_SITE_FREEBSD=yes
# Build ALLOW_MAKE_JOBS_PACKAGES with 3 jobs
MAKE_JOBS_NUMBER=3
#### Misc Poudriere ####
.include "/etc/make.conf.ports_env"
GID=0
UID=0
---End make.conf---
--Resource limits--
cpu time               (seconds, -t)  unlimited
file size           (512-blocks, -f)  unlimited
data seg size           (kbytes, -d)  33554432
stack size              (kbytes, -s)  524288
core file size      (512-blocks, -c)  unlimited
max memory size         (kbytes, -m)  unlimited
locked memory           (kbytes, -l)  unlimited
max user processes              (-u)  89999
open files                      (-n)  8192
virtual mem size        (kbytes, -v)  unlimited
swap limit              (kbytes, -w)  unlimited
socket buffer size       (bytes, -b)  unlimited
pseudo-terminals                (-p)  unlimited
kqueues                         (-k)  unlimited
umtx shared locks               (-o)  unlimited
--End resource limits--
=======================<phase: check-sanity   >============================
===== env: NO_DEPENDS=yes USER=root UID=0 GID=0
===========================================================================
=======================<phase: pkg-depends    >============================
===== env: USE_PACKAGE_DEPENDS_ONLY=1 USER=root UID=0 GID=0
===>   ods2-1.3_1 depends on file: /usr/local/sbin/pkg - not found
===>   Installing existing package /packages/All/pkg-1.21.3.pkg
[main-amd64-default-job-03] Installing pkg-1.21.3...
[main-amd64-default-job-03] Extracting pkg-1.21.3: .......... done
===>   ods2-1.3_1 depends on file: /usr/local/sbin/pkg - found
===>   Returning to build of ods2-1.3_1
===========================================================================
=======================<phase: fetch-depends  >============================
===== env: USE_PACKAGE_DEPENDS_ONLY=1 USER=root UID=0 GID=0
===========================================================================
=======================<phase: fetch          >============================
===== env: NO_DEPENDS=yes USER=root UID=0 GID=0
===> Fetching all distfiles required by ods2-1.3_1 for building
===========================================================================
=======================<phase: checksum       >============================
===== env: NO_DEPENDS=yes USER=root UID=0 GID=0
===> Fetching all distfiles required by ods2-1.3_1 for building
=> SHA256 Checksum OK for ods2.zip.
===========================================================================
=======================<phase: extract-depends>============================
===== env: USE_PACKAGE_DEPENDS_ONLY=1 USER=root UID=0 GID=0
===========================================================================
=======================<phase: extract        >============================
===== env: NO_DEPENDS=yes USER=root UID=0 GID=0
===> Fetching all distfiles required by ods2-1.3_1 for building
===>  Extracting for ods2-1.3_1
=> SHA256 Checksum OK for ods2.zip.
===========================================================================
=======================<phase: patch-depends  >============================
===== env: USE_PACKAGE_DEPENDS_ONLY=1 USER=root UID=0 GID=0
===========================================================================
=======================<phase: patch          >============================
===== env: NO_DEPENDS=yes USER=root UID=0 GID=0
===>  Patching for ods2-1.3_1
===>  Applying FreeBSD patches for ods2-1.3_1 from /usr/ports/sysutils/ods2/files
===========================================================================
=======================<phase: build-depends  >============================
===== env: USE_PACKAGE_DEPENDS_ONLY=1 USER=root UID=0 GID=0
===========================================================================
=======================<phase: lib-depends    >============================
===== env: USE_PACKAGE_DEPENDS_ONLY=1 USER=root UID=0 GID=0
===========================================================================
=======================<phase: configure      >============================
===== env: NO_DEPENDS=yes USER=root UID=0 GID=0
===>  Configuring for ods2-1.3_1
===========================================================================
=======================<phase: build          >============================
===== env: NO_DEPENDS=yes USER=root UID=0 GID=0
===>  Building for ods2-1.3_1
--- ods2.o ---
--- rms.o ---
--- direct.o ---
--- ods2.o ---
cc -c -O2 -pipe  -fstack-protector-strong -fno-strict-aliasing  "-DVERSION=\"v1.3\"" ods2.c
--- rms.o ---
cc -c -O2 -pipe  -fstack-protector-strong -fno-strict-aliasing  "-DVERSION=\"v1.3\"" rms.c
--- direct.o ---
cc -c -O2 -pipe  -fstack-protector-strong -fno-strict-aliasing  "-DVERSION=\"v1.3\"" direct.c
direct.c:300:46: warning: format specifies type 'int' but the argument has type 'struct dir$rec *' [-Wformat]
  300 |         printf("Splitting record... %d %d\n",dr,de);
      |                                     ~~       ^~
direct.c:300:49: warning: format specifies type 'int' but the argument has type 'struct dir$ent *' [-Wformat]
  300 |         printf("Splitting record... %d %d\n",dr,de);
      |                                        ~~       ^~
direct.c:359:42: warning: format specifies type 'int' but the argument has type 'struct dir$rec *' [-Wformat]
  359 |             printf("Super split %d %d\n",dr,de);
      |                                 ~~       ^~
direct.c:359:45: warning: format specifies type 'int' but the argument has type 'struct dir$ent *' [-Wformat]
  359 |             printf("Super split %d %d\n",dr,de);
      |                                    ~~       ^~
4 warnings generated.
--- update.o ---
cc -c -O2 -pipe  -fstack-protector-strong -fno-strict-aliasing  "-DVERSION=\"v1.3\"" update.c
update.c:273:70: warning: & has lower precedence than ==; == will be evaluated first [-Wparentheses]
  273 |                                 VMSLONG((*headbuff)->fh2$l_filechar) & FH2$M_MARKDEL == 0) {
      |                                                                      ^~~~~~~~~~~~~~~~~~~~
update.c:273:70: note: place parentheses around the '==' expression to silence this warning
  273 |                                 VMSLONG((*headbuff)->fh2$l_filechar) & FH2$M_MARKDEL == 0) {
      |                                                                      ^ ~~~~~~~~~~~~~~~~~~
update.c:273:70: note: place parentheses around the & expression to evaluate it first
  273 |                                 VMSLONG((*headbuff)->fh2$l_filechar) & FH2$M_MARKDEL == 0) {
      |                                 ~~~~~~~~~~~~~~~~~~~~~~~~~~~~~~~~~~~~~^~~~~~~~~~~~~~~
update.c:318:50: warning: format specifies type 'int' but the argument has type 'unsigned int *' [-Wformat]
  318 |     printf("Header %d index %d rvn %d\n",head_no,idxblk,rvn);
      |                             ~~                   ^~~~~~
--- access.o ---
cc -c -O2 -pipe  -fstack-protector-strong -fno-strict-aliasing  "-DVERSION=\"v1.3\"" access.c
--- update.o ---
2 warnings generated.
--- device.o ---
cc -c -O2 -pipe  -fstack-protector-strong -fno-strict-aliasing  "-DVERSION=\"v1.3\"" device.c
--- phyunix.o ---
cc -c -O2 -pipe  -fstack-protector-strong -fno-strict-aliasing  "-DVERSION=\"v1.3\"" phyunix.c
--- cache.o ---
cc -c -O2 -pipe  -fstack-protector-strong -fno-strict-aliasing  "-DVERSION=\"v1.3\"" cache.c
--- phyunix.o ---
phyunix.c:55:10: warning: call to undeclared library function 'strchr' with type 'char *(const char *, int)'; ISO C99 and later do not support implicit function declarations [-Wimplicit-function-declaration]
   55 |     cp = strchr(devbuf,':');
      |          ^
phyunix.c:55:10: note: include the header <string.h> or explicitly provide a declaration for 'strchr'
1 warning generated.
--- vmstime.o ---
cc -c -O2 -pipe  -fstack-protector-strong -fno-strict-aliasing  "-DVERSION=\"v1.3\"" vmstime.c
In file included from vmstime.c:77:
/usr/include/sys/timeb.h:41:2: warning: "this file includes <sys/timeb.h> which is deprecated" [-W#warnings]
   41 | #warning "this file includes <sys/timeb.h> which is deprecated"
      |  ^
1 warning generated.
--- ods2 ---
cc -O2 -pipe  -fstack-protector-strong -fno-strict-aliasing  -oods2 ods2.o rms.o direct.o update.o access.o device.o phyunix.o cache.o vmstime.o -lcompat
ld: error: undefined symbol: ftime
>>> referenced by vmstime.c
>>>               vmstime.o:(sys_gettim)
>>> referenced by vmstime.c
>>>               vmstime.o:(vmstime_day)
>>> did you mean: ctime
>>> defined in: /lib/libc.so.7
cc: error: linker command failed with exit code 1 (use -v to see invocation)
*** [ods2] Error code 1

make: stopped in /wrkdirs/usr/ports/sysutils/ods2/work/ods2-1.3_1
make: 1 error

make: stopped in /wrkdirs/usr/ports/sysutils/ods2/work/ods2-1.3_1
===> Compilation failed unexpectedly.
Try to set MAKE_JOBS_UNSAFE=yes and rebuild before reporting the failure to
the maintainer.
*** Error code 1

Stop.
make: stopped in /usr/ports/sysutils/ods2