[package - 132amd64-quarterly][databases/galera] Failed for galera-25.3.37_5 in build

From: <pkg-fallout_at_FreeBSD.org>
Date: Thu, 20 Jun 2024 01:49:03 UTC
You are receiving this mail as a port that you maintain
is failing to build on the FreeBSD package build server.
Please investigate the failure and submit a PR to fix
build.

Maintainer:     devel@galeracluster.com
Log URL:        https://pkg-status.freebsd.org/beefy14/data/132amd64-quarterly/de15581de1be/logs/galera-25.3.37_5.log
Build URL:      https://pkg-status.freebsd.org/beefy14/build.html?mastername=132amd64-quarterly&build=de15581de1be
Log:

=>> Building databases/galera
build started at Thu Jun 20 01:46:16 UTC 2024
port directory: /usr/ports/databases/galera
package name: galera-25.3.37_5
building for: FreeBSD 132amd64-quarterly-job-03 13.2-RELEASE-p11 FreeBSD 13.2-RELEASE-p11 amd64
maintained by: devel@galeracluster.com
Makefile datestamp: -rw-r--r--  1 root  wheel  1904 Apr  9 01:01 /usr/ports/databases/galera/Makefile
Ports top last git commit: de15581de
Ports top unclean checkout: no
Port dir last git commit: c5cd82114
Port dir unclean checkout: no
Poudriere version: poudriere-git-3.4.1-30-g79e3edcd
Host OSVERSION: 1500018
Jail OSVERSION: 1302001
Job Id: 03

---Begin Environment---
SHELL=/bin/csh
OSVERSION=1302001
UNAME_v=FreeBSD 13.2-RELEASE-p11
UNAME_r=13.2-RELEASE-p11
BLOCKSIZE=K
MAIL=/var/mail/root
MM_CHARSET=UTF-8
LANG=C.UTF-8
STATUS=1
HOME=/root
PATH=/sbin:/bin:/usr/sbin:/usr/bin:/usr/local/sbin:/usr/local/bin:/root/bin
MAKE_OBJDIR_CHECK_WRITABLE=0
LOCALBASE=/usr/local
USER=root
POUDRIERE_NAME=poudriere-git
LIBEXECPREFIX=/usr/local/libexec/poudriere
POUDRIERE_VERSION=3.4.1-30-g79e3edcd
MASTERMNT=/usr/local/poudriere/data/.m/132amd64-quarterly/ref
LC_COLLATE=C
POUDRIERE_BUILD_TYPE=bulk
PACKAGE_BUILDING=yes
SAVED_TERM=
OUTPUT_REDIRECTED_STDERR=4
OUTPUT_REDIRECTED=1
PWD=/usr/local/poudriere/data/.m/132amd64-quarterly/03/.p
OUTPUT_REDIRECTED_STDOUT=3
P_PORTS_FEATURES=FLAVORS SUBPACKAGES SELECTED_OPTIONS
MASTERNAME=132amd64-quarterly
SCRIPTPREFIX=/usr/local/share/poudriere
SCRIPTNAME=bulk.sh
OLDPWD=/usr/local/poudriere/data/.m/132amd64-quarterly/ref/.p/pool
POUDRIERE_PKGNAME=poudriere-git-3.4.1-30-g79e3edcd
SCRIPTPATH=/usr/local/share/poudriere/bulk.sh
POUDRIEREPATH=/usr/local/bin/poudriere
---End Environment---

---Begin Poudriere Port Flags/Env---
PORT_FLAGS=
PKGENV=
FLAVOR=
MAKE_ARGS=
---End Poudriere Port Flags/Env---

---Begin OPTIONS List---
---End OPTIONS List---

--MAINTAINER--
devel@galeracluster.com
--End MAINTAINER--

--CONFIGURE_ARGS--

--End CONFIGURE_ARGS--

--CONFIGURE_ENV--
PYTHON="/usr/local/bin/python3.9" XDG_DATA_HOME=/wrkdirs/usr/ports/databases/galera/work  XDG_CONFIG_HOME=/wrkdirs/usr/ports/databases/galera/work  XDG_CACHE_HOME=/wrkdirs/usr/ports/databases/galera/work/.cache  HOME=/wrkdirs/usr/ports/databases/galera/work TMPDIR="/tmp" PATH=/wrkdirs/usr/ports/databases/galera/work/.bin:/sbin:/bin:/usr/sbin:/usr/bin:/usr/local/sbin:/usr/local/bin:/root/bin PKG_CONFIG_LIBDIR=/wrkdirs/usr/ports/databases/galera/work/.pkgconfig:/usr/local/libdata/pkgconfig:/usr/local/share/pkgconfig:/usr/libdata/pkgconfig SHELL=/bin/sh CONFIG_SHELL=/bin/sh
--End CONFIGURE_ENV--

--MAKE_ENV--
NINJA_STATUS="[%p %s/%t] " OPENSSLBASE=/usr OPENSSLDIR=/etc/ssl OPENSSLINC=/usr/include OPENSSLLIB=/usr/lib XDG_DATA_HOME=/wrkdirs/usr/ports/databases/galera/work  XDG_CONFIG_HOME=/wrkdirs/usr/ports/databases/galera/work  XDG_CACHE_HOME=/wrkdirs/usr/ports/databases/galera/work/.cache  HOME=/wrkdirs/usr/ports/databases/galera/work TMPDIR="/tmp" PATH=/wrkdirs/usr/ports/databases/galera/work/.bin:/sbin:/bin:/usr/sbin:/usr/bin:/usr/local/sbin:/usr/local/bin:/root/bin PKG_CONFIG_LIBDIR=/wrkdirs/usr/ports/databases/galera/work/.pkgconfig:/usr/local/libdata/pkgconfig:/usr/local/share/pkgconfig:/usr/libdata/pkgconfig MK_DEBUG_FILES=no MK_KERNEL_SYMBOLS=no SHELL=/bin/sh NO_LINT=YES DESTDIR=/wrkdirs/usr/ports/databases/galera/work/stage PREFIX=/usr/local  LOCALBASE=/usr/local  CC="cc" CFLAGS="-O2 -pipe  -fstack-protector-strong -fno-strict-aliasing "  CPP="cpp" CPPFLAGS=""  LDFLAGS="  -fstack-protector-strong " LIBS=""  CXX="c++" CXXFLAGS="-O2 -pipe  -fstack-protector-strong -fno-stri
ct-aliasing   -std=c++11 " BSD_INSTALL_PROGRAM="install  -s -m 555"  BSD_INSTALL_LIB="install  -s -m 0644"  BSD_INSTALL_SCRIPT="install  -m 555"  BSD_INSTALL_DATA="install  -m 0644"  BSD_INSTALL_MAN="install  -m 444"
--End MAKE_ENV--

--PLIST_SUB--
PYTHON_INCLUDEDIR=include/python3.9  PYTHON_LIBDIR=lib/python3.9  PYTHON_PLATFORM=freebsd13  PYTHON_SITELIBDIR=lib/python3.9/site-packages  PYTHON_SUFFIX=39  PYTHON_EXT_SUFFIX=.cpython-39  PYTHON_VER=3.9  PYTHON_VERSION=python3.9 PYTHON2="@comment " PYTHON3="" CMAKE_BUILD_TYPE="release" OSREL=13.2 PREFIX=%D LOCALBASE=/usr/local  RESETPREFIX=/usr/local LIB32DIR=lib DOCSDIR="share/doc/galera"  EXAMPLESDIR="share/examples/galera"  DATADIR="share/galera"  WWWDIR="www/galera"  ETCDIR="etc/galera"
--End PLIST_SUB--

--SUB_LIST--
PYTHON_INCLUDEDIR=/usr/local/include/python3.9  PYTHON_LIBDIR=/usr/local/lib/python3.9  PYTHON_PLATFORM=freebsd13  PYTHON_SITELIBDIR=/usr/local/lib/python3.9/site-packages  PYTHON_SUFFIX=39  PYTHON_EXT_SUFFIX=.cpython-39  PYTHON_VER=3.9  PYTHON_VERSION=python3.9 PYTHON2="@comment " PYTHON3="" PREFIX=/usr/local LOCALBASE=/usr/local  DATADIR=/usr/local/share/galera DOCSDIR=/usr/local/share/doc/galera EXAMPLESDIR=/usr/local/share/examples/galera  WWWDIR=/usr/local/www/galera ETCDIR=/usr/local/etc/galera
--End SUB_LIST--

---Begin make.conf---
USE_PACKAGE_DEPENDS=yes
BATCH=yes
WRKDIRPREFIX=/wrkdirs
PORTSDIR=/usr/ports
PACKAGES=/packages
DISTDIR=/distfiles
PACKAGE_BUILDING=yes
PACKAGE_BUILDING_FLAVORS=yes
####  ####
# XXX: We really need this but cannot use it while 'make checksum' does not
# try the next mirror on checksum failure.  It currently retries the same
# failed mirror and then fails rather then trying another.  It *does*
# try the next if the size is mismatched though.
#MASTER_SITE_FREEBSD=yes
# Build ALLOW_MAKE_JOBS_PACKAGES with 3 jobs
MAKE_JOBS_NUMBER=3
#### Misc Poudriere ####
.include "/etc/make.conf.ports_env"
GID=0
UID=0
---End make.conf---
--Resource limits--
cpu time               (seconds, -t)  unlimited
file size           (512-blocks, -f)  unlimited
data seg size           (kbytes, -d)  33554432
stack size              (kbytes, -s)  524288
core file size      (512-blocks, -c)  unlimited
max memory size         (kbytes, -m)  unlimited
locked memory           (kbytes, -l)  unlimited
max user processes              (-u)  89999
open files                      (-n)  8192
virtual mem size        (kbytes, -v)  unlimited
swap limit              (kbytes, -w)  unlimited
socket buffer size       (bytes, -b)  unlimited
pseudo-terminals                (-p)  unlimited
kqueues                         (-k)  unlimited
umtx shared locks               (-o)  unlimited
--End resource limits--
=======================<phase: check-sanity   >============================
===== env: NO_DEPENDS=yes USER=root UID=0 GID=0
===>  License GPLv2 accepted by the user
===========================================================================
=======================<phase: pkg-depends    >============================
===== env: USE_PACKAGE_DEPENDS_ONLY=1 USER=root UID=0 GID=0
===>   galera-25.3.37_5 depends on file: /usr/local/sbin/pkg - not found
===>   Installing existing package /packages/All/pkg-1.21.3.pkg
[132amd64-quarterly-job-03] Installing pkg-1.21.3...
[132amd64-quarterly-job-03] Extracting pkg-1.21.3: .......... done
===>   galera-25.3.37_5 depends on file: /usr/local/sbin/pkg - found
===>   Returning to build of galera-25.3.37_5
===========================================================================
=======================<phase: fetch-depends  >============================
===== env: USE_PACKAGE_DEPENDS_ONLY=1 USER=root UID=0 GID=0
===========================================================================
=======================<phase: fetch          >============================
===== env: NO_DEPENDS=yes USER=root UID=0 GID=0
===>  License GPLv2 accepted by the user
===> Fetching all distfiles required by galera-25.3.37_5 for building
===========================================================================
=======================<phase: checksum       >============================
===== env: NO_DEPENDS=yes USER=root UID=0 GID=0
===>  License GPLv2 accepted by the user
===> Fetching all distfiles required by galera-25.3.37_5 for building
=> SHA256 Checksum OK for codership-galera-release_25.3.37_GH0.tar.gz.
=> SHA256 Checksum OK for codership-wsrep-API-eab2d5d5a31672c0b7d116ef1629ff18392fd7d0_GH0.tar.gz.
===========================================================================
=======================<phase: extract-depends>============================
===== env: USE_PACKAGE_DEPENDS_ONLY=1 USER=root UID=0 GID=0
===========================================================================
=======================<phase: extract        >============================
===== env: NO_DEPENDS=yes USER=root UID=0 GID=0
===>  License GPLv2 accepted by the user
===> Fetching all distfiles required by galera-25.3.37_5 for building
===>  Extracting for galera-25.3.37_5
=> SHA256 Checksum OK for codership-galera-release_25.3.37_GH0.tar.gz.
=> SHA256 Checksum OK for codership-wsrep-API-eab2d5d5a31672c0b7d116ef1629ff18392fd7d0_GH0.tar.gz.
===========================================================================
=======================<phase: patch-depends  >============================
===== env: USE_PACKAGE_DEPENDS_ONLY=1 USER=root UID=0 GID=0
===========================================================================
=======================<phase: patch          >============================
===== env: NO_DEPENDS=yes USER=root UID=0 GID=0
===>  Patching for galera-25.3.37_5
===>  Applying FreeBSD patches for galera-25.3.37_5 from /usr/ports/databases/galera/files
===========================================================================
=======================<phase: build-depends  >============================
===== env: USE_PACKAGE_DEPENDS_ONLY=1 USER=root UID=0 GID=0
===>   galera-25.3.37_5 depends on executable: checkmk - not found
===>   Installing existing package /packages/All/check-0.15.2_1.pkg
[132amd64-quarterly-job-03] Installing check-0.15.2_1...
[132amd64-quarterly-job-03] `-- Installing indexinfo-0.3.1...
[132amd64-quarterly-job-03] `-- Extracting indexinfo-0.3.1: .... done
[132amd64-quarterly-job-03] Extracting check-0.15.2_1: .......... done
===>   galera-25.3.37_5 depends on executable: checkmk - found
===>   Returning to build of galera-25.3.37_5
===>   galera-25.3.37_5 depends on file: /usr/local/include/boost/shared_ptr.hpp - not found
===>   Installing existing package /packages/All/boost-libs-1.84.0.pkg
[132amd64-quarterly-job-03] Installing boost-libs-1.84.0...
[132amd64-quarterly-job-03] `-- Installing icu-74.2_1,1...
[132amd64-quarterly-job-03] `-- Extracting icu-74.2_1,1: .......... done
[132amd64-quarterly-job-03] Extracting boost-libs-1.84.0: .......... done
=====
Message from boost-libs-1.84.0:

--
You have built the Boost library with thread support.

Don't forget to add -pthread to your linker options when
linking your code.
===>   galera-25.3.37_5 depends on file: /usr/local/include/boost/shared_ptr.hpp - found
===>   Returning to build of galera-25.3.37_5
<snip>
In file included from /wrkdirs/usr/ports/databases/galera/work/galera-release_25.3.37/gcs/src/gcs_gcomm.cpp:20:
In file included from /wrkdirs/usr/ports/databases/galera/work/galera-release_25.3.37/gcomm/src/gcomm/transport.hpp:15:
In file included from /wrkdirs/usr/ports/databases/galera/work/galera-release_25.3.37/gcomm/src/gcomm/protolay.hpp:33:
In file included from /usr/local/include/boost/function.hpp:30:
In file included from /usr/local/include/boost/function/detail/prologue.hpp:12:
/usr/local/include/boost/function/detail/requires_cxx11.hpp:18:1: warning: C++03 support was deprecated in Boost.Function 1.82 and will be removed in Boost.Function 1.85. [-W#pragma-messages]
BOOST_PRAGMA_MESSAGE("C++03 support was deprecated in Boost.Function 1.82 and will be removed in Boost.Function 1.85.")
^
/usr/local/include/boost/config/pragma_message.hpp:24:34: note: expanded from macro 'BOOST_PRAGMA_MESSAGE'
# define BOOST_PRAGMA_MESSAGE(x) _Pragma(BOOST_STRINGIZE(message(x)))
                                 ^
<scratch space>:102:2: note: expanded from here
 message("C++03 support was deprecated in Boost.Function 1.82 and will be removed in Boost.Function 1.85.")
 ^
In file included from /wrkdirs/usr/ports/databases/galera/work/galera-release_25.3.37/gcs/src/gcs_gcomm.cpp:20:
In file included from /wrkdirs/usr/ports/databases/galera/work/galera-release_25.3.37/gcomm/src/gcomm/transport.hpp:15:
In file included from /wrkdirs/usr/ports/databases/galera/work/galera-release_25.3.37/gcomm/src/gcomm/protolay.hpp:33:
In file included from /usr/local/include/boost/function.hpp:30:
In file included from /usr/local/include/boost/function/detail/prologue.hpp:19:
In file included from /usr/local/include/boost/mem_fn.hpp:22:
In file included from /usr/local/include/boost/bind/mem_fn.hpp:24:
/usr/local/include/boost/bind/detail/requires_cxx11.hpp:18:1: warning: C++03 support was deprecated in Boost.Bind 1.82 and will be removed in Boost.Bind 1.85. [-W#pragma-messages]
BOOST_PRAGMA_MESSAGE("C++03 support was deprecated in Boost.Bind 1.82 and will be removed in Boost.Bind 1.85.")
^
/usr/local/include/boost/config/pragma_message.hpp:24:34: note: expanded from macro 'BOOST_PRAGMA_MESSAGE'
# define BOOST_PRAGMA_MESSAGE(x) _Pragma(BOOST_STRINGIZE(message(x)))
                                 ^
<scratch space>:18:2: note: expanded from here
 message("C++03 support was deprecated in Boost.Bind 1.82 and will be removed in Boost.Bind 1.85.")
 ^
3 warnings generated.
[ 73% 192/259] : && /usr/local/bin/cmake -E rm -f gcs/src/libgcs4garb.a && /usr/bin/llvm-ar qc gcs/src/libgcs4garb.a  gcs/src/CMakeFiles/gcs4garb.dir/gcs_params.cpp.o gcs/src/CMakeFiles/gcs4garb.dir/gcs_conf.cpp.o gcs/src/CMakeFiles/gcs4garb.dir/gcs_fifo_lite.cpp.o gcs/src/CMakeFiles/gcs4garb.dir/gcs_msg_type.cpp.o gcs/src/CMakeFiles/gcs4garb.dir/gcs_comp_msg.cpp.o gcs/src/CMakeFiles/gcs4garb.dir/gcs_sm.cpp.o gcs/src/CMakeFiles/gcs4garb.dir/gcs_backend.cpp.o gcs/src/CMakeFiles/gcs4garb.dir/gcs_dummy.cpp.o gcs/src/CMakeFiles/gcs4garb.dir/gcs_act_proto.cpp.o gcs/src/CMakeFiles/gcs4garb.dir/gcs_defrag.cpp.o gcs/src/CMakeFiles/gcs4garb.dir/gcs_state_msg.cpp.o gcs/src/CMakeFiles/gcs4garb.dir/gcs_node.cpp.o gcs/src/CMakeFiles/gcs4garb.dir/gcs_group.cpp.o gcs/src/CMakeFiles/gcs4garb.dir/gcs_core.cpp.o gcs/src/CMakeFiles/gcs4garb.dir/gcs_fc.cpp.o gcs/src/CMakeFiles/gcs4garb.dir/gcs.cpp.o gcs/src/CMakeFiles/gcs4garb.dir/gcs_gcomm.cpp.o && /usr/bin/llvm-ranlib gcs/src/libgcs4garb.a && :
[ 73% 193/259] /usr/bin/c++ -DBOOST_DATE_TIME_POSIX_TIME_STD_CONFIG=1 -DGALERA_LOG_H_ENABLE_CXX -DGCS_CORE_TESTING -DGCS_DUMMY_TESTING -DHAVE_ASIO_HPP -DHAVE_BOOST_ARRAY_HPP -DHAVE_BOOST_SHARED_PTR_HPP -DHAVE_BOOST_UNORDERED_MAP_HPP -DHAVE_BYTESWAP_H -DHAVE_COMMON_H -DHAVE_ENDIAN_H -DNDEBUG -DOPENSSL_HAS_SET_ECDH_AUTO -I/wrkdirs/usr/ports/databases/galera/work/galera-release_25.3.37 -I/wrkdirs/usr/ports/databases/galera/work/galera-release_25.3.37/common -I/wrkdirs/usr/ports/databases/galera/work/galera-release_25.3.37/galerautils/src -I/wrkdirs/usr/ports/databases/galera/work/galera-release_25.3.37/gcomm/src -I/wrkdirs/usr/ports/databases/galera/work/galera-release_25.3.37/gcache/src -I/wrkdirs/usr/ports/databases/galera/work/galera-release_25.3.37/gcs/src -I/wrkdirs/usr/ports/databases/galera/work/galera-release_25.3.37/wsrep/src -I/usr/local/include -isystem /wrkdirs/usr/ports/databases/galera/work/galera-release_25.3.37/asio -O2 -pipe  -fstack-protector-strong -fno-stric
t-aliasing   -std=c++11 -Wall -Wextra -Woverloaded-virtual -g -O2 -pipe  -fstack-protector-strong -fno-strict-aliasing   -std=c++11  -DNDEBUG -std=gnu++98 -fPIE -Wno-conversion -Wno-unused-parameter -MD -MT gcs/src/unit_tests/CMakeFiles/gcs_tests.dir/gcs_state_msg_test.cpp.o -MF gcs/src/unit_tests/CMakeFiles/gcs_tests.dir/gcs_state_msg_test.cpp.o.d -o gcs/src/unit_tests/CMakeFiles/gcs_tests.dir/gcs_state_msg_test.cpp.o -c /wrkdirs/usr/ports/databases/galera/work/galera-release_25.3.37/gcs/src/unit_tests/gcs_state_msg_test.cpp
[ 74% 194/259] /usr/bin/c++ -DBOOST_DATE_TIME_POSIX_TIME_STD_CONFIG=1 -DGALERA_LOG_H_ENABLE_CXX -DGCS_CORE_TESTING -DGCS_DUMMY_TESTING -DHAVE_ASIO_HPP -DHAVE_BOOST_ARRAY_HPP -DHAVE_BOOST_SHARED_PTR_HPP -DHAVE_BOOST_UNORDERED_MAP_HPP -DHAVE_BYTESWAP_H -DHAVE_COMMON_H -DHAVE_ENDIAN_H -DNDEBUG -DOPENSSL_HAS_SET_ECDH_AUTO -I/wrkdirs/usr/ports/databases/galera/work/galera-release_25.3.37 -I/wrkdirs/usr/ports/databases/galera/work/galera-release_25.3.37/common -I/wrkdirs/usr/ports/databases/galera/work/galera-release_25.3.37/galerautils/src -I/wrkdirs/usr/ports/databases/galera/work/galera-release_25.3.37/gcomm/src -I/wrkdirs/usr/ports/databases/galera/work/galera-release_25.3.37/gcache/src -I/wrkdirs/usr/ports/databases/galera/work/galera-release_25.3.37/gcs/src -I/wrkdirs/usr/ports/databases/galera/work/galera-release_25.3.37/wsrep/src -I/usr/local/include -isystem /wrkdirs/usr/ports/databases/galera/work/galera-release_25.3.37/asio -O2 -pipe  -fstack-protector-strong -fno-stric
t-aliasing   -std=c++11 -Wall -Wextra -Woverloaded-virtual -g -O2 -pipe  -fstack-protector-strong -fno-strict-aliasing   -std=c++11  -DNDEBUG -std=gnu++98 -fPIE -Wno-conversion -Wno-unused-parameter -MD -MT gcs/src/unit_tests/CMakeFiles/gcs_tests.dir/gcs_backend_test.cpp.o -MF gcs/src/unit_tests/CMakeFiles/gcs_tests.dir/gcs_backend_test.cpp.o.d -o gcs/src/unit_tests/CMakeFiles/gcs_tests.dir/gcs_backend_test.cpp.o -c /wrkdirs/usr/ports/databases/galera/work/galera-release_25.3.37/gcs/src/unit_tests/gcs_backend_test.cpp
[ 74% 195/259] /usr/bin/c++ -DBOOST_DATE_TIME_POSIX_TIME_STD_CONFIG=1 -DGALERA_LOG_H_ENABLE_CXX -DGCS_CORE_TESTING -DGCS_DUMMY_TESTING -DHAVE_ASIO_HPP -DHAVE_BOOST_ARRAY_HPP -DHAVE_BOOST_SHARED_PTR_HPP -DHAVE_BOOST_UNORDERED_MAP_HPP -DHAVE_BYTESWAP_H -DHAVE_COMMON_H -DHAVE_ENDIAN_H -DNDEBUG -DOPENSSL_HAS_SET_ECDH_AUTO -I/wrkdirs/usr/ports/databases/galera/work/galera-release_25.3.37 -I/wrkdirs/usr/ports/databases/galera/work/galera-release_25.3.37/common -I/wrkdirs/usr/ports/databases/galera/work/galera-release_25.3.37/galerautils/src -I/wrkdirs/usr/ports/databases/galera/work/galera-release_25.3.37/gcomm/src -I/wrkdirs/usr/ports/databases/galera/work/galera-release_25.3.37/gcache/src -I/wrkdirs/usr/ports/databases/galera/work/galera-release_25.3.37/gcs/src -I/wrkdirs/usr/ports/databases/galera/work/galera-release_25.3.37/wsrep/src -I/usr/local/include -isystem /wrkdirs/usr/ports/databases/galera/work/galera-release_25.3.37/asio -O2 -pipe  -fstack-protector-strong -fno-stric
t-aliasing   -std=c++11 -Wall -Wextra -Woverloaded-virtual -g -O2 -pipe  -fstack-protector-strong -fno-strict-aliasing   -std=c++11  -DNDEBUG -std=gnu++98 -fPIE -Wno-conversion -Wno-unused-parameter -MD -MT gcs/src/unit_tests/CMakeFiles/gcs_tests.dir/__/gcs_state_msg.cpp.o -MF gcs/src/unit_tests/CMakeFiles/gcs_tests.dir/__/gcs_state_msg.cpp.o.d -o gcs/src/unit_tests/CMakeFiles/gcs_tests.dir/__/gcs_state_msg.cpp.o -c /wrkdirs/usr/ports/databases/galera/work/galera-release_25.3.37/gcs/src/gcs_state_msg.cpp
In file included from /wrkdirs/usr/ports/databases/galera/work/galera-release_25.3.37/gcs/src/gcs_state_msg.cpp:15:
In file included from /wrkdirs/usr/ports/databases/galera/work/galera-release_25.3.37/galerautils/src/gu_serialize.hpp:33:
In file included from /wrkdirs/usr/ports/databases/galera/work/galera-release_25.3.37/galerautils/src/gu_buffer.hpp:14:
In file included from /wrkdirs/usr/ports/databases/galera/work/galera-release_25.3.37/galerautils/src/gu_shared_ptr.hpp:27:
In file included from /usr/local/include/boost/shared_ptr.hpp:17:
In file included from /usr/local/include/boost/smart_ptr/shared_ptr.hpp:17:
/usr/local/include/boost/smart_ptr/detail/requires_cxx11.hpp:19:1: warning: C++03 support was deprecated in Boost.SmartPtr 1.82 and will be removed in Boost.SmartPtr 1.85. [-W#pragma-messages]
BOOST_PRAGMA_MESSAGE("C++03 support was deprecated in Boost.SmartPtr 1.82 and will be removed in Boost.SmartPtr 1.85.")
^
/usr/local/include/boost/config/pragma_message.hpp:24:34: note: expanded from macro 'BOOST_PRAGMA_MESSAGE'
# define BOOST_PRAGMA_MESSAGE(x) _Pragma(BOOST_STRINGIZE(message(x)))
                                 ^
<scratch space>:241:2: note: expanded from here
 message("C++03 support was deprecated in Boost.SmartPtr 1.82 and will be removed in Boost.SmartPtr 1.85.")
 ^
1 warning generated.
[ 74% 196/259] /usr/bin/c++ -DBOOST_DATE_TIME_POSIX_TIME_STD_CONFIG=1 -DGALERA_LOG_H_ENABLE_CXX -DGCS_CORE_TESTING -DGCS_DUMMY_TESTING -DHAVE_ASIO_HPP -DHAVE_BOOST_ARRAY_HPP -DHAVE_BOOST_SHARED_PTR_HPP -DHAVE_BOOST_UNORDERED_MAP_HPP -DHAVE_BYTESWAP_H -DHAVE_COMMON_H -DHAVE_ENDIAN_H -DNDEBUG -DOPENSSL_HAS_SET_ECDH_AUTO -I/wrkdirs/usr/ports/databases/galera/work/galera-release_25.3.37 -I/wrkdirs/usr/ports/databases/galera/work/galera-release_25.3.37/common -I/wrkdirs/usr/ports/databases/galera/work/galera-release_25.3.37/galerautils/src -I/wrkdirs/usr/ports/databases/galera/work/galera-release_25.3.37/gcomm/src -I/wrkdirs/usr/ports/databases/galera/work/galera-release_25.3.37/gcache/src -I/wrkdirs/usr/ports/databases/galera/work/galera-release_25.3.37/gcs/src -I/wrkdirs/usr/ports/databases/galera/work/galera-release_25.3.37/wsrep/src -I/usr/local/include -isystem /wrkdirs/usr/ports/databases/galera/work/galera-release_25.3.37/asio -O2 -pipe  -fstack-protector-strong -fno-stric
t-aliasing   -std=c++11 -Wall -Wextra -Woverloaded-virtual -g -O2 -pipe  -fstack-protector-strong -fno-strict-aliasing   -std=c++11  -DNDEBUG -std=gnu++98 -fPIE -Wno-conversion -Wno-unused-parameter -MD -MT gcs/src/unit_tests/CMakeFiles/gcs_tests.dir/__/gcs_backend.cpp.o -MF gcs/src/unit_tests/CMakeFiles/gcs_tests.dir/__/gcs_backend.cpp.o.d -o gcs/src/unit_tests/CMakeFiles/gcs_tests.dir/__/gcs_backend.cpp.o -c /wrkdirs/usr/ports/databases/galera/work/galera-release_25.3.37/gcs/src/gcs_backend.cpp
[ 75% 197/259] /usr/bin/c++ -DBOOST_DATE_TIME_POSIX_TIME_STD_CONFIG=1 -DGALERA_LOG_H_ENABLE_CXX -DGCS_CORE_TESTING -DGCS_DUMMY_TESTING -DHAVE_ASIO_HPP -DHAVE_BOOST_ARRAY_HPP -DHAVE_BOOST_SHARED_PTR_HPP -DHAVE_BOOST_UNORDERED_MAP_HPP -DHAVE_BYTESWAP_H -DHAVE_COMMON_H -DHAVE_ENDIAN_H -DNDEBUG -DOPENSSL_HAS_SET_ECDH_AUTO -I/wrkdirs/usr/ports/databases/galera/work/galera-release_25.3.37 -I/wrkdirs/usr/ports/databases/galera/work/galera-release_25.3.37/common -I/wrkdirs/usr/ports/databases/galera/work/galera-release_25.3.37/galerautils/src -I/wrkdirs/usr/ports/databases/galera/work/galera-release_25.3.37/gcomm/src -I/wrkdirs/usr/ports/databases/galera/work/galera-release_25.3.37/gcache/src -I/wrkdirs/usr/ports/databases/galera/work/galera-release_25.3.37/gcs/src -I/wrkdirs/usr/ports/databases/galera/work/galera-release_25.3.37/wsrep/src -I/usr/local/include -isystem /wrkdirs/usr/ports/databases/galera/work/galera-release_25.3.37/asio -O2 -pipe  -fstack-protector-strong -fno-stric
t-aliasing   -std=c++11 -Wall -Wextra -Woverloaded-virtual -g -O2 -pipe  -fstack-protector-strong -fno-strict-aliasing   -std=c++11  -DNDEBUG -std=gnu++98 -fPIE -Wno-conversion -Wno-unused-parameter -MD -MT gcs/src/unit_tests/CMakeFiles/gcs_tests.dir/gcs_proto_test.cpp.o -MF gcs/src/unit_tests/CMakeFiles/gcs_tests.dir/gcs_proto_test.cpp.o.d -o gcs/src/unit_tests/CMakeFiles/gcs_tests.dir/gcs_proto_test.cpp.o -c /wrkdirs/usr/ports/databases/galera/work/galera-release_25.3.37/gcs/src/unit_tests/gcs_proto_test.cpp
[ 75% 198/259] /usr/bin/c++ -DBOOST_DATE_TIME_POSIX_TIME_STD_CONFIG=1 -DGALERA_LOG_H_ENABLE_CXX -DGCS_CORE_TESTING -DGCS_DUMMY_TESTING -DHAVE_ASIO_HPP -DHAVE_BOOST_ARRAY_HPP -DHAVE_BOOST_SHARED_PTR_HPP -DHAVE_BOOST_UNORDERED_MAP_HPP -DHAVE_BYTESWAP_H -DHAVE_COMMON_H -DHAVE_ENDIAN_H -DNDEBUG -DOPENSSL_HAS_SET_ECDH_AUTO -I/wrkdirs/usr/ports/databases/galera/work/galera-release_25.3.37 -I/wrkdirs/usr/ports/databases/galera/work/galera-release_25.3.37/common -I/wrkdirs/usr/ports/databases/galera/work/galera-release_25.3.37/galerautils/src -I/wrkdirs/usr/ports/databases/galera/work/galera-release_25.3.37/gcomm/src -I/wrkdirs/usr/ports/databases/galera/work/galera-release_25.3.37/gcache/src -I/wrkdirs/usr/ports/databases/galera/work/galera-release_25.3.37/gcs/src -I/wrkdirs/usr/ports/databases/galera/work/galera-release_25.3.37/wsrep/src -I/usr/local/include -isystem /wrkdirs/usr/ports/databases/galera/work/galera-release_25.3.37/asio -O2 -pipe  -fstack-protector-strong -fno-stric
t-aliasing   -std=c++11 -Wall -Wextra -Woverloaded-virtual -g -O2 -pipe  -fstack-protector-strong -fno-strict-aliasing   -std=c++11  -DNDEBUG -std=gnu++98 -fPIE -Wno-conversion -Wno-unused-parameter -MD -MT gcs/src/unit_tests/CMakeFiles/gcs_tests.dir/__/gcs_act_proto.cpp.o -MF gcs/src/unit_tests/CMakeFiles/gcs_tests.dir/__/gcs_act_proto.cpp.o.d -o gcs/src/unit_tests/CMakeFiles/gcs_tests.dir/__/gcs_act_proto.cpp.o -c /wrkdirs/usr/ports/databases/galera/work/galera-release_25.3.37/gcs/src/gcs_act_proto.cpp
[ 76% 199/259] /usr/bin/c++ -DBOOST_DATE_TIME_POSIX_TIME_STD_CONFIG=1 -DGALERA_LOG_H_ENABLE_CXX -DGCS_CORE_TESTING -DGCS_DUMMY_TESTING -DHAVE_ASIO_HPP -DHAVE_BOOST_ARRAY_HPP -DHAVE_BOOST_SHARED_PTR_HPP -DHAVE_BOOST_UNORDERED_MAP_HPP -DHAVE_BYTESWAP_H -DHAVE_COMMON_H -DHAVE_ENDIAN_H -DNDEBUG -DOPENSSL_HAS_SET_ECDH_AUTO -I/wrkdirs/usr/ports/databases/galera/work/galera-release_25.3.37 -I/wrkdirs/usr/ports/databases/galera/work/galera-release_25.3.37/common -I/wrkdirs/usr/ports/databases/galera/work/galera-release_25.3.37/galerautils/src -I/wrkdirs/usr/ports/databases/galera/work/galera-release_25.3.37/gcomm/src -I/wrkdirs/usr/ports/databases/galera/work/galera-release_25.3.37/gcache/src -I/wrkdirs/usr/ports/databases/galera/work/galera-release_25.3.37/gcs/src -I/wrkdirs/usr/ports/databases/galera/work/galera-release_25.3.37/wsrep/src -I/usr/local/include -isystem /wrkdirs/usr/ports/databases/galera/work/galera-release_25.3.37/asio -O2 -pipe  -fstack-protector-strong -fno-stric
t-aliasing   -std=c++11 -Wall -Wextra -Woverloaded-virtual -g -O2 -pipe  -fstack-protector-strong -fno-strict-aliasing   -std=c++11  -DNDEBUG -std=gnu++98 -fPIE -Wno-conversion -Wno-unused-parameter -MD -MT gcs/src/unit_tests/CMakeFiles/gcs_tests.dir/gcs_defrag_test.cpp.o -MF gcs/src/unit_tests/CMakeFiles/gcs_tests.dir/gcs_defrag_test.cpp.o.d -o gcs/src/unit_tests/CMakeFiles/gcs_tests.dir/gcs_defrag_test.cpp.o -c /wrkdirs/usr/ports/databases/galera/work/galera-release_25.3.37/gcs/src/unit_tests/gcs_defrag_test.cpp
[ 76% 200/259] /usr/bin/c++ -DBOOST_DATE_TIME_POSIX_TIME_STD_CONFIG=1 -DGALERA_LOG_H_ENABLE_CXX -DGCS_CORE_TESTING -DGCS_DUMMY_TESTING -DHAVE_ASIO_HPP -DHAVE_BOOST_ARRAY_HPP -DHAVE_BOOST_SHARED_PTR_HPP -DHAVE_BOOST_UNORDERED_MAP_HPP -DHAVE_BYTESWAP_H -DHAVE_COMMON_H -DHAVE_ENDIAN_H -DNDEBUG -DOPENSSL_HAS_SET_ECDH_AUTO -I/wrkdirs/usr/ports/databases/galera/work/galera-release_25.3.37 -I/wrkdirs/usr/ports/databases/galera/work/galera-release_25.3.37/common -I/wrkdirs/usr/ports/databases/galera/work/galera-release_25.3.37/galerautils/src -I/wrkdirs/usr/ports/databases/galera/work/galera-release_25.3.37/gcomm/src -I/wrkdirs/usr/ports/databases/galera/work/galera-release_25.3.37/gcache/src -I/wrkdirs/usr/ports/databases/galera/work/galera-release_25.3.37/gcs/src -I/wrkdirs/usr/ports/databases/galera/work/galera-release_25.3.37/wsrep/src -I/usr/local/include -isystem /wrkdirs/usr/ports/databases/galera/work/galera-release_25.3.37/asio -O2 -pipe  -fstack-protector-strong -fno-stric
t-aliasing   -std=c++11 -Wall -Wextra -Woverloaded-virtual -g -O2 -pipe  -fstack-protector-strong -fno-strict-aliasing   -std=c++11  -DNDEBUG -std=gnu++98 -fPIE -Wno-conversion -Wno-unused-parameter -MD -MT gcs/src/unit_tests/CMakeFiles/gcs_tests.dir/__/gcs_defrag.cpp.o -MF gcs/src/unit_tests/CMakeFiles/gcs_tests.dir/__/gcs_defrag.cpp.o.d -o gcs/src/unit_tests/CMakeFiles/gcs_tests.dir/__/gcs_defrag.cpp.o -c /wrkdirs/usr/ports/databases/galera/work/galera-release_25.3.37/gcs/src/gcs_defrag.cpp
[ 76% 201/259] /usr/bin/c++ -DBOOST_DATE_TIME_POSIX_TIME_STD_CONFIG=1 -DGALERA_LOG_H_ENABLE_CXX -DGCS_CORE_TESTING -DGCS_DUMMY_TESTING -DHAVE_ASIO_HPP -DHAVE_BOOST_ARRAY_HPP -DHAVE_BOOST_SHARED_PTR_HPP -DHAVE_BOOST_UNORDERED_MAP_HPP -DHAVE_BYTESWAP_H -DHAVE_COMMON_H -DHAVE_ENDIAN_H -DNDEBUG -DOPENSSL_HAS_SET_ECDH_AUTO -I/wrkdirs/usr/ports/databases/galera/work/galera-release_25.3.37 -I/wrkdirs/usr/ports/databases/galera/work/galera-release_25.3.37/common -I/wrkdirs/usr/ports/databases/galera/work/galera-release_25.3.37/galerautils/src -I/wrkdirs/usr/ports/databases/galera/work/galera-release_25.3.37/gcomm/src -I/wrkdirs/usr/ports/databases/galera/work/galera-release_25.3.37/gcache/src -I/wrkdirs/usr/ports/databases/galera/work/galera-release_25.3.37/gcs/src -I/wrkdirs/usr/ports/databases/galera/work/galera-release_25.3.37/wsrep/src -I/usr/local/include -isystem /wrkdirs/usr/ports/databases/galera/work/galera-release_25.3.37/asio -O2 -pipe  -fstack-protector-strong -fno-stric
t-aliasing   -std=c++11 -Wall -Wextra -Woverloaded-virtual -g -O2 -pipe  -fstack-protector-strong -fno-strict-aliasing   -std=c++11  -DNDEBUG -std=gnu++98 -fPIE -Wno-conversion -Wno-unused-parameter -MD -MT gcs/src/unit_tests/CMakeFiles/gcs_tests.dir/gcs_node_test.cpp.o -MF gcs/src/unit_tests/CMakeFiles/gcs_tests.dir/gcs_node_test.cpp.o.d -o gcs/src/unit_tests/CMakeFiles/gcs_tests.dir/gcs_node_test.cpp.o -c /wrkdirs/usr/ports/databases/galera/work/galera-release_25.3.37/gcs/src/unit_tests/gcs_node_test.cpp
[ 77% 202/259] /usr/bin/c++ -DBOOST_DATE_TIME_POSIX_TIME_STD_CONFIG=1 -DGALERA_LOG_H_ENABLE_CXX -DGCS_CORE_TESTING -DGCS_DUMMY_TESTING -DHAVE_ASIO_HPP -DHAVE_BOOST_ARRAY_HPP -DHAVE_BOOST_SHARED_PTR_HPP -DHAVE_BOOST_UNORDERED_MAP_HPP -DHAVE_BYTESWAP_H -DHAVE_COMMON_H -DHAVE_ENDIAN_H -DNDEBUG -DOPENSSL_HAS_SET_ECDH_AUTO -I/wrkdirs/usr/ports/databases/galera/work/galera-release_25.3.37 -I/wrkdirs/usr/ports/databases/galera/work/galera-release_25.3.37/common -I/wrkdirs/usr/ports/databases/galera/work/galera-release_25.3.37/galerautils/src -I/wrkdirs/usr/ports/databases/galera/work/galera-release_25.3.37/gcomm/src -I/wrkdirs/usr/ports/databases/galera/work/galera-release_25.3.37/gcache/src -I/wrkdirs/usr/ports/databases/galera/work/galera-release_25.3.37/gcs/src -I/wrkdirs/usr/ports/databases/galera/work/galera-release_25.3.37/wsrep/src -I/usr/local/include -isystem /wrkdirs/usr/ports/databases/galera/work/galera-release_25.3.37/asio -O2 -pipe  -fstack-protector-strong -fno-stric
t-aliasing   -std=c++11 -Wall -Wextra -Woverloaded-virtual -g -O2 -pipe  -fstack-protector-strong -fno-strict-aliasing   -std=c++11  -DNDEBUG -std=gnu++98 -fPIE -Wno-conversion -Wno-unused-parameter -MD -MT gcs/src/unit_tests/CMakeFiles/gcs_tests.dir/__/gcs_node.cpp.o -MF gcs/src/unit_tests/CMakeFiles/gcs_tests.dir/__/gcs_node.cpp.o.d -o gcs/src/unit_tests/CMakeFiles/gcs_tests.dir/__/gcs_node.cpp.o -c /wrkdirs/usr/ports/databases/galera/work/galera-release_25.3.37/gcs/src/gcs_node.cpp
[ 77% 203/259] /usr/bin/c++ -DBOOST_DATE_TIME_POSIX_TIME_STD_CONFIG=1 -DGALERA_LOG_H_ENABLE_CXX -DGCS_CORE_TESTING -DGCS_DUMMY_TESTING -DHAVE_ASIO_HPP -DHAVE_BOOST_ARRAY_HPP -DHAVE_BOOST_SHARED_PTR_HPP -DHAVE_BOOST_UNORDERED_MAP_HPP -DHAVE_BYTESWAP_H -DHAVE_COMMON_H -DHAVE_ENDIAN_H -DNDEBUG -DOPENSSL_HAS_SET_ECDH_AUTO -I/wrkdirs/usr/ports/databases/galera/work/galera-release_25.3.37 -I/wrkdirs/usr/ports/databases/galera/work/galera-release_25.3.37/common -I/wrkdirs/usr/ports/databases/galera/work/galera-release_25.3.37/galerautils/src -I/wrkdirs/usr/ports/databases/galera/work/galera-release_25.3.37/gcomm/src -I/wrkdirs/usr/ports/databases/galera/work/galera-release_25.3.37/gcache/src -I/wrkdirs/usr/ports/databases/galera/work/galera-release_25.3.37/gcs/src -I/wrkdirs/usr/ports/databases/galera/work/galera-release_25.3.37/wsrep/src -I/usr/local/include -isystem /wrkdirs/usr/ports/databases/galera/work/galera-release_25.3.37/asio -O2 -pipe  -fstack-protector-strong -fno-stric
t-aliasing   -std=c++11 -Wall -Wextra -Woverloaded-virtual -g -O2 -pipe  -fstack-protector-strong -fno-strict-aliasing   -std=c++11  -DNDEBUG -std=gnu++98 -fPIE -Wno-conversion -Wno-unused-parameter -MD -MT gcs/src/unit_tests/CMakeFiles/gcs_tests.dir/gcs_group_test.cpp.o -MF gcs/src/unit_tests/CMakeFiles/gcs_tests.dir/gcs_group_test.cpp.o.d -o gcs/src/unit_tests/CMakeFiles/gcs_tests.dir/gcs_group_test.cpp.o -c /wrkdirs/usr/ports/databases/galera/work/galera-release_25.3.37/gcs/src/unit_tests/gcs_group_test.cpp
[ 77% 204/259] /usr/bin/c++ -DBOOST_DATE_TIME_POSIX_TIME_STD_CONFIG=1 -DGALERA_LOG_H_ENABLE_CXX -DGCS_CORE_TESTING -DGCS_DUMMY_TESTING -DHAVE_ASIO_HPP -DHAVE_BOOST_ARRAY_HPP -DHAVE_BOOST_SHARED_PTR_HPP -DHAVE_BOOST_UNORDERED_MAP_HPP -DHAVE_BYTESWAP_H -DHAVE_COMMON_H -DHAVE_ENDIAN_H -DNDEBUG -DOPENSSL_HAS_SET_ECDH_AUTO -I/wrkdirs/usr/ports/databases/galera/work/galera-release_25.3.37 -I/wrkdirs/usr/ports/databases/galera/work/galera-release_25.3.37/common -I/wrkdirs/usr/ports/databases/galera/work/galera-release_25.3.37/galerautils/src -I/wrkdirs/usr/ports/databases/galera/work/galera-release_25.3.37/gcomm/src -I/wrkdirs/usr/ports/databases/galera/work/galera-release_25.3.37/gcache/src -I/wrkdirs/usr/ports/databases/galera/work/galera-release_25.3.37/gcs/src -I/wrkdirs/usr/ports/databases/galera/work/galera-release_25.3.37/wsrep/src -I/usr/local/include -isystem /wrkdirs/usr/ports/databases/galera/work/galera-release_25.3.37/asio -O2 -pipe  -fstack-protector-strong -fno-stric
t-aliasing   -std=c++11 -Wall -Wextra -Woverloaded-virtual -g -O2 -pipe  -fstack-protector-strong -fno-strict-aliasing   -std=c++11  -DNDEBUG -std=gnu++98 -fPIE -Wno-conversion -Wno-unused-parameter -MD -MT gcs/src/unit_tests/CMakeFiles/gcs_tests.dir/gcs_memb_test.cpp.o -MF gcs/src/unit_tests/CMakeFiles/gcs_tests.dir/gcs_memb_test.cpp.o.d -o gcs/src/unit_tests/CMakeFiles/gcs_tests.dir/gcs_memb_test.cpp.o -c /wrkdirs/usr/ports/databases/galera/work/galera-release_25.3.37/gcs/src/unit_tests/gcs_memb_test.cpp
[ 78% 205/259] /usr/bin/c++ -DBOOST_DATE_TIME_POSIX_TIME_STD_CONFIG=1 -DGALERA_LOG_H_ENABLE_CXX -DGCS_CORE_TESTING -DGCS_DUMMY_TESTING -DHAVE_ASIO_HPP -DHAVE_BOOST_ARRAY_HPP -DHAVE_BOOST_SHARED_PTR_HPP -DHAVE_BOOST_UNORDERED_MAP_HPP -DHAVE_BYTESWAP_H -DHAVE_COMMON_H -DHAVE_ENDIAN_H -DNDEBUG -DOPENSSL_HAS_SET_ECDH_AUTO -I/wrkdirs/usr/ports/databases/galera/work/galera-release_25.3.37 -I/wrkdirs/usr/ports/databases/galera/work/galera-release_25.3.37/common -I/wrkdirs/usr/ports/databases/galera/work/galera-release_25.3.37/galerautils/src -I/wrkdirs/usr/ports/databases/galera/work/galera-release_25.3.37/gcomm/src -I/wrkdirs/usr/ports/databases/galera/work/galera-release_25.3.37/gcache/src -I/wrkdirs/usr/ports/databases/galera/work/galera-release_25.3.37/gcs/src -I/wrkdirs/usr/ports/databases/galera/work/galera-release_25.3.37/wsrep/src -I/usr/local/include -isystem /wrkdirs/usr/ports/databases/galera/work/galera-release_25.3.37/asio -O2 -pipe  -fstack-protector-strong -fno-stric
t-aliasing   -std=c++11 -Wall -Wextra -Woverloaded-virtual -g -O2 -pipe  -fstack-protector-strong -fno-strict-aliasing   -std=c++11  -DNDEBUG -std=gnu++98 -fPIE -Wno-conversion -Wno-unused-parameter -MD -MT gcs/src/unit_tests/CMakeFiles/gcs_tests.dir/gcs_core_test.cpp.o -MF gcs/src/unit_tests/CMakeFiles/gcs_tests.dir/gcs_core_test.cpp.o.d -o gcs/src/unit_tests/CMakeFiles/gcs_tests.dir/gcs_core_test.cpp.o -c /wrkdirs/usr/ports/databases/galera/work/galera-release_25.3.37/gcs/src/unit_tests/gcs_core_test.cpp
[ 78% 206/259] /usr/bin/c++ -DBOOST_DATE_TIME_POSIX_TIME_STD_CONFIG=1 -DGALERA_LOG_H_ENABLE_CXX -DGCS_CORE_TESTING -DGCS_DUMMY_TESTING -DHAVE_ASIO_HPP -DHAVE_BOOST_ARRAY_HPP -DHAVE_BOOST_SHARED_PTR_HPP -DHAVE_BOOST_UNORDERED_MAP_HPP -DHAVE_BYTESWAP_H -DHAVE_COMMON_H -DHAVE_ENDIAN_H -DNDEBUG -DOPENSSL_HAS_SET_ECDH_AUTO -I/wrkdirs/usr/ports/databases/galera/work/galera-release_25.3.37 -I/wrkdirs/usr/ports/databases/galera/work/galera-release_25.3.37/common -I/wrkdirs/usr/ports/databases/galera/work/galera-release_25.3.37/galerautils/src -I/wrkdirs/usr/ports/databases/galera/work/galera-release_25.3.37/gcomm/src -I/wrkdirs/usr/ports/databases/galera/work/galera-release_25.3.37/gcache/src -I/wrkdirs/usr/ports/databases/galera/work/galera-release_25.3.37/gcs/src -I/wrkdirs/usr/ports/databases/galera/work/galera-release_25.3.37/wsrep/src -I/usr/local/include -isystem /wrkdirs/usr/ports/databases/galera/work/galera-release_25.3.37/asio -O2 -pipe  -fstack-protector-strong -fno-stric
t-aliasing   -std=c++11 -Wall -Wextra -Woverloaded-virtual -g -O2 -pipe  -fstack-protector-strong -fno-strict-aliasing   -std=c++11  -DNDEBUG -std=gnu++98 -fPIE -Wno-conversion -Wno-unused-parameter -MD -MT gcs/src/unit_tests/CMakeFiles/gcs_tests.dir/__/gcs_group.cpp.o -MF gcs/src/unit_tests/CMakeFiles/gcs_tests.dir/__/gcs_group.cpp.o.d -o gcs/src/unit_tests/CMakeFiles/gcs_tests.dir/__/gcs_group.cpp.o -c /wrkdirs/usr/ports/databases/galera/work/galera-release_25.3.37/gcs/src/gcs_group.cpp
[ 79% 207/259] /usr/bin/c++ -DBOOST_DATE_TIME_POSIX_TIME_STD_CONFIG=1 -DGALERA_LOG_H_ENABLE_CXX -DGCS_CORE_TESTING -DGCS_DUMMY_TESTING -DHAVE_ASIO_HPP -DHAVE_BOOST_ARRAY_HPP -DHAVE_BOOST_SHARED_PTR_HPP -DHAVE_BOOST_UNORDERED_MAP_HPP -DHAVE_BYTESWAP_H -DHAVE_COMMON_H -DHAVE_ENDIAN_H -DNDEBUG -DOPENSSL_HAS_SET_ECDH_AUTO -I/wrkdirs/usr/ports/databases/galera/work/galera-release_25.3.37 -I/wrkdirs/usr/ports/databases/galera/work/galera-release_25.3.37/common -I/wrkdirs/usr/ports/databases/galera/work/galera-release_25.3.37/galerautils/src -I/wrkdirs/usr/ports/databases/galera/work/galera-release_25.3.37/gcomm/src -I/wrkdirs/usr/ports/databases/galera/work/galera-release_25.3.37/gcache/src -I/wrkdirs/usr/ports/databases/galera/work/galera-release_25.3.37/gcs/src -I/wrkdirs/usr/ports/databases/galera/work/galera-release_25.3.37/wsrep/src -I/usr/local/include -isystem /wrkdirs/usr/ports/databases/galera/work/galera-release_25.3.37/asio -O2 -pipe  -fstack-protector-strong -fno-stric
t-aliasing   -std=c++11 -Wall -Wextra -Woverloaded-virtual -g -O2 -pipe  -fstack-protector-strong -fno-strict-aliasing   -std=c++11  -DNDEBUG -std=gnu++98 -fPIE -Wno-conversion -Wno-unused-parameter -MD -MT gcs/src/unit_tests/CMakeFiles/gcs_tests.dir/__/gcs_msg_type.cpp.o -MF gcs/src/unit_tests/CMakeFiles/gcs_tests.dir/__/gcs_msg_type.cpp.o.d -o gcs/src/unit_tests/CMakeFiles/gcs_tests.dir/__/gcs_msg_type.cpp.o -c /wrkdirs/usr/ports/databases/galera/work/galera-release_25.3.37/gcs/src/gcs_msg_type.cpp
[ 79% 208/259] /usr/bin/c++ -DBOOST_DATE_TIME_POSIX_TIME_STD_CONFIG=1 -DGALERA_LOG_H_ENABLE_CXX -DGCS_CORE_TESTING -DGCS_DUMMY_TESTING -DHAVE_ASIO_HPP -DHAVE_BOOST_ARRAY_HPP -DHAVE_BOOST_SHARED_PTR_HPP -DHAVE_BOOST_UNORDERED_MAP_HPP -DHAVE_BYTESWAP_H -DHAVE_COMMON_H -DHAVE_ENDIAN_H -DNDEBUG -DOPENSSL_HAS_SET_ECDH_AUTO -I/wrkdirs/usr/ports/databases/galera/work/galera-release_25.3.37 -I/wrkdirs/usr/ports/databases/galera/work/galera-release_25.3.37/common -I/wrkdirs/usr/ports/databases/galera/work/galera-release_25.3.37/galerautils/src -I/wrkdirs/usr/ports/databases/galera/work/galera-release_25.3.37/gcomm/src -I/wrkdirs/usr/ports/databases/galera/work/galera-release_25.3.37/gcache/src -I/wrkdirs/usr/ports/databases/galera/work/galera-release_25.3.37/gcs/src -I/wrkdirs/usr/ports/databases/galera/work/galera-release_25.3.37/wsrep/src -I/usr/local/include -isystem /wrkdirs/usr/ports/databases/galera/work/galera-release_25.3.37/asio -O2 -pipe  -fstack-protector-strong -fno-stric
t-aliasing   -std=c++11 -Wall -Wextra -Woverloaded-virtual -g -O2 -pipe  -fstack-protector-strong -fno-strict-aliasing   -std=c++11  -DNDEBUG -std=gnu++98 -fPIE -Wno-conversion -Wno-unused-parameter -MD -MT gcs/src/unit_tests/CMakeFiles/gcs_tests.dir/__/gcs_dummy.cpp.o -MF gcs/src/unit_tests/CMakeFiles/gcs_tests.dir/__/gcs_dummy.cpp.o.d -o gcs/src/unit_tests/CMakeFiles/gcs_tests.dir/__/gcs_dummy.cpp.o -c /wrkdirs/usr/ports/databases/galera/work/galera-release_25.3.37/gcs/src/gcs_dummy.cpp
[ 79% 209/259] /usr/bin/c++ -DBOOST_DATE_TIME_POSIX_TIME_STD_CONFIG=1 -DGALERA_LOG_H_ENABLE_CXX -DGCS_CORE_TESTING -DGCS_DUMMY_TESTING -DHAVE_ASIO_HPP -DHAVE_BOOST_ARRAY_HPP -DHAVE_BOOST_SHARED_PTR_HPP -DHAVE_BOOST_UNORDERED_MAP_HPP -DHAVE_BYTESWAP_H -DHAVE_COMMON_H -DHAVE_ENDIAN_H -DNDEBUG -DOPENSSL_HAS_SET_ECDH_AUTO -I/wrkdirs/usr/ports/databases/galera/work/galera-release_25.3.37 -I/wrkdirs/usr/ports/databases/galera/work/galera-release_25.3.37/common -I/wrkdirs/usr/ports/databases/galera/work/galera-release_25.3.37/galerautils/src -I/wrkdirs/usr/ports/databases/galera/work/galera-release_25.3.37/gcomm/src -I/wrkdirs/usr/ports/databases/galera/work/galera-release_25.3.37/gcache/src -I/wrkdirs/usr/ports/databases/galera/work/galera-release_25.3.37/gcs/src -I/wrkdirs/usr/ports/databases/galera/work/galera-release_25.3.37/wsrep/src -I/usr/local/include -isystem /wrkdirs/usr/ports/databases/galera/work/galera-release_25.3.37/asio -O2 -pipe  -fstack-protector-strong -fno-stric
t-aliasing   -std=c++11 -Wall -Wextra -Woverloaded-virtual -g -O2 -pipe  -fstack-protector-strong -fno-strict-aliasing   -std=c++11  -DNDEBUG -std=gnu++98 -fPIE -Wno-conversion -Wno-unused-parameter -MD -MT gcs/src/unit_tests/CMakeFiles/gcs_tests.dir/__/gcs_core.cpp.o -MF gcs/src/unit_tests/CMakeFiles/gcs_tests.dir/__/gcs_core.cpp.o.d -o gcs/src/unit_tests/CMakeFiles/gcs_tests.dir/__/gcs_core.cpp.o -c /wrkdirs/usr/ports/databases/galera/work/galera-release_25.3.37/gcs/src/gcs_core.cpp
[ 80% 210/259] /usr/bin/c++ -DBOOST_DATE_TIME_POSIX_TIME_STD_CONFIG=1 -DGALERA_LOG_H_ENABLE_CXX -DGCS_CORE_TESTING -DGCS_DUMMY_TESTING -DHAVE_ASIO_HPP -DHAVE_BOOST_ARRAY_HPP -DHAVE_BOOST_SHARED_PTR_HPP -DHAVE_BOOST_UNORDERED_MAP_HPP -DHAVE_BYTESWAP_H -DHAVE_COMMON_H -DHAVE_ENDIAN_H -DNDEBUG -DOPENSSL_HAS_SET_ECDH_AUTO -I/wrkdirs/usr/ports/databases/galera/work/galera-release_25.3.37 -I/wrkdirs/usr/ports/databases/galera/work/galera-release_25.3.37/common -I/wrkdirs/usr/ports/databases/galera/work/galera-release_25.3.37/galerautils/src -I/wrkdirs/usr/ports/databases/galera/work/galera-release_25.3.37/gcomm/src -I/wrkdirs/usr/ports/databases/galera/work/galera-release_25.3.37/gcache/src -I/wrkdirs/usr/ports/databases/galera/work/galera-release_25.3.37/gcs/src -I/wrkdirs/usr/ports/databases/galera/work/galera-release_25.3.37/wsrep/src -I/usr/local/include -isystem /wrkdirs/usr/ports/databases/galera/work/galera-release_25.3.37/asio -O2 -pipe  -fstack-protector-strong -fno-stric
t-aliasing   -std=c++11 -Wall -Wextra -Woverloaded-virtual -g -O2 -pipe  -fstack-protector-strong -fno-strict-aliasing   -std=c++11  -DNDEBUG -std=gnu++98 -fPIE -Wno-conversion -Wno-unused-parameter -MD -MT gcs/src/unit_tests/CMakeFiles/gcs_tests.dir/__/gcs_params.cpp.o -MF gcs/src/unit_tests/CMakeFiles/gcs_tests.dir/__/gcs_params.cpp.o.d -o gcs/src/unit_tests/CMakeFiles/gcs_tests.dir/__/gcs_params.cpp.o -c /wrkdirs/usr/ports/databases/galera/work/galera-release_25.3.37/gcs/src/gcs_params.cpp
[ 80% 211/259] /usr/bin/c++ -DBOOST_DATE_TIME_POSIX_TIME_STD_CONFIG=1 -DGALERA_LOG_H_ENABLE_CXX -DGCS_CORE_TESTING -DGCS_DUMMY_TESTING -DHAVE_ASIO_HPP -DHAVE_BOOST_ARRAY_HPP -DHAVE_BOOST_SHARED_PTR_HPP -DHAVE_BOOST_UNORDERED_MAP_HPP -DHAVE_BYTESWAP_H -DHAVE_COMMON_H -DHAVE_ENDIAN_H -DNDEBUG -DOPENSSL_HAS_SET_ECDH_AUTO -I/wrkdirs/usr/ports/databases/galera/work/galera-release_25.3.37 -I/wrkdirs/usr/ports/databases/galera/work/galera-release_25.3.37/common -I/wrkdirs/usr/ports/databases/galera/work/galera-release_25.3.37/galerautils/src -I/wrkdirs/usr/ports/databases/galera/work/galera-release_25.3.37/gcomm/src -I/wrkdirs/usr/ports/databases/galera/work/galera-release_25.3.37/gcache/src -I/wrkdirs/usr/ports/databases/galera/work/galera-release_25.3.37/gcs/src -I/wrkdirs/usr/ports/databases/galera/work/galera-release_25.3.37/wsrep/src -I/usr/local/include -isystem /wrkdirs/usr/ports/databases/galera/work/galera-release_25.3.37/asio -O2 -pipe  -fstack-protector-strong -fno-stric
t-aliasing   -std=c++11 -Wall -Wextra -Woverloaded-virtual -g -O2 -pipe  -fstack-protector-strong -fno-strict-aliasing   -std=c++11  -DNDEBUG -std=gnu++98 -fPIE -Wno-conversion -Wno-unused-parameter -MD -MT gcs/src/unit_tests/CMakeFiles/gcs_tests.dir/__/gcs_fc.cpp.o -MF gcs/src/unit_tests/CMakeFiles/gcs_tests.dir/__/gcs_fc.cpp.o.d -o gcs/src/unit_tests/CMakeFiles/gcs_tests.dir/__/gcs_fc.cpp.o -c /wrkdirs/usr/ports/databases/galera/work/galera-release_25.3.37/gcs/src/gcs_fc.cpp
[ 81% 212/259] /usr/bin/c++ -DBOOST_DATE_TIME_POSIX_TIME_STD_CONFIG=1 -DGALERA_LOG_H_ENABLE_CXX -DGCS_CORE_TESTING -DGCS_DUMMY_TESTING -DHAVE_ASIO_HPP -DHAVE_BOOST_ARRAY_HPP -DHAVE_BOOST_SHARED_PTR_HPP -DHAVE_BOOST_UNORDERED_MAP_HPP -DHAVE_BYTESWAP_H -DHAVE_COMMON_H -DHAVE_ENDIAN_H -DNDEBUG -DOPENSSL_HAS_SET_ECDH_AUTO -I/wrkdirs/usr/ports/databases/galera/work/galera-release_25.3.37 -I/wrkdirs/usr/ports/databases/galera/work/galera-release_25.3.37/common -I/wrkdirs/usr/ports/databases/galera/work/galera-release_25.3.37/galerautils/src -I/wrkdirs/usr/ports/databases/galera/work/galera-release_25.3.37/gcomm/src -I/wrkdirs/usr/ports/databases/galera/work/galera-release_25.3.37/gcache/src -I/wrkdirs/usr/ports/databases/galera/work/galera-release_25.3.37/gcs/src -I/wrkdirs/usr/ports/databases/galera/work/galera-release_25.3.37/wsrep/src -I/usr/local/include -isystem /wrkdirs/usr/ports/databases/galera/work/galera-release_25.3.37/asio -O2 -pipe  -fstack-protector-strong -fno-stric
t-aliasing   -std=c++11 -Wall -Wextra -Woverloaded-virtual -g -O2 -pipe  -fstack-protector-strong -fno-strict-aliasing   -std=c++11  -DNDEBUG -std=gnu++98 -fPIE -Wno-conversion -Wno-unused-parameter -MD -MT gcs/src/unit_tests/CMakeFiles/gcs_tests.dir/gcs_fc_test.cpp.o -MF gcs/src/unit_tests/CMakeFiles/gcs_tests.dir/gcs_fc_test.cpp.o.d -o gcs/src/unit_tests/CMakeFiles/gcs_tests.dir/gcs_fc_test.cpp.o -c /wrkdirs/usr/ports/databases/galera/work/galera-release_25.3.37/gcs/src/unit_tests/gcs_fc_test.cpp
[ 81% 213/259] /usr/bin/c++ -DBOOST_DATE_TIME_POSIX_TIME_STD_CONFIG=1 -DGALERA_LOG_H_ENABLE_CXX -DGCS_CORE_TESTING -DGCS_DUMMY_TESTING -DHAVE_ASIO_HPP -DHAVE_BOOST_ARRAY_HPP -DHAVE_BOOST_SHARED_PTR_HPP -DHAVE_BOOST_UNORDERED_MAP_HPP -DHAVE_BYTESWAP_H -DHAVE_COMMON_H -DHAVE_ENDIAN_H -DNDEBUG -DOPENSSL_HAS_SET_ECDH_AUTO -I/wrkdirs/usr/ports/databases/galera/work/galera-release_25.3.37 -I/wrkdirs/usr/ports/databases/galera/work/galera-release_25.3.37/common -I/wrkdirs/usr/ports/databases/galera/work/galera-release_25.3.37/galerautils/src -I/wrkdirs/usr/ports/databases/galera/work/galera-release_25.3.37/gcomm/src -I/wrkdirs/usr/ports/databases/galera/work/galera-release_25.3.37/gcache/src -I/wrkdirs/usr/ports/databases/galera/work/galera-release_25.3.37/gcs/src -I/wrkdirs/usr/ports/databases/galera/work/galera-release_25.3.37/wsrep/src -I/usr/local/include -isystem /wrkdirs/usr/ports/databases/galera/work/galera-release_25.3.37/asio -O2 -pipe  -fstack-protector-strong -fno-stric
t-aliasing   -std=c++11 -Wall -Wextra -Woverloaded-virtual -g -O2 -pipe  -fstack-protector-strong -fno-strict-aliasing   -std=c++11  -DNDEBUG -std=gnu++98 -fPIE -Wno-conversion -Wno-unused-parameter -MD -MT gcs/src/unit_tests/CMakeFiles/gcs_tests.dir/__/gcs.cpp.o -MF gcs/src/unit_tests/CMakeFiles/gcs_tests.dir/__/gcs.cpp.o.d -o gcs/src/unit_tests/CMakeFiles/gcs_tests.dir/__/gcs.cpp.o -c /wrkdirs/usr/ports/databases/galera/work/galera-release_25.3.37/gcs/src/gcs.cpp
/wrkdirs/usr/ports/databases/galera/work/galera-release_25.3.37/gcs/src/gcs.cpp:2294:13: warning: use of bitwise '|' with boolean operands [-Wbitwise-instead-of-logical]
    return (gcs_params_register (conf) | gcs_core_register (conf));
           ~^~~~~~~~~~~~~~~~~~~~~~~~~~~~~~~~~~~~~~~~~~~~~~~~~~~~~~
                                       ||
/wrkdirs/usr/ports/databases/galera/work/galera-release_25.3.37/gcs/src/gcs.cpp:2294:13: note: cast one or both operands to int to silence this warning
1 warning generated.
[ 81% 214/259] /usr/bin/c++ -DBOOST_DATE_TIME_POSIX_TIME_STD_CONFIG=1 -DGALERA_REV=\"release_25.3.37\" -DGALERA_VER=\"3.37\" -DHAVE_ASIO_HPP -DHAVE_BOOST_ARRAY_HPP -DHAVE_BOOST_SHARED_PTR_HPP -DHAVE_BOOST_UNORDERED_MAP_HPP -DHAVE_BYTESWAP_H -DHAVE_COMMON_H -DHAVE_ENDIAN_H -DNDEBUG -DOPENSSL_HAS_SET_ECDH_AUTO -I/wrkdirs/usr/ports/databases/galera/work/galera-release_25.3.37 -I/wrkdirs/usr/ports/databases/galera/work/galera-release_25.3.37/common -I/wrkdirs/usr/ports/databases/galera/work/galera-release_25.3.37/galerautils/src -I/wrkdirs/usr/ports/databases/galera/work/galera-release_25.3.37/gcomm/src -I/wrkdirs/usr/ports/databases/galera/work/galera-release_25.3.37/gcache/src -I/wrkdirs/usr/ports/databases/galera/work/galera-release_25.3.37/gcs/src -I/wrkdirs/usr/ports/databases/galera/work/galera-release_25.3.37/wsrep/src -I/usr/local/include -isystem /wrkdirs/usr/ports/databases/galera/work/galera-release_25.3.37/asio -O2 -pipe  -fstack-protector-strong -fno-strict-aliasing
   -std=c++11 -Wall -Wextra -Woverloaded-virtual -g -O2 -pipe  -fstack-protector-strong -fno-strict-aliasing   -std=c++11  -DNDEBUG -std=gnu++98 -fPIE -Wno-conversion -Wno-unused-parameter -MD -MT garb/CMakeFiles/garbd.dir/garb_logger.cpp.o -MF garb/CMakeFiles/garbd.dir/garb_logger.cpp.o.d -o garb/CMakeFiles/garbd.dir/garb_logger.cpp.o -c /wrkdirs/usr/ports/databases/galera/work/galera-release_25.3.37/garb/garb_logger.cpp
[ 82% 215/259] : && /usr/bin/c++ -O2 -pipe  -fstack-protector-strong -fno-strict-aliasing   -std=c++11 -Wall -Wextra -Woverloaded-virtual -g -O2 -pipe  -fstack-protector-strong -fno-strict-aliasing   -std=c++11  -DNDEBUG -fstack-protector-strong gcs/src/unit_tests/CMakeFiles/gcs_tests.dir/gcs_tests.cpp.o gcs/src/unit_tests/CMakeFiles/gcs_tests.dir/gcs_test_utils.cpp.o gcs/src/unit_tests/CMakeFiles/gcs_tests.dir/gcs_fifo_test.cpp.o gcs/src/unit_tests/CMakeFiles/gcs_tests.dir/__/gcs_fifo_lite.cpp.o gcs/src/unit_tests/CMakeFiles/gcs_tests.dir/gcs_sm_test.cpp.o gcs/src/unit_tests/CMakeFiles/gcs_tests.dir/__/gcs_sm.cpp.o gcs/src/unit_tests/CMakeFiles/gcs_tests.dir/gcs_comp_test.cpp.o gcs/src/unit_tests/CMakeFiles/gcs_tests.dir/__/gcs_comp_msg.cpp.o gcs/src/unit_tests/CMakeFiles/gcs_tests.dir/gcs_state_msg_test.cpp.o gcs/src/unit_tests/CMakeFiles/gcs_tests.dir/__/gcs_state_msg.cpp.o gcs/src/unit_tests/CMakeFiles/gcs_tests.dir/gcs_backend_test.cpp.o gcs/src/unit_tests/CMakeFiles/gc
s_tests.dir/__/gcs_backend.cpp.o gcs/src/unit_tests/CMakeFiles/gcs_tests.dir/gcs_proto_test.cpp.o gcs/src/unit_tests/CMakeFiles/gcs_tests.dir/__/gcs_act_proto.cpp.o gcs/src/unit_tests/CMakeFiles/gcs_tests.dir/gcs_defrag_test.cpp.o gcs/src/unit_tests/CMakeFiles/gcs_tests.dir/__/gcs_defrag.cpp.o gcs/src/unit_tests/CMakeFiles/gcs_tests.dir/gcs_node_test.cpp.o gcs/src/unit_tests/CMakeFiles/gcs_tests.dir/__/gcs_node.cpp.o gcs/src/unit_tests/CMakeFiles/gcs_tests.dir/gcs_group_test.cpp.o gcs/src/unit_tests/CMakeFiles/gcs_tests.dir/gcs_memb_test.cpp.o gcs/src/unit_tests/CMakeFiles/gcs_tests.dir/__/gcs_group.cpp.o gcs/src/unit_tests/CMakeFiles/gcs_tests.dir/gcs_core_test.cpp.o gcs/src/unit_tests/CMakeFiles/gcs_tests.dir/__/gcs_core.cpp.o gcs/src/unit_tests/CMakeFiles/gcs_tests.dir/__/gcs_dummy.cpp.o gcs/src/unit_tests/CMakeFiles/gcs_tests.dir/__/gcs_msg_type.cpp.o gcs/src/unit_tests/CMakeFiles/gcs_tests.dir/__/gcs.cpp.o gcs/src/unit_tests/CMakeFiles/gcs_tests.dir/__/gcs_params.cpp.o 
gcs/src/unit_tests/CMakeFiles/gcs_tests.dir/gcs_fc_test.cpp.o gcs/src/unit_tests/CMakeFiles/gcs_tests.dir/__/gcs_fc.cpp.o -o gcs/src/unit_tests/gcs_tests  -Wl,-rpath,/usr/local/lib  gcache/src/libgcache.a  /usr/local/lib/libcheck.so  -lm  -lpthread  -lrt  galerautils/src/libgalerautilsxx.a  galerautils/src/libgalerautils.a  galerautils/src/libgalerautils_hw_crc32c.a  galerautils/src/libgalerautils_log.a  -lssl  -lcrypto  -lpthread  -lrt && :
[ 82% 216/259] /usr/bin/c++ -DBOOST_DATE_TIME_POSIX_TIME_STD_CONFIG=1 -DGALERA_REV=\"release_25.3.37\" -DGALERA_VER=\"3.37\" -DHAVE_ASIO_HPP -DHAVE_BOOST_ARRAY_HPP -DHAVE_BOOST_SHARED_PTR_HPP -DHAVE_BOOST_UNORDERED_MAP_HPP -DHAVE_BYTESWAP_H -DHAVE_COMMON_H -DHAVE_ENDIAN_H -DNDEBUG -DOPENSSL_HAS_SET_ECDH_AUTO -I/wrkdirs/usr/ports/databases/galera/work/galera-release_25.3.37 -I/wrkdirs/usr/ports/databases/galera/work/galera-release_25.3.37/common -I/wrkdirs/usr/ports/databases/galera/work/galera-release_25.3.37/galerautils/src -I/wrkdirs/usr/ports/databases/galera/work/galera-release_25.3.37/gcomm/src -I/wrkdirs/usr/ports/databases/galera/work/galera-release_25.3.37/gcache/src -I/wrkdirs/usr/ports/databases/galera/work/galera-release_25.3.37/gcs/src -I/wrkdirs/usr/ports/databases/galera/work/galera-release_25.3.37/wsrep/src -I/usr/local/include -isystem /wrkdirs/usr/ports/databases/galera/work/galera-release_25.3.37/asio -O2 -pipe  -fstack-protector-strong -fno-strict-aliasing
   -std=c++11 -Wall -Wextra -Woverloaded-virtual -g -O2 -pipe  -fstack-protector-strong -fno-strict-aliasing   -std=c++11  -DNDEBUG -std=gnu++98 -fPIE -Wno-conversion -Wno-unused-parameter -MD -MT garb/CMakeFiles/garbd.dir/garb_config.cpp.o -MF garb/CMakeFiles/garbd.dir/garb_config.cpp.o.d -o garb/CMakeFiles/garbd.dir/garb_config.cpp.o -c /wrkdirs/usr/ports/databases/galera/work/galera-release_25.3.37/garb/garb_config.cpp
FAILED: garb/CMakeFiles/garbd.dir/garb_config.cpp.o 
/usr/bin/c++ -DBOOST_DATE_TIME_POSIX_TIME_STD_CONFIG=1 -DGALERA_REV=\"release_25.3.37\" -DGALERA_VER=\"3.37\" -DHAVE_ASIO_HPP -DHAVE_BOOST_ARRAY_HPP -DHAVE_BOOST_SHARED_PTR_HPP -DHAVE_BOOST_UNORDERED_MAP_HPP -DHAVE_BYTESWAP_H -DHAVE_COMMON_H -DHAVE_ENDIAN_H -DNDEBUG -DOPENSSL_HAS_SET_ECDH_AUTO -I/wrkdirs/usr/ports/databases/galera/work/galera-release_25.3.37 -I/wrkdirs/usr/ports/databases/galera/work/galera-release_25.3.37/common -I/wrkdirs/usr/ports/databases/galera/work/galera-release_25.3.37/galerautils/src -I/wrkdirs/usr/ports/databases/galera/work/galera-release_25.3.37/gcomm/src -I/wrkdirs/usr/ports/databases/galera/work/galera-release_25.3.37/gcache/src -I/wrkdirs/usr/ports/databases/galera/work/galera-release_25.3.37/gcs/src -I/wrkdirs/usr/ports/databases/galera/work/galera-release_25.3.37/wsrep/src -I/usr/local/include -isystem /wrkdirs/usr/ports/databases/galera/work/galera-release_25.3.37/asio -O2 -pipe  -fstack-protector-strong -fno-strict-aliasing   -std=c++11 -
Wall -Wextra -Woverloaded-virtual -g -O2 -pipe  -fstack-protector-strong -fno-strict-aliasing   -std=c++11  -DNDEBUG -std=gnu++98 -fPIE -Wno-conversion -Wno-unused-parameter -MD -MT garb/CMakeFiles/garbd.dir/garb_config.cpp.o -MF garb/CMakeFiles/garbd.dir/garb_config.cpp.o.d -o garb/CMakeFiles/garbd.dir/garb_config.cpp.o -c /wrkdirs/usr/ports/databases/galera/work/galera-release_25.3.37/garb/garb_config.cpp
In file included from /wrkdirs/usr/ports/databases/galera/work/galera-release_25.3.37/garb/garb_config.cpp:12:
In file included from /usr/local/include/boost/program_options.hpp:15:
In file included from /usr/local/include/boost/program_options/options_description.hpp:13:
In file included from /usr/local/include/boost/program_options/value_semantic.hpp:12:
In file included from /usr/local/include/boost/any.hpp:21:
/usr/local/include/boost/any/bad_any_cast.hpp:35:57: warning: 'override' keyword is a C++11 extension [-Wc++11-extensions]
    const char * what() const BOOST_NOEXCEPT_OR_NOTHROW override
                                                        ^
In file included from /wrkdirs/usr/ports/databases/galera/work/galera-release_25.3.37/garb/garb_config.cpp:12:
In file included from /usr/local/include/boost/program_options.hpp:15:
In file included from /usr/local/include/boost/program_options/options_description.hpp:13:
In file included from /usr/local/include/boost/program_options/value_semantic.hpp:12:
In file included from /usr/local/include/boost/any.hpp:22:
/usr/local/include/boost/any/fwd.hpp:28:102: error: expected '(' for function-style cast or type construction
template<std::size_t OptimizeForSize = sizeof(void*), std::size_t OptimizeForAlignment = alignof(void*)>
                                                                                                 ~~~~^
/usr/local/include/boost/any/fwd.hpp:28:103: error: expected expression
template<std::size_t OptimizeForSize = sizeof(void*), std::size_t OptimizeForAlignment = alignof(void*)>
                                                                                                      ^
/usr/local/include/boost/any/fwd.hpp:28:67: error: template parameter missing a default argument
template<std::size_t OptimizeForSize = sizeof(void*), std::size_t OptimizeForAlignment = alignof(void*)>
                                                                  ^
/usr/local/include/boost/any/fwd.hpp:28:40: note: previous default template argument defined here
template<std::size_t OptimizeForSize = sizeof(void*), std::size_t OptimizeForAlignment = alignof(void*)>
                                       ^
In file included from /wrkdirs/usr/ports/databases/galera/work/galera-release_25.3.37/garb/garb_config.cpp:12:
In file included from /usr/local/include/boost/program_options.hpp:15:
In file included from /usr/local/include/boost/program_options/options_description.hpp:13:
In file included from /usr/local/include/boost/program_options/value_semantic.hpp:12:
In file included from /usr/local/include/boost/any.hpp:23:
In file included from /usr/local/include/boost/any/detail/placeholder.hpp:15:
In file included from /usr/local/include/boost/type_index.hpp:29:
In file included from /usr/local/include/boost/type_index/stl_type_index.hpp:22:
/usr/local/include/boost/type_index/type_index_facade.hpp:59:58: error: expected ';' at end of declaration list
    BOOST_CXX14_CONSTEXPR const Derived & derived() const noexcept {
                                                         ^
                                                         ;
/usr/local/include/boost/type_index/type_index_facade.hpp:68:36: error: expected ';' at end of declaration list
    inline const char* name() const noexcept {
                                   ^
                                   ;
/usr/local/include/boost/type_index/type_index_facade.hpp:148:145: error: expected ';' at end of declaration
BOOST_CXX14_CONSTEXPR inline bool operator == (const type_index_facade<Derived, TypeInfo>& lhs, const type_index_facade<Derived, TypeInfo>& rhs) noexcept {
                                                                                                                                                ^
                                                                                                                                                ;
/usr/local/include/boost/type_index/type_index_facade.hpp:148:146: error: C++ requires a type specifier for all declarations
BOOST_CXX14_CONSTEXPR inline bool operator == (const type_index_facade<Derived, TypeInfo>& lhs, const type_index_facade<Derived, TypeInfo>& rhs) noexcept {
                                                                                                                                                 ^
/usr/local/include/boost/type_index/type_index_facade.hpp:148:154: error: expected ';' after top level declarator
BOOST_CXX14_CONSTEXPR inline bool operator == (const type_index_facade<Derived, TypeInfo>& lhs, const type_index_facade<Derived, TypeInfo>& rhs) noexcept {
                                                                                                                                                         ^
                                                                                                                                                         ;
In file included from /wrkdirs/usr/ports/databases/galera/work/galera-release_25.3.37/garb/garb_config.cpp:12:
In file included from /usr/local/include/boost/program_options.hpp:15:
In file included from /usr/local/include/boost/program_options/options_description.hpp:13:
In file included from /usr/local/include/boost/program_options/value_semantic.hpp:12:
In file included from /usr/local/include/boost/any.hpp:23:
In file included from /usr/local/include/boost/any/detail/placeholder.hpp:15:
In file included from /usr/local/include/boost/type_index.hpp:29:
/usr/local/include/boost/type_index/stl_type_index.hpp:68:28: error: expected ';' at end of declaration list
    inline stl_type_index() noexcept
                           ^
                           ;
/usr/local/include/boost/type_index/stl_type_index.hpp:78:41: error: expected ';' at end of declaration list
    inline const char*  raw_name() const noexcept;
                                        ^
                                        ;
/usr/local/include/boost/type_index/stl_type_index.hpp:79:37: error: expected ';' at end of declaration list
    inline const char*  name() const noexcept;
                                    ^
                                    ;
/usr/local/include/boost/type_index/stl_type_index.hpp:82:42: error: expected ';' at end of declaration list
    inline std::size_t  hash_code() const noexcept;
                                         ^
                                         ;
/usr/local/include/boost/type_index/stl_type_index.hpp:83:63: error: expected ';' at end of declaration list
    inline bool         equal(const stl_type_index& rhs) const noexcept;
                                                              ^
                                                              ;
/usr/local/include/boost/type_index/stl_type_index.hpp:84:64: error: expected ';' at end of declaration list
    inline bool         before(const stl_type_index& rhs) const noexcept;
                                                               ^
                                                               ;
/usr/local/include/boost/type_index/stl_type_index.hpp:87:43: error: expected ';' at end of declaration list
    inline static stl_type_index type_id() noexcept;
                                          ^
                                          ;
/usr/local/include/boost/type_index/stl_type_index.hpp:90:52: error: expected ';' at end of declaration list
    inline static stl_type_index type_id_with_cvr() noexcept;
                                                   ^
                                                   ;
/usr/local/include/boost/type_index/stl_type_index.hpp:93:65: error: expected ';' at end of declaration list
    inline static stl_type_index type_id_runtime(const T& value) noexcept;
                                                                ^
                                                                ;
/usr/local/include/boost/type_index/stl_type_index.hpp:96:77: error: expected function body after function declarator
inline const stl_type_index::type_info_t& stl_type_index::type_info() const noexcept {
                                                                            ^
In file included from /wrkdirs/usr/ports/databases/galera/work/galera-release_25.3.37/garb/garb_config.cpp:12:
In file included from /usr/local/include/boost/program_options.hpp:15:
In file included from /usr/local/include/boost/program_options/options_description.hpp:13:
In file included from /usr/local/include/boost/program_options/value_semantic.hpp:12:
In file included from /usr/local/include/boost/any.hpp:23:
In file included from /usr/local/include/boost/any/detail/placeholder.hpp:15:
/usr/local/include/boost/type_index.hpp:211:28: error: expected ';' at end of declaration
inline type_index type_id() noexcept {
                           ^
                           ;
fatal error: too many errors emitted, stopping now [-ferror-limit=]
1 warning and 20 errors generated.
[ 83% 216/259] /usr/bin/c++ -DBOOST_DATE_TIME_POSIX_TIME_STD_CONFIG=1 -DGALERA_REV=\"release_25.3.37\" -DGALERA_VER=\"3.37\" -DHAVE_ASIO_HPP -DHAVE_BOOST_ARRAY_HPP -DHAVE_BOOST_SHARED_PTR_HPP -DHAVE_BOOST_UNORDERED_MAP_HPP -DHAVE_BYTESWAP_H -DHAVE_COMMON_H -DHAVE_ENDIAN_H -DNDEBUG -DOPENSSL_HAS_SET_ECDH_AUTO -I/wrkdirs/usr/ports/databases/galera/work/galera-release_25.3.37 -I/wrkdirs/usr/ports/databases/galera/work/galera-release_25.3.37/common -I/wrkdirs/usr/ports/databases/galera/work/galera-release_25.3.37/galerautils/src -I/wrkdirs/usr/ports/databases/galera/work/galera-release_25.3.37/gcomm/src -I/wrkdirs/usr/ports/databases/galera/work/galera-release_25.3.37/gcache/src -I/wrkdirs/usr/ports/databases/galera/work/galera-release_25.3.37/gcs/src -I/wrkdirs/usr/ports/databases/galera/work/galera-release_25.3.37/wsrep/src -I/usr/local/include -isystem /wrkdirs/usr/ports/databases/galera/work/galera-release_25.3.37/asio -O2 -pipe  -fstack-protector-strong -fno-strict-aliasing
   -std=c++11 -Wall -Wextra -Woverloaded-virtual -g -O2 -pipe  -fstack-protector-strong -fno-strict-aliasing   -std=c++11  -DNDEBUG -std=gnu++98 -fPIE -Wno-conversion -Wno-unused-parameter -MD -MT garb/CMakeFiles/garbd.dir/garb_gcs.cpp.o -MF garb/CMakeFiles/garbd.dir/garb_gcs.cpp.o.d -o garb/CMakeFiles/garbd.dir/garb_gcs.cpp.o -c /wrkdirs/usr/ports/databases/galera/work/galera-release_25.3.37/garb/garb_gcs.cpp
[ 83% 216/259] /usr/bin/c++ -DBOOST_DATE_TIME_POSIX_TIME_STD_CONFIG=1 -DGALERA_REV=\"release_25.3.37\" -DGALERA_VER=\"3.37\" -DHAVE_ASIO_HPP -DHAVE_BOOST_ARRAY_HPP -DHAVE_BOOST_SHARED_PTR_HPP -DHAVE_BOOST_UNORDERED_MAP_HPP -DHAVE_BYTESWAP_H -DHAVE_COMMON_H -DHAVE_ENDIAN_H -DNDEBUG -DOPENSSL_HAS_SET_ECDH_AUTO -I/wrkdirs/usr/ports/databases/galera/work/galera-release_25.3.37 -I/wrkdirs/usr/ports/databases/galera/work/galera-release_25.3.37/common -I/wrkdirs/usr/ports/databases/galera/work/galera-release_25.3.37/galerautils/src -I/wrkdirs/usr/ports/databases/galera/work/galera-release_25.3.37/gcomm/src -I/wrkdirs/usr/ports/databases/galera/work/galera-release_25.3.37/gcache/src -I/wrkdirs/usr/ports/databases/galera/work/galera-release_25.3.37/gcs/src -I/wrkdirs/usr/ports/databases/galera/work/galera-release_25.3.37/wsrep/src -I/usr/local/include -isystem /wrkdirs/usr/ports/databases/galera/work/galera-release_25.3.37/asio -O2 -pipe  -fstack-protector-strong -fno-strict-aliasing
   -std=c++11 -Wall -Wextra -Woverloaded-virtual -g -O2 -pipe  -fstack-protector-strong -fno-strict-aliasing   -std=c++11  -DNDEBUG -std=gnu++98 -fPIE -Wno-conversion -Wno-unused-parameter -MD -MT garb/CMakeFiles/garbd.dir/garb_recv_loop.cpp.o -MF garb/CMakeFiles/garbd.dir/garb_recv_loop.cpp.o.d -o garb/CMakeFiles/garbd.dir/garb_recv_loop.cpp.o -c /wrkdirs/usr/ports/databases/galera/work/galera-release_25.3.37/garb/garb_recv_loop.cpp
ninja: build stopped: subcommand failed.
===> Compilation failed unexpectedly.
Try to set MAKE_JOBS_UNSAFE=yes and rebuild before reporting the failure to
the maintainer.
*** Error code 1

Stop.
make: stopped in /usr/ports/databases/galera