[package - 140i386-default][emulators/virtualbox-ose-additions-legacy] Failed for virtualbox-ose-additions-legacy-5.2.44_5 in build

From: <pkg-fallout_at_FreeBSD.org>
Date: Sat, 15 Jun 2024 03:45:37 UTC
You are receiving this mail as a port that you maintain
is failing to build on the FreeBSD package build server.
Please investigate the failure and submit a PR to fix
build.

Maintainer:     vbox@FreeBSD.org
Log URL:        https://pkg-status.freebsd.org/beefy21/data/140i386-default/ffe9487476ba/logs/virtualbox-ose-additions-legacy-5.2.44_5.log
Build URL:      https://pkg-status.freebsd.org/beefy21/build.html?mastername=140i386-default&build=ffe9487476ba
Log:

=>> Building emulators/virtualbox-ose-additions-legacy
build started at Sat Jun 15 03:44:20 UTC 2024
port directory: /usr/ports/emulators/virtualbox-ose-additions-legacy
package name: virtualbox-ose-additions-legacy-5.2.44_5
building for: FreeBSD 140i386-default-job-18 14.0-RELEASE-p6 FreeBSD 14.0-RELEASE-p6 i386
maintained by: vbox@FreeBSD.org
Makefile datestamp: -rw-r--r--  1 root wheel 5612 May 21 01:01 /usr/ports/emulators/virtualbox-ose-additions-legacy/Makefile
Ports top last git commit: ffe948747
Ports top unclean checkout: no
Port dir last git commit: a40e26254
Port dir unclean checkout: no
Poudriere version: poudriere-git-3.4.1-30-g79e3edcd
Host OSVERSION: 1500018
Jail OSVERSION: 1400097
Job Id: 18

---Begin Environment---
SHELL=/bin/sh
BLOCKSIZE=K
MAIL=/var/mail/root
MM_CHARSET=UTF-8
LANG=C.UTF-8
OSVERSION=1400097
STATUS=1
HOME=/root
PATH=/sbin:/bin:/usr/sbin:/usr/bin:/usr/local/sbin:/usr/local/bin:/root/bin
MAKE_OBJDIR_CHECK_WRITABLE=0
UNAME_m=i386
UNAME_p=i386
UNAME_r=14.0-RELEASE-p6
LOCALBASE=/usr/local
UNAME_v=FreeBSD 14.0-RELEASE-p6
USER=root
POUDRIERE_NAME=poudriere-git
LIBEXECPREFIX=/usr/local/libexec/poudriere
POUDRIERE_VERSION=3.4.1-30-g79e3edcd
MASTERMNT=/usr/local/poudriere/data/.m/140i386-default/ref
LC_COLLATE=C
POUDRIERE_BUILD_TYPE=bulk
PACKAGE_BUILDING=yes
SAVED_TERM=
OUTPUT_REDIRECTED_STDERR=4
OUTPUT_REDIRECTED=1
PWD=/usr/local/poudriere/data/.m/140i386-default/18/.p
OUTPUT_REDIRECTED_STDOUT=3
P_PORTS_FEATURES=FLAVORS SUBPACKAGES SELECTED_OPTIONS
MASTERNAME=140i386-default
SCRIPTPREFIX=/usr/local/share/poudriere
SCRIPTNAME=bulk.sh
OLDPWD=/usr/local/poudriere/data/.m/140i386-default/ref/.p/pool
POUDRIERE_PKGNAME=poudriere-git-3.4.1-30-g79e3edcd
SCRIPTPATH=/usr/local/share/poudriere/bulk.sh
POUDRIEREPATH=/usr/local/bin/poudriere
---End Environment---

---Begin Poudriere Port Flags/Env---
PORT_FLAGS=
PKGENV=
FLAVOR=
MAKE_ARGS=
---End Poudriere Port Flags/Env---

---Begin OPTIONS List---
===> The following configuration options are available for virtualbox-ose-additions-legacy-5.2.44_5:
     DBUS=on: D-Bus IPC system support
     DEBUG=off: Build with debugging support
     X11=on: X11 (graphics) support
===> Use 'make config' to modify these settings
---End OPTIONS List---

--MAINTAINER--
vbox@FreeBSD.org
--End MAINTAINER--

--CONFIGURE_ARGS--
--disable-alsa  --disable-docs  --disable-libvpx  --disable-opengl  --disable-pulse  --disable-python  --disable-sdl-ttf  --disable-xpcom --nofatal --with-gcc="cc" --with-g++="c++"
--End CONFIGURE_ARGS--

--CONFIGURE_ENV--
PKG_CONFIG=pkgconf XDG_DATA_HOME=/wrkdirs/usr/ports/emulators/virtualbox-ose-additions-legacy/work  XDG_CONFIG_HOME=/wrkdirs/usr/ports/emulators/virtualbox-ose-additions-legacy/work  XDG_CACHE_HOME=/wrkdirs/usr/ports/emulators/virtualbox-ose-additions-legacy/work/.cache  HOME=/wrkdirs/usr/ports/emulators/virtualbox-ose-additions-legacy/work TMPDIR="/tmp" PATH=/wrkdirs/usr/ports/emulators/virtualbox-ose-additions-legacy/work/.bin:/sbin:/bin:/usr/sbin:/usr/bin:/usr/local/sbin:/usr/local/bin:/root/bin PKG_CONFIG_LIBDIR=/wrkdirs/usr/ports/emulators/virtualbox-ose-additions-legacy/work/.pkgconfig:/usr/local/libdata/pkgconfig:/usr/local/share/pkgconfig:/usr/libdata/pkgconfig SHELL=/bin/sh CONFIG_SHELL=/bin/sh
--End CONFIGURE_ENV--

--MAKE_ENV--
KMODDIR="/boot/modules" SYSDIR="/usr/src/sys" NO_XREF=yes XDG_DATA_HOME=/wrkdirs/usr/ports/emulators/virtualbox-ose-additions-legacy/work  XDG_CONFIG_HOME=/wrkdirs/usr/ports/emulators/virtualbox-ose-additions-legacy/work  XDG_CACHE_HOME=/wrkdirs/usr/ports/emulators/virtualbox-ose-additions-legacy/work/.cache  HOME=/wrkdirs/usr/ports/emulators/virtualbox-ose-additions-legacy/work TMPDIR="/tmp" PATH=/wrkdirs/usr/ports/emulators/virtualbox-ose-additions-legacy/work/.bin:/sbin:/bin:/usr/sbin:/usr/bin:/usr/local/sbin:/usr/local/bin:/root/bin PKG_CONFIG_LIBDIR=/wrkdirs/usr/ports/emulators/virtualbox-ose-additions-legacy/work/.pkgconfig:/usr/local/libdata/pkgconfig:/usr/local/share/pkgconfig:/usr/libdata/pkgconfig MK_DEBUG_FILES=no MK_KERNEL_SYMBOLS=no SHELL=/bin/sh NO_LINT=YES PREFIX=/usr/local  LOCALBASE=/usr/local  CC="cc" CFLAGS="-O2 -pipe  -DLIBICONV_PLUG -fno-strict-aliasing "  CPP="cpp" CPPFLAGS="-DLIBICONV_PLUG"  LDFLAGS=" " LIBS=""  CXX="c++" CXXFLAGS="-O2 -pipe -DLIBICONV
_PLUG -fno-strict-aliasing  -DLIBICONV_PLUG " BSD_INSTALL_PROGRAM="install  -s -m 555"  BSD_INSTALL_LIB="install  -s -m 0644"  BSD_INSTALL_SCRIPT="install  -m 555"  BSD_INSTALL_DATA="install  -m 0644"  BSD_INSTALL_MAN="install  -m 444"
--End MAKE_ENV--

--PLIST_SUB--
 DBUS="" NO_DBUS="@comment " DEBUG="@comment " NO_DEBUG="" X11="" NO_X11="@comment " KMODDIR="boot/modules" OSREL=14.0 PREFIX=%D LOCALBASE=/usr/local  RESETPREFIX=/usr/local LIB32DIR=lib DOCSDIR="share/doc/virtualbox-ose"  EXAMPLESDIR="share/examples/virtualbox-ose"  DATADIR="share/virtualbox-ose"  WWWDIR="www/virtualbox-ose"  ETCDIR="etc/virtualbox-ose"
--End PLIST_SUB--

--SUB_LIST--
 DBUS="" NO_DBUS="@comment " DEBUG="@comment " NO_DEBUG="" X11="" NO_X11="@comment " PREFIX=/usr/local LOCALBASE=/usr/local  DATADIR=/usr/local/share/virtualbox-ose DOCSDIR=/usr/local/share/doc/virtualbox-ose EXAMPLESDIR=/usr/local/share/examples/virtualbox-ose  WWWDIR=/usr/local/www/virtualbox-ose ETCDIR=/usr/local/etc/virtualbox-ose
--End SUB_LIST--

---Begin make.conf---
USE_PACKAGE_DEPENDS=yes
BATCH=yes
WRKDIRPREFIX=/wrkdirs
PORTSDIR=/usr/ports
PACKAGES=/packages
DISTDIR=/distfiles
PACKAGE_BUILDING=yes
PACKAGE_BUILDING_FLAVORS=yes
MACHINE=i386
MACHINE_ARCH=i386
ARCH=${MACHINE_ARCH}
####  ####
# XXX: We really need this but cannot use it while 'make checksum' does not
# try the next mirror on checksum failure.  It currently retries the same
# failed mirror and then fails rather then trying another.  It *does*
# try the next if the size is mismatched though.
#MASTER_SITE_FREEBSD=yes
# Build ALLOW_MAKE_JOBS_PACKAGES with 3 jobs
MAKE_JOBS_NUMBER=3
#### Misc Poudriere ####
.include "/etc/make.conf.ports_env"
GID=0
UID=0
DISABLE_MAKE_JOBS=poudriere
---End make.conf---
--Resource limits--
cpu time               (seconds, -t)  unlimited
file size           (512-blocks, -f)  unlimited
data seg size           (kbytes, -d)  524288
stack size              (kbytes, -s)  65536
core file size      (512-blocks, -c)  unlimited
max memory size         (kbytes, -m)  unlimited
locked memory           (kbytes, -l)  unlimited
max user processes              (-u)  89999
open files                      (-n)  8192
virtual mem size        (kbytes, -v)  unlimited
swap limit              (kbytes, -w)  unlimited
socket buffer size       (bytes, -b)  unlimited
pseudo-terminals                (-p)  unlimited
kqueues                         (-k)  unlimited
umtx shared locks               (-o)  unlimited
--End resource limits--
=======================<phase: check-sanity   >============================
===== env: NO_DEPENDS=yes USER=root UID=0 GID=0
===>  License GPLv2 accepted by the user
===========================================================================
=======================<phase: pkg-depends    >============================
===== env: USE_PACKAGE_DEPENDS_ONLY=1 USER=root UID=0 GID=0
===>   virtualbox-ose-additions-legacy-5.2.44_5 depends on file: /usr/local/sbin/pkg - not found
===>   Installing existing package /packages/All/pkg-1.21.3.pkg
[140i386-default-job-18] Installing pkg-1.21.3...
[140i386-default-job-18] Extracting pkg-1.21.3: .......... done
===>   virtualbox-ose-additions-legacy-5.2.44_5 depends on file: /usr/local/sbin/pkg - found
===>   Returning to build of virtualbox-ose-additions-legacy-5.2.44_5
===========================================================================
=======================<phase: fetch-depends  >============================
===== env: USE_PACKAGE_DEPENDS_ONLY=1 USER=root UID=0 GID=0
===========================================================================
=======================<phase: fetch          >============================
===== env: NO_DEPENDS=yes USER=root UID=0 GID=0
===>  License GPLv2 accepted by the user
===> Fetching all distfiles required by virtualbox-ose-additions-legacy-5.2.44_5 for building
===========================================================================
=======================<phase: checksum       >============================
===== env: NO_DEPENDS=yes USER=root UID=0 GID=0
===>  License GPLv2 accepted by the user
===> Fetching all distfiles required by virtualbox-ose-additions-legacy-5.2.44_5 for building
=> SHA256 Checksum OK for VirtualBox-5.2.44.tar.bz2.
===========================================================================
=======================<phase: extract-depends>============================
===== env: USE_PACKAGE_DEPENDS_ONLY=1 USER=root UID=0 GID=0
===========================================================================
=======================<phase: extract        >============================
===== env: NO_DEPENDS=yes USER=root UID=0 GID=0
===>  License GPLv2 accepted by the user
===> Fetching all distfiles required by virtualbox-ose-additions-legacy-5.2.44_5 for building
===>  Extracting for virtualbox-ose-additions-legacy-5.2.44_5
=> SHA256 Checksum OK for VirtualBox-5.2.44.tar.bz2.
===========================================================================
=======================<phase: patch-depends  >============================
===== env: USE_PACKAGE_DEPENDS_ONLY=1 USER=root UID=0 GID=0
===========================================================================
=======================<phase: patch          >============================
===== env: NO_DEPENDS=yes USER=root UID=0 GID=0
===>  Patching for virtualbox-ose-additions-legacy-5.2.44_5
===>  Applying extra patch /usr/ports/emulators/virtualbox-ose-additions-legacy/../virtualbox-ose-legacy/files/extrapatch-src-VBox-Additions-x11-VBoxClient-Makefile.kmk
===>  Applying FreeBSD patches for virtualbox-ose-additions-legacy-5.2.44_5 from /usr/ports/emulators/virtualbox-ose-additions-legacy/../virtualbox-ose-legacy/files
===========================================================================
=======================<phase: build-depends  >============================
===== env: USE_PACKAGE_DEPENDS_ONLY=1 USER=root UID=0 GID=0
===>   virtualbox-ose-additions-legacy-5.2.44_5 depends on executable: yasm - not found
===>   Installing existing package /packages/All/yasm-1.3.0_1.pkg
[140i386-default-job-18] Installing yasm-1.3.0_1...
[140i386-default-job-18] `-- Installing gettext-runtime-0.22.5...
[140i386-default-job-18] |   `-- Installing indexinfo-0.3.1...
[140i386-default-job-18] |   `-- Extracting indexinfo-0.3.1: .... done
[140i386-default-job-18] `-- Extracting gettext-runtime-0.22.5: .......... done
[140i386-default-job-18] Extracting yasm-1.3.0_1: .......... done
===>   virtualbox-ose-additions-legacy-5.2.44_5 depends on executable: yasm - found
===>   Returning to build of virtualbox-ose-additions-legacy-5.2.44_5
===>   virtualbox-ose-additions-legacy-5.2.44_5 depends on executable: kmk - not found
===>   Installing existing package /packages/All/kBuild-0.1.9998_15.pkg
[140i386-default-job-18] Installing kBuild-0.1.9998_15...
[140i386-default-job-18] `-- Installing gcc13-13.2.0_4...
<snip>
kBuild: Compiling RuntimeBldProg - /wrkdirs/usr/ports/emulators/virtualbox-ose-additions-legacy/work/VirtualBox-5.2.44/src/VBox/Runtime/common/checksum/manifest-file.cpp
kBuild: Compiling RuntimeBldProg - /wrkdirs/usr/ports/emulators/virtualbox-ose-additions-legacy/work/VirtualBox-5.2.44/src/VBox/Runtime/common/checksum/RTSha1Digest.cpp
kBuild: Compiling RuntimeBldProg - /wrkdirs/usr/ports/emulators/virtualbox-ose-additions-legacy/work/VirtualBox-5.2.44/src/VBox/Runtime/common/checksum/RTSha256Digest.cpp
kBuild: Compiling RuntimeBldProg - /wrkdirs/usr/ports/emulators/virtualbox-ose-additions-legacy/work/VirtualBox-5.2.44/src/VBox/Runtime/common/checksum/sha1str.cpp
kBuild: Compiling RuntimeBldProg - /wrkdirs/usr/ports/emulators/virtualbox-ose-additions-legacy/work/VirtualBox-5.2.44/src/VBox/Runtime/common/checksum/sha224str.cpp
kBuild: Compiling RuntimeBldProg - /wrkdirs/usr/ports/emulators/virtualbox-ose-additions-legacy/work/VirtualBox-5.2.44/src/VBox/Runtime/common/checksum/sha256str.cpp
/wrkdirs/usr/ports/emulators/virtualbox-ose-additions-legacy/work/VirtualBox-5.2.44/src/VBox/Runtime/common/checksum/manifest2.cpp:67:25: warning: flexible array members are a C99 feature [-Wc99-extensions]
    char                szName[RT_FLEXIBLE_ARRAY];
                        ^
kBuild: Compiling RuntimeBldProg - /wrkdirs/usr/ports/emulators/virtualbox-ose-additions-legacy/work/VirtualBox-5.2.44/src/VBox/Runtime/common/checksum/sha384str.cpp
kBuild: Compiling RuntimeBldProg - /wrkdirs/usr/ports/emulators/virtualbox-ose-additions-legacy/work/VirtualBox-5.2.44/src/VBox/Runtime/common/checksum/sha512str.cpp
kBuild: Compiling RuntimeBldProg - /wrkdirs/usr/ports/emulators/virtualbox-ose-additions-legacy/work/VirtualBox-5.2.44/src/VBox/Runtime/common/checksum/sha512t224str.cpp
kBuild: Compiling RuntimeBldProg - /wrkdirs/usr/ports/emulators/virtualbox-ose-additions-legacy/work/VirtualBox-5.2.44/src/VBox/Runtime/common/checksum/sha512t256str.cpp
kBuild: Compiling RuntimeBldProg - /wrkdirs/usr/ports/emulators/virtualbox-ose-additions-legacy/work/VirtualBox-5.2.44/src/VBox/Runtime/common/crypto/digest-core.cpp
kBuild: Compiling RuntimeBldProg - /wrkdirs/usr/ports/emulators/virtualbox-ose-additions-legacy/work/VirtualBox-5.2.44/src/VBox/Runtime/common/crypto/digest-builtin.cpp
kBuild: Compiling RuntimeBldProg - /wrkdirs/usr/ports/emulators/virtualbox-ose-additions-legacy/work/VirtualBox-5.2.44/src/VBox/Runtime/common/crypto/digest-vfs.cpp
kBuild: Compiling RuntimeBldProg - /wrkdirs/usr/ports/emulators/virtualbox-ose-additions-legacy/work/VirtualBox-5.2.44/src/VBox/Runtime/common/crypto/iprt-openssl.cpp
kBuild: Compiling RuntimeBldProg - /wrkdirs/usr/ports/emulators/virtualbox-ose-additions-legacy/work/VirtualBox-5.2.44/src/VBox/Runtime/common/crypto/rsa-asn1-decoder.cpp
kBuild: Compiling RuntimeBldProg - /wrkdirs/usr/ports/emulators/virtualbox-ose-additions-legacy/work/VirtualBox-5.2.44/src/VBox/Runtime/common/crypto/rsa-core.cpp
kBuild: Compiling RuntimeBldProg - /wrkdirs/usr/ports/emulators/virtualbox-ose-additions-legacy/work/VirtualBox-5.2.44/src/VBox/Runtime/common/crypto/rsa-init.cpp
kBuild: Compiling RuntimeBldProg - /wrkdirs/usr/ports/emulators/virtualbox-ose-additions-legacy/work/VirtualBox-5.2.44/src/VBox/Runtime/common/crypto/rsa-sanity.cpp
kBuild: Compiling RuntimeBldProg - /wrkdirs/usr/ports/emulators/virtualbox-ose-additions-legacy/work/VirtualBox-5.2.44/src/VBox/Runtime/common/crypto/pemfile.cpp
kBuild: Compiling RuntimeBldProg - /wrkdirs/usr/ports/emulators/virtualbox-ose-additions-legacy/work/VirtualBox-5.2.44/src/VBox/Runtime/common/crypto/pkcs7-asn1-decoder.cpp
kBuild: Compiling RuntimeBldProg - /wrkdirs/usr/ports/emulators/virtualbox-ose-additions-legacy/work/VirtualBox-5.2.44/src/VBox/Runtime/common/crypto/pkcs7-core.cpp
kBuild: Compiling RuntimeBldProg - /wrkdirs/usr/ports/emulators/virtualbox-ose-additions-legacy/work/VirtualBox-5.2.44/src/VBox/Runtime/common/crypto/pkcs7-init.cpp
kBuild: Compiling RuntimeBldProg - /wrkdirs/usr/ports/emulators/virtualbox-ose-additions-legacy/work/VirtualBox-5.2.44/src/VBox/Runtime/common/crypto/pkcs7-sanity.cpp
kBuild: Compiling RuntimeBldProg - /wrkdirs/usr/ports/emulators/virtualbox-ose-additions-legacy/work/VirtualBox-5.2.44/src/VBox/Runtime/common/crypto/pkcs7-verify.cpp
kBuild: Compiling RuntimeBldProg - /wrkdirs/usr/ports/emulators/virtualbox-ose-additions-legacy/work/VirtualBox-5.2.44/src/VBox/Runtime/common/crypto/pkix-signature-builtin.cpp
1 warning generated.
kBuild: Compiling RuntimeBldProg - /wrkdirs/usr/ports/emulators/virtualbox-ose-additions-legacy/work/VirtualBox-5.2.44/src/VBox/Runtime/common/crypto/pkix-signature-core.cpp
kBuild: Compiling RuntimeBldProg - /wrkdirs/usr/ports/emulators/virtualbox-ose-additions-legacy/work/VirtualBox-5.2.44/src/VBox/Runtime/common/crypto/pkix-signature-rsa.cpp
kBuild: Compiling RuntimeBldProg - /wrkdirs/usr/ports/emulators/virtualbox-ose-additions-legacy/work/VirtualBox-5.2.44/src/VBox/Runtime/common/crypto/pkix-util.cpp
kBuild: Compiling RuntimeBldProg - /wrkdirs/usr/ports/emulators/virtualbox-ose-additions-legacy/work/VirtualBox-5.2.44/src/VBox/Runtime/common/crypto/pkix-verify.cpp
kBuild: Compiling RuntimeBldProg - /wrkdirs/usr/ports/emulators/virtualbox-ose-additions-legacy/work/VirtualBox-5.2.44/src/VBox/Runtime/common/crypto/spc-asn1-decoder.cpp
kBuild: Compiling RuntimeBldProg - /wrkdirs/usr/ports/emulators/virtualbox-ose-additions-legacy/work/VirtualBox-5.2.44/src/VBox/Runtime/common/crypto/spc-core.cpp
kBuild: Compiling RuntimeBldProg - /wrkdirs/usr/ports/emulators/virtualbox-ose-additions-legacy/work/VirtualBox-5.2.44/src/VBox/Runtime/common/crypto/spc-init.cpp
kBuild: Compiling RuntimeBldProg - /wrkdirs/usr/ports/emulators/virtualbox-ose-additions-legacy/work/VirtualBox-5.2.44/src/VBox/Runtime/common/crypto/spc-sanity.cpp
kBuild: Compiling RuntimeBldProg - /wrkdirs/usr/ports/emulators/virtualbox-ose-additions-legacy/work/VirtualBox-5.2.44/src/VBox/Runtime/common/crypto/x509-asn1-decoder.cpp
kBuild: Compiling RuntimeBldProg - /wrkdirs/usr/ports/emulators/virtualbox-ose-additions-legacy/work/VirtualBox-5.2.44/src/VBox/Runtime/common/crypto/x509-certpaths.cpp
kBuild: Compiling RuntimeBldProg - /wrkdirs/usr/ports/emulators/virtualbox-ose-additions-legacy/work/VirtualBox-5.2.44/src/VBox/Runtime/common/crypto/x509-core.cpp
kBuild: Compiling RuntimeBldProg - /wrkdirs/usr/ports/emulators/virtualbox-ose-additions-legacy/work/VirtualBox-5.2.44/src/VBox/Runtime/common/crypto/x509-file.cpp
kBuild: Compiling RuntimeBldProg - /wrkdirs/usr/ports/emulators/virtualbox-ose-additions-legacy/work/VirtualBox-5.2.44/src/VBox/Runtime/common/crypto/x509-init.cpp
kBuild: Compiling RuntimeBldProg - /wrkdirs/usr/ports/emulators/virtualbox-ose-additions-legacy/work/VirtualBox-5.2.44/src/VBox/Runtime/common/crypto/x509-sanity.cpp
kBuild: Compiling RuntimeBldProg - /wrkdirs/usr/ports/emulators/virtualbox-ose-additions-legacy/work/VirtualBox-5.2.44/src/VBox/Runtime/common/crypto/x509-verify.cpp
kBuild: Compiling RuntimeBldProg - /wrkdirs/usr/ports/emulators/virtualbox-ose-additions-legacy/work/VirtualBox-5.2.44/src/VBox/Runtime/common/crypto/taf-asn1-decoder.cpp
kBuild: Compiling RuntimeBldProg - /wrkdirs/usr/ports/emulators/virtualbox-ose-additions-legacy/work/VirtualBox-5.2.44/src/VBox/Runtime/common/crypto/taf-core.cpp
kBuild: Compiling RuntimeBldProg - /wrkdirs/usr/ports/emulators/virtualbox-ose-additions-legacy/work/VirtualBox-5.2.44/src/VBox/Runtime/common/crypto/taf-init.cpp
In file included from /wrkdirs/usr/ports/emulators/virtualbox-ose-additions-legacy/work/VirtualBox-5.2.44/src/VBox/Runtime/common/crypto/x509-certpaths.cpp:43:
/wrkdirs/usr/ports/emulators/virtualbox-ose-additions-legacy/work/VirtualBox-5.2.44/include/iprt/crypto/applecodesign.h:148:25: warning: flexible array members are a C99 feature [-Wc99-extensions]
    RTCRAPLCSBLOBSLOT   aSlots[RT_FLEXIBLE_ARRAY];
                        ^
kBuild: Compiling RuntimeBldProg - /wrkdirs/usr/ports/emulators/virtualbox-ose-additions-legacy/work/VirtualBox-5.2.44/src/VBox/Runtime/common/crypto/taf-sanity.cpp
kBuild: Compiling RuntimeBldProg - /wrkdirs/usr/ports/emulators/virtualbox-ose-additions-legacy/work/VirtualBox-5.2.44/src/VBox/Runtime/common/crypto/tsp-asn1-decoder.cpp
kBuild: Compiling RuntimeBldProg - /wrkdirs/usr/ports/emulators/virtualbox-ose-additions-legacy/work/VirtualBox-5.2.44/src/VBox/Runtime/common/crypto/tsp-core.cpp
kBuild: Compiling RuntimeBldProg - /wrkdirs/usr/ports/emulators/virtualbox-ose-additions-legacy/work/VirtualBox-5.2.44/src/VBox/Runtime/common/crypto/tsp-init.cpp
kBuild: Compiling RuntimeBldProg - /wrkdirs/usr/ports/emulators/virtualbox-ose-additions-legacy/work/VirtualBox-5.2.44/src/VBox/Runtime/common/crypto/tsp-sanity.cpp
kBuild: Compiling RuntimeBldProg - /wrkdirs/usr/ports/emulators/virtualbox-ose-additions-legacy/work/VirtualBox-5.2.44/src/VBox/Runtime/common/crypto/store.cpp
kBuild: Compiling RuntimeBldProg - /wrkdirs/usr/ports/emulators/virtualbox-ose-additions-legacy/work/VirtualBox-5.2.44/src/VBox/Runtime/common/crypto/store-inmem.cpp
kBuild: Compiling RuntimeBldProg - /wrkdirs/usr/ports/emulators/virtualbox-ose-additions-legacy/work/VirtualBox-5.2.44/src/VBox/Runtime/common/crypto/store-cert-add-basic.cpp
kBuild: Compiling RuntimeBldProg - /wrkdirs/usr/ports/emulators/virtualbox-ose-additions-legacy/work/VirtualBox-5.2.44/src/VBox/Runtime/common/crypto/RTCrStoreCertAddFromJavaKeyStore.cpp
kBuild: Compiling RuntimeBldProg - /wrkdirs/usr/ports/emulators/virtualbox-ose-additions-legacy/work/VirtualBox-5.2.44/src/VBox/Runtime/common/crypto/RTCrStoreCertAddWantedFromFishingExpedition.cpp
kBuild: Compiling RuntimeBldProg - /wrkdirs/usr/ports/emulators/virtualbox-ose-additions-legacy/work/VirtualBox-5.2.44/src/VBox/Runtime/common/crypto/RTCrStoreCertExportAsPem.cpp
kBuild: Compiling RuntimeBldProg - /wrkdirs/usr/ports/emulators/virtualbox-ose-additions-legacy/work/VirtualBox-5.2.44/src/VBox/Runtime/common/crypto/RTCrStoreCreateSnapshotOfUserAndSystemTrustedCAsAndCerts.cpp
kBuild: Compiling RuntimeBldProg - /wrkdirs/usr/ports/emulators/virtualbox-ose-additions-legacy/work/VirtualBox-5.2.44/src/VBox/Runtime/common/dbg/dbg.cpp
kBuild: Compiling RuntimeBldProg - /wrkdirs/usr/ports/emulators/virtualbox-ose-additions-legacy/work/VirtualBox-5.2.44/src/VBox/Runtime/common/dbg/dbgas.cpp
kBuild: Compiling RuntimeBldProg - /wrkdirs/usr/ports/emulators/virtualbox-ose-additions-legacy/work/VirtualBox-5.2.44/src/VBox/Runtime/common/dbg/dbgcfg.cpp
kBuild: Compiling RuntimeBldProg - /wrkdirs/usr/ports/emulators/virtualbox-ose-additions-legacy/work/VirtualBox-5.2.44/src/VBox/Runtime/common/dbg/dbgmod.cpp
kBuild: Compiling RuntimeBldProg - /wrkdirs/usr/ports/emulators/virtualbox-ose-additions-legacy/work/VirtualBox-5.2.44/src/VBox/Runtime/common/dbg/dbgmodldr.cpp
kBuild: Compiling RuntimeBldProg - /wrkdirs/usr/ports/emulators/virtualbox-ose-additions-legacy/work/VirtualBox-5.2.44/src/VBox/Runtime/common/dbg/dbgmodcontainer.cpp
kBuild: Compiling RuntimeBldProg - /wrkdirs/usr/ports/emulators/virtualbox-ose-additions-legacy/work/VirtualBox-5.2.44/src/VBox/Runtime/common/dbg/dbgmoddeferred.cpp
kBuild: Compiling RuntimeBldProg - /wrkdirs/usr/ports/emulators/virtualbox-ose-additions-legacy/work/VirtualBox-5.2.44/src/VBox/Runtime/common/dbg/dbgmodexports.cpp
kBuild: Compiling RuntimeBldProg - /wrkdirs/usr/ports/emulators/virtualbox-ose-additions-legacy/work/VirtualBox-5.2.44/src/VBox/Runtime/common/dbg/dbgmodcodeview.cpp
kBuild: Compiling RuntimeBldProg - /wrkdirs/usr/ports/emulators/virtualbox-ose-additions-legacy/work/VirtualBox-5.2.44/src/VBox/Runtime/common/dbg/dbgmoddwarf.cpp
kBuild: Compiling RuntimeBldProg - /wrkdirs/usr/ports/emulators/virtualbox-ose-additions-legacy/work/VirtualBox-5.2.44/src/VBox/Runtime/common/dbg/dbgmodnm.cpp
kBuild: Compiling RuntimeBldProg - /wrkdirs/usr/ports/emulators/virtualbox-ose-additions-legacy/work/VirtualBox-5.2.44/src/VBox/Runtime/common/dvm/dvm.cpp
kBuild: Compiling RuntimeBldProg - /wrkdirs/usr/ports/emulators/virtualbox-ose-additions-legacy/work/VirtualBox-5.2.44/src/VBox/Runtime/common/dvm/dvmbsdlabel.cpp
kBuild: Compiling RuntimeBldProg - /wrkdirs/usr/ports/emulators/virtualbox-ose-additions-legacy/work/VirtualBox-5.2.44/src/VBox/Runtime/common/dvm/dvmgpt.cpp
kBuild: Compiling RuntimeBldProg - /wrkdirs/usr/ports/emulators/virtualbox-ose-additions-legacy/work/VirtualBox-5.2.44/src/VBox/Runtime/common/dvm/dvmmbr.cpp
kBuild: Compiling RuntimeBldProg - /wrkdirs/usr/ports/emulators/virtualbox-ose-additions-legacy/work/VirtualBox-5.2.44/src/VBox/Runtime/common/dvm/dvmvfs.cpp
kBuild: Compiling RuntimeBldProg - /wrkdirs/usr/ports/emulators/virtualbox-ose-additions-legacy/work/VirtualBox-5.2.44/src/VBox/Runtime/common/err/errinfo.cpp
kBuild: Compiling RuntimeBldProg - /wrkdirs/usr/ports/emulators/virtualbox-ose-additions-legacy/work/VirtualBox-5.2.44/src/VBox/Runtime/common/err/errinfolog.cpp
kBuild: Compiling RuntimeBldProg - /wrkdirs/usr/ports/emulators/virtualbox-ose-additions-legacy/work/VirtualBox-5.2.44/src/VBox/Runtime/common/err/errinfo-alloc.cpp
kBuild: Generating /wrkdirs/usr/ports/emulators/virtualbox-ose-additions-legacy/work/VirtualBox-5.2.44/out/freebsd.x86/release/obj/Runtime/errmsgdata.h
1 warning generated.
kBuild: Compiling RuntimeBldProg - /wrkdirs/usr/ports/emulators/virtualbox-ose-additions-legacy/work/VirtualBox-5.2.44/src/VBox/Runtime/common/err/RTErrConvertFromErrno.cpp
kBuild: Compiling RuntimeBldProg - /wrkdirs/usr/ports/emulators/virtualbox-ose-additions-legacy/work/VirtualBox-5.2.44/src/VBox/Runtime/common/err/RTErrConvertToErrno.cpp
kBuild: Compiling RuntimeBldProg - /wrkdirs/usr/ports/emulators/virtualbox-ose-additions-legacy/work/VirtualBox-5.2.44/src/VBox/Runtime/common/fs/filesystem.cpp
kBuild: Compiling RuntimeBldProg - /wrkdirs/usr/ports/emulators/virtualbox-ose-additions-legacy/work/VirtualBox-5.2.44/src/VBox/Runtime/common/fs/filesystemext.cpp
kBuild: Compiling RuntimeBldProg - /wrkdirs/usr/ports/emulators/virtualbox-ose-additions-legacy/work/VirtualBox-5.2.44/src/VBox/Runtime/common/fs/fatvfs.cpp
kBuild: Compiling RuntimeBldProg - /wrkdirs/usr/ports/emulators/virtualbox-ose-additions-legacy/work/VirtualBox-5.2.44/src/VBox/Runtime/common/fs/isovfs.cpp
kBuild: Compiling RuntimeBldProg - /wrkdirs/usr/ports/emulators/virtualbox-ose-additions-legacy/work/VirtualBox-5.2.44/src/VBox/Runtime/common/fs/isomaker.cpp
kBuild: Pre-processing /wrkdirs/usr/ports/emulators/virtualbox-ose-additions-legacy/work/VirtualBox-5.2.44/doc/manual/docbook-refentry-to-C-help.xsl to /wrkdirs/usr/ports/emulators/virtualbox-ose-additions-legacy/work/VirtualBox-5.2.44/out/freebsd.x86/release/obj/manual/docbook-refentry-to-C-help.xsl
kBuild: Pre-processing /wrkdirs/usr/ports/emulators/virtualbox-ose-additions-legacy/work/VirtualBox-5.2.44/doc/manual/docbook-refentry-to-H-help.xsl to /wrkdirs/usr/ports/emulators/virtualbox-ose-additions-legacy/work/VirtualBox-5.2.44/out/freebsd.x86/release/obj/manual/docbook-refentry-to-H-help.xsl
kBuild: xsltproc docbook-refentry-to-manpage-preprocessing.xsl  - /wrkdirs/usr/ports/emulators/virtualbox-ose-additions-legacy/work/VirtualBox-5.2.44/src/VBox/Runtime/common/fs/isomakercmd-man.xml
kBuild: Compiling RuntimeBldProg - /wrkdirs/usr/ports/emulators/virtualbox-ose-additions-legacy/work/VirtualBox-5.2.44/src/VBox/Runtime/common/fs/isomakerimport.cpp
I/O error : Attempt to load network entity http://www.oasis-open.org/docbook/xml/4.3/docbookx.dtd
/wrkdirs/usr/ports/emulators/virtualbox-ose-additions-legacy/work/VirtualBox-5.2.44/src/VBox/Runtime/common/fs/isomakercmd-man.xml:24: warning: failed to load external entity "http://www.oasis-open.org/docbook/xml/4.3/docbookx.dtd"
D DocBook XML V4.3//EN" "http://www.oasis-open.org/docbook/xml/4.3/docbookx.dtd"
                                                                               ^
kBuild: Compiling RuntimeBldProg - /wrkdirs/usr/ports/emulators/virtualbox-ose-additions-legacy/work/VirtualBox-5.2.44/src/VBox/Runtime/common/ldr/ldr.cpp
kBuild: Compiling RuntimeBldProg - /wrkdirs/usr/ports/emulators/virtualbox-ose-additions-legacy/work/VirtualBox-5.2.44/src/VBox/Runtime/common/ldr/ldrELF.cpp
kBuild: Compiling RuntimeBldProg - /wrkdirs/usr/ports/emulators/virtualbox-ose-additions-legacy/work/VirtualBox-5.2.44/src/VBox/Runtime/common/ldr/ldrEx.cpp
kBuild: Compiling RuntimeBldProg - /wrkdirs/usr/ports/emulators/virtualbox-ose-additions-legacy/work/VirtualBox-5.2.44/src/VBox/Runtime/common/ldr/ldrFile.cpp
kBuild: Compiling RuntimeBldProg - /wrkdirs/usr/ports/emulators/virtualbox-ose-additions-legacy/work/VirtualBox-5.2.44/src/VBox/Runtime/common/ldr/ldrLX.cpp
/wrkdirs/usr/ports/emulators/virtualbox-ose-additions-legacy/work/VirtualBox-5.2.44/src/VBox/Runtime/common/fs/fatvfs.cpp:321:29: warning: flexible array members are a C99 feature [-Wc99-extensions]
    RTFSFATCLUSTERMAPENTRY  aEntries[RT_FLEXIBLE_ARRAY];
                            ^
kBuild: Compiling RuntimeBldProg - /wrkdirs/usr/ports/emulators/virtualbox-ose-additions-legacy/work/VirtualBox-5.2.44/src/VBox/Runtime/common/ldr/ldrMachO.cpp
In file included from /wrkdirs/usr/ports/emulators/virtualbox-ose-additions-legacy/work/VirtualBox-5.2.44/src/VBox/Runtime/common/fs/isovfs.cpp:49:
/wrkdirs/usr/ports/emulators/virtualbox-ose-additions-legacy/work/VirtualBox-5.2.44/include/iprt/formats/iso9660.h:238:25: warning: flexible array members are a C99 feature [-Wc99-extensions]
    char                achDirId[RT_FLEXIBLE_ARRAY];
                        ^
/wrkdirs/usr/ports/emulators/virtualbox-ose-additions-legacy/work/VirtualBox-5.2.44/include/iprt/formats/iso9660.h:290:25: warning: flexible array members are a C99 feature [-Wc99-extensions]
    uint8_t             abAppUse[RT_FLEXIBLE_ARRAY];
                        ^
In file included from /wrkdirs/usr/ports/emulators/virtualbox-ose-additions-legacy/work/VirtualBox-5.2.44/src/VBox/Runtime/common/fs/isovfs.cpp:50:
/wrkdirs/usr/ports/emulators/virtualbox-ose-additions-legacy/work/VirtualBox-5.2.44/include/iprt/formats/udf.h:791:21: warning: flexible array members are a C99 feature [-Wc99-extensions]
    uint8_t         abPartitionMaps[RT_FLEXIBLE_ARRAY];
                    ^
/wrkdirs/usr/ports/emulators/virtualbox-ose-additions-legacy/work/VirtualBox-5.2.44/include/iprt/formats/udf.h:924:21: warning: flexible array members are a C99 feature [-Wc99-extensions]
    UDFEXTENTAD     aAllocationDescriptors[RT_FLEXIBLE_ARRAY];
                    ^
/wrkdirs/usr/ports/emulators/virtualbox-ose-additions-legacy/work/VirtualBox-5.2.44/include/iprt/formats/udf.h:974:21: warning: flexible array members are a C99 feature [-Wc99-extensions]
    uint32_t        aTables[RT_FLEXIBLE_ARRAY];
                    ^
/wrkdirs/usr/ports/emulators/virtualbox-ose-additions-legacy/work/VirtualBox-5.2.44/include/iprt/formats/udf.h:1074:21: warning: flexible array members are a C99 feature [-Wc99-extensions]
    uint8_t         abImplementationUse[RT_FLEXIBLE_ARRAY];
                    ^
In file included from /wrkdirs/usr/ports/emulators/virtualbox-ose-additions-legacy/work/VirtualBox-5.2.44/src/VBox/Runtime/common/fs/isomaker.cpp:50:
/wrkdirs/usr/ports/emulators/virtualbox-ose-additions-legacy/work/VirtualBox-5.2.44/include/iprt/formats/iso9660.h:238:25: warning: flexible array members are a C99 feature [-Wc99-extensions]
    char                achDirId[RT_FLEXIBLE_ARRAY];
                        ^
/wrkdirs/usr/ports/emulators/virtualbox-ose-additions-legacy/work/VirtualBox-5.2.44/include/iprt/formats/udf.h:1357:21: warning: flexible array members are a C99 feature [-Wc99-extensions]
    uint8_t         abExtAttribs[RT_FLEXIBLE_ARRAY];
                    ^
/wrkdirs/usr/ports/emulators/virtualbox-ose-additions-legacy/work/VirtualBox-5.2.44/include/iprt/formats/iso9660.h:290:25: warning: flexible array members are a C99 feature [-Wc99-extensions]
    uint8_t             abAppUse[RT_FLEXIBLE_ARRAY];
                        ^
kBuild: Compiling RuntimeBldProg - /wrkdirs/usr/ports/emulators/virtualbox-ose-additions-legacy/work/VirtualBox-5.2.44/src/VBox/Runtime/common/ldr/ldrMemory.cpp
/wrkdirs/usr/ports/emulators/virtualbox-ose-additions-legacy/work/VirtualBox-5.2.44/include/iprt/formats/udf.h:1970:21: warning: flexible array members are a C99 feature [-Wc99-extensions]
    uint8_t         abBitmap[RT_FLEXIBLE_ARRAY];
                    ^
/wrkdirs/usr/ports/emulators/virtualbox-ose-additions-legacy/work/VirtualBox-5.2.44/include/iprt/formats/udf.h:1999:21: warning: flexible array members are a C99 feature [-Wc99-extensions]
    uint8_t         abImplementationUse[RT_FLEXIBLE_ARRAY];
                    ^
/wrkdirs/usr/ports/emulators/virtualbox-ose-additions-legacy/work/VirtualBox-5.2.44/include/iprt/formats/udf.h:2066:21: warning: flexible array members are a C99 feature [-Wc99-extensions]
    uint8_t         abExtAttribs[RT_FLEXIBLE_ARRAY];
                    ^
/wrkdirs/usr/ports/emulators/virtualbox-ose-additions-legacy/work/VirtualBox-5.2.44/src/VBox/Runtime/common/fs/isomaker.cpp:260:29: warning: flexible array members are a C99 feature [-Wc99-extensions]
    char                    szName[RT_FLEXIBLE_ARRAY];
                            ^
/wrkdirs/usr/ports/emulators/virtualbox-ose-additions-legacy/work/VirtualBox-5.2.44/src/VBox/Runtime/common/fs/isomaker.cpp:450:29: warning: flexible array members are a C99 feature [-Wc99-extensions]
    char                    szTarget[RT_FLEXIBLE_ARRAY];
                            ^
In file included from /wrkdirs/usr/ports/emulators/virtualbox-ose-additions-legacy/work/VirtualBox-5.2.44/src/VBox/Runtime/common/fs/isomakerimport.cpp:46:
/wrkdirs/usr/ports/emulators/virtualbox-ose-additions-legacy/work/VirtualBox-5.2.44/include/iprt/formats/iso9660.h:238:25: warning: flexible array members are a C99 feature [-Wc99-extensions]
    char                achDirId[RT_FLEXIBLE_ARRAY];
                        ^
/wrkdirs/usr/ports/emulators/virtualbox-ose-additions-legacy/work/VirtualBox-5.2.44/include/iprt/formats/iso9660.h:290:25: warning: flexible array members are a C99 feature [-Wc99-extensions]
    uint8_t             abAppUse[RT_FLEXIBLE_ARRAY];
                        ^
kBuild: Compiling RuntimeBldProg - /wrkdirs/usr/ports/emulators/virtualbox-ose-additions-legacy/work/VirtualBox-5.2.44/src/VBox/Runtime/common/ldr/ldrNative.cpp
kBuild: Compiling RuntimeBldProg - /wrkdirs/usr/ports/emulators/virtualbox-ose-additions-legacy/work/VirtualBox-5.2.44/src/VBox/Runtime/common/ldr/ldrPE.cpp
kBuild: Compiling RuntimeBldProg - /wrkdirs/usr/ports/emulators/virtualbox-ose-additions-legacy/work/VirtualBox-5.2.44/src/VBox/Runtime/common/log/log.cpp
/wrkdirs/usr/ports/emulators/virtualbox-ose-additions-legacy/work/VirtualBox-5.2.44/src/VBox/Runtime/common/ldr/ldrLX.cpp:134:29: warning: flexible array members are a C99 feature [-Wc99-extensions]
    RTLDRSEG                aSegments[RT_FLEXIBLE_ARRAY];
                            ^
kBuild: Compiling RuntimeBldProg - /wrkdirs/usr/ports/emulators/virtualbox-ose-additions-legacy/work/VirtualBox-5.2.44/src/VBox/Runtime/common/log/logellipsis.cpp
kBuild: Compiling RuntimeBldProg - /wrkdirs/usr/ports/emulators/virtualbox-ose-additions-legacy/work/VirtualBox-5.2.44/src/VBox/Runtime/common/log/logrel.cpp
kBuild: Compiling RuntimeBldProg - /wrkdirs/usr/ports/emulators/virtualbox-ose-additions-legacy/work/VirtualBox-5.2.44/src/VBox/Runtime/common/log/logrelellipsis.cpp
kBuild: Compiling RuntimeBldProg - /wrkdirs/usr/ports/emulators/virtualbox-ose-additions-legacy/work/VirtualBox-5.2.44/src/VBox/Runtime/common/log/logcom.cpp
In file included from /wrkdirs/usr/ports/emulators/virtualbox-ose-additions-legacy/work/VirtualBox-5.2.44/src/VBox/Runtime/common/ldr/ldrMachO.cpp:73:
/wrkdirs/usr/ports/emulators/virtualbox-ose-additions-legacy/work/VirtualBox-5.2.44/include/iprt/crypto/applecodesign.h:148:25: warning: flexible array members are a C99 feature [-Wc99-extensions]
    RTCRAPLCSBLOBSLOT   aSlots[RT_FLEXIBLE_ARRAY];
                        ^
kBuild: Compiling RuntimeBldProg - /wrkdirs/usr/ports/emulators/virtualbox-ose-additions-legacy/work/VirtualBox-5.2.44/src/VBox/Runtime/common/log/logformat.cpp
kBuild: Compiling RuntimeBldProg - /wrkdirs/usr/ports/emulators/virtualbox-ose-additions-legacy/work/VirtualBox-5.2.44/src/VBox/Runtime/common/log/tracebuf.cpp
kBuild: Compiling RuntimeBldProg - /wrkdirs/usr/ports/emulators/virtualbox-ose-additions-legacy/work/VirtualBox-5.2.44/src/VBox/Runtime/common/log/tracedefault.cpp
/wrkdirs/usr/ports/emulators/virtualbox-ose-additions-legacy/work/VirtualBox-5.2.44/src/VBox/Runtime/common/log/logcom.cpp:123:9: error: ISO C++17 does not allow 'register' storage class specifier [-Wregister]
        register unsigned cMaxWait;
        ^~~~~~~~~
/wrkdirs/usr/ports/emulators/virtualbox-ose-additions-legacy/work/VirtualBox-5.2.44/src/VBox/Runtime/common/log/logcom.cpp:124:9: error: ISO C++17 does not allow 'register' storage class specifier [-Wregister]
        register uint8_t  u8;
        ^~~~~~~~~
2 errors generated.
kmk: *** [/wrkdirs/usr/ports/emulators/virtualbox-ose-additions-legacy/work/VirtualBox-5.2.44/out/freebsd.x86/release/obj/RuntimeBldProg/common/log/logcom.o] Error 1
The failing command:
@c++ -c -O2 -g -pipe -pedantic -Wshadow -Wall -Wextra -Wno-missing-field-initializers -Wno-unused -Wno-trigraphs -fdiagnostics-show-option -Wno-unused-parameter -Wno-language-extension-token  -Wno-gnu-folding-constant -Wno-gnu-anonymous-struct  -Wno-string-plus-int -Wno-nested-anon-types -Wno-variadic-macros -Wno-long-long -Wno-return-type-c-linkage -Wno-overloaded-virtual -Wno-variadic-macros -O2 -fno-omit-frame-pointer -fno-strict-aliasing -m32 -I/wrkdirs/usr/ports/emulators/virtualbox-ose-additions-legacy/work/VirtualBox-5.2.44/src/VBox/Runtime/include -I/wrkdirs/usr/ports/emulators/virtualbox-ose-additions-legacy/work/VirtualBox-5.2.44/src/libs/liblzf-3.4 -I/usr/local/include -I/usr/local/include/libxml2 -I/wrkdirs/usr/ports/emulators/virtualbox-ose-additions-legacy/work/VirtualBox-5.2.44/include -I/wrkdirs/usr/ports/emulators/virtualbox-ose-additions-legacy/work/VirtualBox-5.2.44/out/freebsd.x86/release -DVBOX -DVBOX_OSE -DVBOX_WITH_64_BITS_GUESTS -DVBOX_WITH_REM -DVBOX
_WITH_RAW_MODE -DRT_OS_FREEBSD -D__FREEBSD__ -DRT_ARCH_X86 -D__X86__ -DVBOX_WITH_DEBUGGER -DVBOX_WITH_HARDENING -DRTPATH_APP_PRIVATE=\"/usr/local/lib/virtualbox\" -DRTPATH_APP_PRIVATE_ARCH=\"/usr/local/lib/virtualbox\" -DRTPATH_SHARED_LIBS=\"/usr/local/lib/virtualbox\" -DRTPATH_APP_DOCS=\"/usr/local/lib/virtualbox\" -D_REENTRANT -DIN_RING3 -DLOG_DISABLED -DIN_BLD_PROG -DIN_RT_R3 -DIN_ADV_BLD_PROG -DIN_RT_R3 -DLDR_WITH_NATIVE -DLDR_WITH_ELF32 -DLDR_WITH_LX -DLDR_WITH_MACHO -DLDR_WITH_PE -DRT_WITH_VBOX -DRT_NO_GIP -DRT_WITHOUT_NOCRT_WRAPPERS -DNOFILEID -DRT_WITH_ICONV_CACHE -DIPRT_WITHOUT_LDR_VERIFY -DRT_NO_GIP -Wp,-MD,/wrkdirs/usr/ports/emulators/virtualbox-ose-additions-legacy/work/VirtualBox-5.2.44/out/freebsd.x86/release/obj/RuntimeBldProg/common/log/logcom.o.dep -Wp,-MT,/wrkdirs/usr/ports/emulators/virtualbox-ose-additions-legacy/work/VirtualBox-5.2.44/out/freebsd.x86/release/obj/RuntimeBldProg/common/log/logcom.o -Wp,-MP -o /wrkdirs/usr/ports/emulators/virtualbox-ose-add
itions-legacy/work/VirtualBox-5.2.44/out/freebsd.x86/release/obj/RuntimeBldProg/common/log/logcom.o /wrkdirs/usr/ports/emulators/virtualbox-ose-additions-legacy/work/VirtualBox-5.2.44/src/VBox/Runtime/common/log/logcom.cpp
kmk: *** Waiting for unfinished jobs....
1 warning generated.
2 warnings generated.
10 warnings generated.
1 warning generated.
1 warning generated.
4 warnings generated.
kmk: *** Exiting with status 2
*** Error code 2

Stop.
make: stopped in /usr/ports/emulators/virtualbox-ose-additions-legacy