[package - main-amd64-default][databases/tarantool] Failed for tarantool-3.0.0 in build

From: <pkg-fallout_at_FreeBSD.org>
Date: Sat, 08 Jun 2024 22:10:38 UTC
You are receiving this mail as a port that you maintain
is failing to build on the FreeBSD package build server.
Please investigate the failure and submit a PR to fix
build.

Maintainer:     balaev@tarantool.org
Log URL:        https://pkg-status.freebsd.org/beefy18/data/main-amd64-default/p92a9331f7818_s63a327b954a/logs/tarantool-3.0.0.log
Build URL:      https://pkg-status.freebsd.org/beefy18/build.html?mastername=main-amd64-default&build=p92a9331f7818_s63a327b954a
Log:

=>> Building databases/tarantool
build started at Sat Jun  8 22:05:34 UTC 2024
port directory: /usr/ports/databases/tarantool
package name: tarantool-3.0.0
building for: FreeBSD main-amd64-default-job-10 15.0-CURRENT FreeBSD 15.0-CURRENT 1500019 amd64
maintained by: balaev@tarantool.org
Makefile datestamp: -rw-r--r--  1 root wheel 1533 Jan 30 01:01 /usr/ports/databases/tarantool/Makefile
Ports top last git commit: 92a9331f781
Ports top unclean checkout: no
Port dir last git commit: 7be43cda68e
Port dir unclean checkout: no
Poudriere version: poudriere-git-3.4.1-30-g79e3edcd
Host OSVERSION: 1500018
Jail OSVERSION: 1500019
Job Id: 10




!!! Jail is newer than host. (Jail: 1500019, Host: 1500018) !!!
!!! This is not supported. !!!
!!! Host kernel must be same or newer than jail. !!!
!!! Expect build failures. !!!



---Begin Environment---
SHELL=/bin/sh
OSVERSION=1500019
UNAME_v=FreeBSD 15.0-CURRENT 1500019
UNAME_r=15.0-CURRENT
BLOCKSIZE=K
MAIL=/var/mail/root
MM_CHARSET=UTF-8
LANG=C.UTF-8
STATUS=1
HOME=/root
PATH=/sbin:/bin:/usr/sbin:/usr/bin:/usr/local/sbin:/usr/local/bin:/root/bin
MAKE_OBJDIR_CHECK_WRITABLE=0
LOCALBASE=/usr/local
USER=root
POUDRIERE_NAME=poudriere-git
LIBEXECPREFIX=/usr/local/libexec/poudriere
POUDRIERE_VERSION=3.4.1-30-g79e3edcd
MASTERMNT=/usr/local/poudriere/data/.m/main-amd64-default/ref
LC_COLLATE=C
POUDRIERE_BUILD_TYPE=bulk
PACKAGE_BUILDING=yes
SAVED_TERM=
OUTPUT_REDIRECTED_STDERR=4
OUTPUT_REDIRECTED=1
PWD=/usr/local/poudriere/data/.m/main-amd64-default/10/.p
OUTPUT_REDIRECTED_STDOUT=3
P_PORTS_FEATURES=FLAVORS SUBPACKAGES SELECTED_OPTIONS
MASTERNAME=main-amd64-default
SCRIPTPREFIX=/usr/local/share/poudriere
SCRIPTNAME=bulk.sh
OLDPWD=/usr/local/poudriere/data/.m/main-amd64-default/ref/.p/pool
POUDRIERE_PKGNAME=poudriere-git-3.4.1-30-g79e3edcd
SCRIPTPATH=/usr/local/share/poudriere/bulk.sh
POUDRIEREPATH=/usr/local/bin/poudriere
---End Environment---

---Begin Poudriere Port Flags/Env---
PORT_FLAGS=
PKGENV=
FLAVOR=
MAKE_ARGS=
---End Poudriere Port Flags/Env---

---Begin OPTIONS List---
---End OPTIONS List---

--MAINTAINER--
balaev@tarantool.org
--End MAINTAINER--

--CONFIGURE_ARGS--

--End CONFIGURE_ARGS--

--CONFIGURE_ENV--
MAKE=gmake ac_cv_path_PERL=/usr/local/bin/perl ac_cv_path_PERL_PATH=/usr/local/bin/perl  PERL_USE_UNSAFE_INC=1 XDG_DATA_HOME=/wrkdirs/usr/ports/databases/tarantool/work  XDG_CONFIG_HOME=/wrkdirs/usr/ports/databases/tarantool/work  XDG_CACHE_HOME=/wrkdirs/usr/ports/databases/tarantool/work/.cache  HOME=/wrkdirs/usr/ports/databases/tarantool/work TMPDIR="/tmp" PATH=/wrkdirs/usr/ports/databases/tarantool/work/.bin:/sbin:/bin:/usr/sbin:/usr/bin:/usr/local/sbin:/usr/local/bin:/root/bin PKG_CONFIG_LIBDIR=/wrkdirs/usr/ports/databases/tarantool/work/.pkgconfig:/usr/local/libdata/pkgconfig:/usr/local/share/pkgconfig:/usr/libdata/pkgconfig SHELL=/bin/sh CONFIG_SHELL=/bin/sh
--End CONFIGURE_ENV--

--MAKE_ENV--
PERL_USE_UNSAFE_INC=1 OPENSSLBASE=/usr OPENSSLDIR=/etc/ssl OPENSSLINC=/usr/include OPENSSLLIB=/usr/lib XDG_DATA_HOME=/wrkdirs/usr/ports/databases/tarantool/work  XDG_CONFIG_HOME=/wrkdirs/usr/ports/databases/tarantool/work  XDG_CACHE_HOME=/wrkdirs/usr/ports/databases/tarantool/work/.cache  HOME=/wrkdirs/usr/ports/databases/tarantool/work TMPDIR="/tmp" PATH=/wrkdirs/usr/ports/databases/tarantool/work/.bin:/sbin:/bin:/usr/sbin:/usr/bin:/usr/local/sbin:/usr/local/bin:/root/bin PKG_CONFIG_LIBDIR=/wrkdirs/usr/ports/databases/tarantool/work/.pkgconfig:/usr/local/libdata/pkgconfig:/usr/local/share/pkgconfig:/usr/libdata/pkgconfig MK_DEBUG_FILES=no MK_KERNEL_SYMBOLS=no SHELL=/bin/sh NO_LINT=YES PREFIX=/usr/local  LOCALBASE=/usr/local  CC="cc" CFLAGS="-O2 -pipe  -DLIBICONV_PLUG -fstack-protector-strong -fno-strict-aliasing "  CPP="cpp" CPPFLAGS="-DLIBICONV_PLUG -I/usr/local/include"  LDFLAGS=" -L/usr/local/lib  -fstack-protector-strong " LIBS=""  CXX="c++" CXXFLAGS="-O2 -pipe -DLIBICO
NV_PLUG -fstack-protector-strong -fno-strict-aliasing  -DLIBICONV_PLUG " BSD_INSTALL_PROGRAM="install  -s -m 555"  BSD_INSTALL_LIB="install  -s -m 0644"  BSD_INSTALL_SCRIPT="install  -m 555"  BSD_INSTALL_DATA="install  -m 0644"  BSD_INSTALL_MAN="install  -m 444"
--End MAKE_ENV--

--PLIST_SUB--
TT_DATADIR=/var/db/tarantool  TT_LOGDIR=/var/log/tarantool CMAKE_BUILD_TYPE="release" OSREL=15.0 PREFIX=%D LOCALBASE=/usr/local  RESETPREFIX=/usr/local LIB32DIR=lib PERL_VERSION=5.36.3  PERL_VER=5.36  PERL5_MAN1=lib/perl5/site_perl/man/man1  PERL5_MAN3=lib/perl5/site_perl/man/man3  SITE_PERL=lib/perl5/site_perl  SITE_ARCH=lib/perl5/site_perl/mach/5.36 DOCSDIR="share/doc/tarantool"  EXAMPLESDIR="share/examples/tarantool"  DATADIR="share/tarantool"  WWWDIR="www/tarantool"  ETCDIR="etc/tarantool"
--End PLIST_SUB--

--SUB_LIST--
PREFIX=/usr/local LOCALBASE=/usr/local  DATADIR=/usr/local/share/tarantool DOCSDIR=/usr/local/share/doc/tarantool EXAMPLESDIR=/usr/local/share/examples/tarantool  WWWDIR=/usr/local/www/tarantool ETCDIR=/usr/local/etc/tarantool
--End SUB_LIST--

---Begin make.conf---
# XXX: We really need this but cannot use it while 'make checksum' does not
# try the next mirror on checksum failure.  It currently retries the same
# failed mirror and then fails rather then trying another.  It *does*
# try the next if the size is mismatched though.
#MASTER_SITE_FREEBSD=yes
# Build ALLOW_MAKE_JOBS_PACKAGES with 3 jobs
MAKE_JOBS_NUMBER=3
USE_PACKAGE_DEPENDS=yes
BATCH=yes
WRKDIRPREFIX=/wrkdirs
PORTSDIR=/usr/ports
PACKAGES=/packages
DISTDIR=/distfiles
PACKAGE_BUILDING=yes
PACKAGE_BUILDING_FLAVORS=yes
####  ####
# XXX: We really need this but cannot use it while 'make checksum' does not
# try the next mirror on checksum failure.  It currently retries the same
# failed mirror and then fails rather then trying another.  It *does*
# try the next if the size is mismatched though.
#MASTER_SITE_FREEBSD=yes
# Build ALLOW_MAKE_JOBS_PACKAGES with 3 jobs
MAKE_JOBS_NUMBER=3
#### Misc Poudriere ####
.include "/etc/make.conf.ports_env"
GID=0
UID=0
---End make.conf---
--Resource limits--
cpu time               (seconds, -t)  unlimited
file size           (512-blocks, -f)  unlimited
data seg size           (kbytes, -d)  33554432
stack size              (kbytes, -s)  524288
core file size      (512-blocks, -c)  unlimited
max memory size         (kbytes, -m)  unlimited
locked memory           (kbytes, -l)  unlimited
max user processes              (-u)  89999
open files                      (-n)  8192
virtual mem size        (kbytes, -v)  unlimited
swap limit              (kbytes, -w)  unlimited
socket buffer size       (bytes, -b)  unlimited
pseudo-terminals                (-p)  unlimited
kqueues                         (-k)  unlimited
umtx shared locks               (-o)  unlimited
--End resource limits--
=======================<phase: check-sanity   >============================
===== env: NO_DEPENDS=yes USER=root UID=0 GID=0
===>  License BSD2CLAUSE accepted by the user
===========================================================================
=======================<phase: pkg-depends    >============================
===== env: USE_PACKAGE_DEPENDS_ONLY=1 USER=root UID=0 GID=0
===>   tarantool-3.0.0 depends on file: /usr/local/sbin/pkg - not found
===>   Installing existing package /packages/All/pkg-1.21.3.pkg
[main-amd64-default-job-10] Installing pkg-1.21.3...
[main-amd64-default-job-10] Extracting pkg-1.21.3: .......... done
===>   tarantool-3.0.0 depends on file: /usr/local/sbin/pkg - found
===>   Returning to build of tarantool-3.0.0
===========================================================================
=======================<phase: fetch-depends  >============================
===== env: USE_PACKAGE_DEPENDS_ONLY=1 USER=root UID=0 GID=0
===========================================================================
=======================<phase: fetch          >============================
===== env: NO_DEPENDS=yes USER=root UID=0 GID=0
===>  License BSD2CLAUSE accepted by the user
===> Fetching all distfiles required by tarantool-3.0.0 for building
===========================================================================
=======================<phase: checksum       >============================
===== env: NO_DEPENDS=yes USER=root UID=0 GID=0
===>  License BSD2CLAUSE accepted by the user
===> Fetching all distfiles required by tarantool-3.0.0 for building
=> SHA256 Checksum OK for tarantool-3.0.0.tar.gz.
===========================================================================
=======================<phase: extract-depends>============================
===== env: USE_PACKAGE_DEPENDS_ONLY=1 USER=root UID=0 GID=0
===========================================================================
=======================<phase: extract        >============================
===== env: NO_DEPENDS=yes USER=root UID=0 GID=0
===>  License BSD2CLAUSE accepted by the user
===> Fetching all distfiles required by tarantool-3.0.0 for building
===>  Extracting for tarantool-3.0.0
=> SHA256 Checksum OK for tarantool-3.0.0.tar.gz.
===========================================================================
=======================<phase: patch-depends  >============================
===== env: USE_PACKAGE_DEPENDS_ONLY=1 USER=root UID=0 GID=0
===========================================================================
=======================<phase: patch          >============================
===== env: NO_DEPENDS=yes USER=root UID=0 GID=0
===>  Patching for tarantool-3.0.0
===>  Applying FreeBSD patches for tarantool-3.0.0 from /usr/ports/databases/tarantool/files
===========================================================================
=======================<phase: build-depends  >============================
===== env: USE_PACKAGE_DEPENDS_ONLY=1 USER=root UID=0 GID=0
===>   tarantool-3.0.0 depends on executable: gsed - not found
===>   Installing existing package /packages/All/gsed-4.9.pkg
[main-amd64-default-job-10] Installing gsed-4.9...
[main-amd64-default-job-10] `-- Installing gettext-runtime-0.22.5...
[main-amd64-default-job-10] |   `-- Installing indexinfo-0.3.1...
[main-amd64-default-job-10] |   `-- Extracting indexinfo-0.3.1: .... done
[main-amd64-default-job-10] `-- Extracting gettext-runtime-0.22.5: .......... done
[main-amd64-default-job-10] Extracting gsed-4.9: .......... done
===>   tarantool-3.0.0 depends on executable: gsed - found
<snip>
cd /wrkdirs/usr/ports/databases/tarantool/work/.build/test/unit && /usr/bin/c++ -DCORO_ASM -DDT_NAMESPACE=tnt_ -DFIBER_STACK_SIZE_DEFAULT=528384 -DLUAJIT_SMART_STRINGS=1 -DNDEBUG -DNVALGRIND -DNVALGRIND=1 -D__STDC_CONSTANT_MACROS=1 -D__STDC_FORMAT_MACROS=1 -D__STDC_LIMIT_MACROS=1 -I/wrkdirs/usr/ports/databases/tarantool/work/tarantool-3.0.0/src -I/wrkdirs/usr/ports/databases/tarantool/work/.build/src -I/wrkdirs/usr/ports/databases/tarantool/work/tarantool-3.0.0/src/lib -I/wrkdirs/usr/ports/databases/tarantool/work/tarantool-3.0.0/src/lib/small/include -I/wrkdirs/usr/ports/databases/tarantool/work/.build/src/lib/small/small/include -I/wrkdirs/usr/ports/databases/tarantool/work/tarantool-3.0.0/src/lib/small/third_party -I/wrkdirs/usr/ports/databases/tarantool/work/tarantool-3.0.0/src/lib/core -I/wrkdirs/usr/ports/databases/tarantool/work/tarantool-3.0.0/third_party -I/wrkdirs/usr/ports/databases/tarantool/work/tarantool-3.0.0/third_party/xxHash -I/wrkdirs/usr/ports/databases/t
arantool/work/tarantool-3.0.0/third_party/luajit/src -I/wrkdirs/usr/ports/databases/tarantool/work/.build/third_party/luajit/src -I/usr/local/include -I/wrkdirs/usr/ports/databases/tarantool/work/tarantool-3.0.0/src/box -O2 -pipe -DLIBICONV_PLUG -fstack-protector-strong -fno-strict-aliasing  -DLIBICONV_PLUG -fexceptions -funwind-tables -fasynchronous-unwind-tables -fno-common -Wformat -Wformat-security -Werror=format-security -fstack-protector-strong -fPIC -fmacro-prefix-map=/wrkdirs/usr/ports/databases/tarantool/work/tarantool-3.0.0=. -std=c++11 -Wall -Wextra -Wno-invalid-offsetof -Wno-gnu-alignof-expression -Wno-cast-function-type -Wno-unused-parameter -Wno-unused -Wno-unused-result -Wno-tautological-compare -O2 -pipe -DLIBICONV_PLUG -fstack-protector-strong -fno-strict-aliasing  -DLIBICONV_PLUG  -DNDEBUG -MD -MT test/unit/CMakeFiles/bps_tree_iterator.test.dir/bps_tree_iterator.cc.o -MF CMakeFiles/bps_tree_iterator.test.dir/bps_tree_iterator.cc.o.d -o CMakeFiles/bps_tree_i
terator.test.dir/bps_tree_iterator.cc.o -c /wrkdirs/usr/ports/databases/tarantool/work/tarantool-3.0.0/test/unit/bps_tree_iterator.cc
[ 75%] Linking CXX executable bps_tree_iterator.test
cd /wrkdirs/usr/ports/databases/tarantool/work/.build/test/unit && /usr/local/bin/cmake -E cmake_link_script CMakeFiles/bps_tree_iterator.test.dir/link.txt --verbose=1
/usr/bin/c++ -O2 -pipe -DLIBICONV_PLUG -fstack-protector-strong -fno-strict-aliasing  -DLIBICONV_PLUG -fexceptions -funwind-tables -fasynchronous-unwind-tables -fno-common -Wformat -Wformat-security -Werror=format-security -fstack-protector-strong -fPIC -fmacro-prefix-map=/wrkdirs/usr/ports/databases/tarantool/work/tarantool-3.0.0=. -std=c++11 -Wall -Wextra -Wno-invalid-offsetof -Wno-gnu-alignof-expression -Wno-cast-function-type -Wno-unused-parameter -Wno-unused -Wno-unused-result -Wno-tautological-compare -O2 -pipe -DLIBICONV_PLUG -fstack-protector-strong -fno-strict-aliasing  -DLIBICONV_PLUG  -DNDEBUG  -L/usr/local/lib  -fstack-protector-strong -pie -z relro -z now CMakeFiles/bps_tree_iterator.test.dir/bps_tree_iterator.cc.o -o bps_tree_iterator.test  ../../src/lib/small/libsmall.a ../../libmisc.a -lm
gmake[2]: Leaving directory '/wrkdirs/usr/ports/databases/tarantool/work/.build'
[ 75%] Built target bps_tree_iterator.test
gmake  -f test/unit/CMakeFiles/bps_tree_view.test.dir/build.make test/unit/CMakeFiles/bps_tree_view.test.dir/depend
gmake[2]: Entering directory '/wrkdirs/usr/ports/databases/tarantool/work/.build'
cd /wrkdirs/usr/ports/databases/tarantool/work/.build && /usr/local/bin/cmake -E cmake_depends "Unix Makefiles" /wrkdirs/usr/ports/databases/tarantool/work/tarantool-3.0.0 /wrkdirs/usr/ports/databases/tarantool/work/tarantool-3.0.0/test/unit /wrkdirs/usr/ports/databases/tarantool/work/.build /wrkdirs/usr/ports/databases/tarantool/work/.build/test/unit /wrkdirs/usr/ports/databases/tarantool/work/.build/test/unit/CMakeFiles/bps_tree_view.test.dir/DependInfo.cmake
gmake[2]: Leaving directory '/wrkdirs/usr/ports/databases/tarantool/work/.build'
gmake  -f test/unit/CMakeFiles/bps_tree_view.test.dir/build.make test/unit/CMakeFiles/bps_tree_view.test.dir/build
gmake[2]: Entering directory '/wrkdirs/usr/ports/databases/tarantool/work/.build'
[ 75%] Building C object test/unit/CMakeFiles/bps_tree_view.test.dir/bps_tree_view.c.o
cd /wrkdirs/usr/ports/databases/tarantool/work/.build/test/unit && /usr/bin/cc -DCORO_ASM -DDT_NAMESPACE=tnt_ -DFIBER_STACK_SIZE_DEFAULT=528384 -DLUAJIT_SMART_STRINGS=1 -DNDEBUG -DNVALGRIND -DNVALGRIND=1 -D__STDC_CONSTANT_MACROS=1 -D__STDC_FORMAT_MACROS=1 -D__STDC_LIMIT_MACROS=1 -I/wrkdirs/usr/ports/databases/tarantool/work/tarantool-3.0.0/src -I/wrkdirs/usr/ports/databases/tarantool/work/.build/src -I/wrkdirs/usr/ports/databases/tarantool/work/tarantool-3.0.0/src/lib -I/wrkdirs/usr/ports/databases/tarantool/work/tarantool-3.0.0/src/lib/small/include -I/wrkdirs/usr/ports/databases/tarantool/work/.build/src/lib/small/small/include -I/wrkdirs/usr/ports/databases/tarantool/work/tarantool-3.0.0/src/lib/small/third_party -I/wrkdirs/usr/ports/databases/tarantool/work/tarantool-3.0.0/src/lib/core -I/wrkdirs/usr/ports/databases/tarantool/work/tarantool-3.0.0/third_party -I/wrkdirs/usr/ports/databases/tarantool/work/tarantool-3.0.0/third_party/xxHash -I/wrkdirs/usr/ports/databases/ta
rantool/work/tarantool-3.0.0/third_party/luajit/src -I/wrkdirs/usr/ports/databases/tarantool/work/.build/third_party/luajit/src -I/usr/local/include -I/wrkdirs/usr/ports/databases/tarantool/work/tarantool-3.0.0/src/box -O2 -pipe  -DLIBICONV_PLUG -fstack-protector-strong -fno-strict-aliasing -fexceptions -funwind-tables -fasynchronous-unwind-tables -fno-common -Wformat -Wformat-security -Werror=format-security -fstack-protector-strong -fPIC -fmacro-prefix-map=/wrkdirs/usr/ports/databases/tarantool/work/tarantool-3.0.0=. -std=c11 -Wall -Wextra -Wno-gnu-alignof-expression -Wno-cast-function-type -Wno-unused-parameter -Wno-unused -Wno-unused-result -Wno-tautological-compare -O2 -pipe  -DLIBICONV_PLUG -fstack-protector-strong -fno-strict-aliasing  -DNDEBUG -MD -MT test/unit/CMakeFiles/bps_tree_view.test.dir/bps_tree_view.c.o -MF CMakeFiles/bps_tree_view.test.dir/bps_tree_view.c.o.d -o CMakeFiles/bps_tree_view.test.dir/bps_tree_view.c.o -c /wrkdirs/usr/ports/databases/tarantool/wo
rk/tarantool-3.0.0/test/unit/bps_tree_view.c
[ 77%] Linking C executable bps_tree_view.test
cd /wrkdirs/usr/ports/databases/tarantool/work/.build/test/unit && /usr/local/bin/cmake -E cmake_link_script CMakeFiles/bps_tree_view.test.dir/link.txt --verbose=1
/usr/bin/cc -O2 -pipe  -DLIBICONV_PLUG -fstack-protector-strong -fno-strict-aliasing -fexceptions -funwind-tables -fasynchronous-unwind-tables -fno-common -Wformat -Wformat-security -Werror=format-security -fstack-protector-strong -fPIC -fmacro-prefix-map=/wrkdirs/usr/ports/databases/tarantool/work/tarantool-3.0.0=. -std=c11 -Wall -Wextra -Wno-gnu-alignof-expression -Wno-cast-function-type -Wno-unused-parameter -Wno-unused -Wno-unused-result -Wno-tautological-compare -O2 -pipe  -DLIBICONV_PLUG -fstack-protector-strong -fno-strict-aliasing  -DNDEBUG  -L/usr/local/lib  -fstack-protector-strong -pie -z relro -z now CMakeFiles/bps_tree_view.test.dir/bps_tree_view.c.o -o bps_tree_view.test  ../../src/lib/small/libsmall.a libunit.a -lm
gmake[2]: Leaving directory '/wrkdirs/usr/ports/databases/tarantool/work/.build'
[ 77%] Built target bps_tree_view.test
gmake  -f test/unit/CMakeFiles/rtree.test.dir/build.make test/unit/CMakeFiles/rtree.test.dir/depend
gmake[2]: Entering directory '/wrkdirs/usr/ports/databases/tarantool/work/.build'
cd /wrkdirs/usr/ports/databases/tarantool/work/.build && /usr/local/bin/cmake -E cmake_depends "Unix Makefiles" /wrkdirs/usr/ports/databases/tarantool/work/tarantool-3.0.0 /wrkdirs/usr/ports/databases/tarantool/work/tarantool-3.0.0/test/unit /wrkdirs/usr/ports/databases/tarantool/work/.build /wrkdirs/usr/ports/databases/tarantool/work/.build/test/unit /wrkdirs/usr/ports/databases/tarantool/work/.build/test/unit/CMakeFiles/rtree.test.dir/DependInfo.cmake
gmake[2]: Leaving directory '/wrkdirs/usr/ports/databases/tarantool/work/.build'
gmake  -f test/unit/CMakeFiles/rtree.test.dir/build.make test/unit/CMakeFiles/rtree.test.dir/build
gmake[2]: Entering directory '/wrkdirs/usr/ports/databases/tarantool/work/.build'
[ 77%] Building CXX object test/unit/CMakeFiles/rtree.test.dir/rtree.cc.o
cd /wrkdirs/usr/ports/databases/tarantool/work/.build/test/unit && /usr/bin/c++ -DCORO_ASM -DDT_NAMESPACE=tnt_ -DFIBER_STACK_SIZE_DEFAULT=528384 -DLUAJIT_SMART_STRINGS=1 -DNDEBUG -DNVALGRIND -DNVALGRIND=1 -D__STDC_CONSTANT_MACROS=1 -D__STDC_FORMAT_MACROS=1 -D__STDC_LIMIT_MACROS=1 -I/wrkdirs/usr/ports/databases/tarantool/work/tarantool-3.0.0/src -I/wrkdirs/usr/ports/databases/tarantool/work/.build/src -I/wrkdirs/usr/ports/databases/tarantool/work/tarantool-3.0.0/src/lib -I/wrkdirs/usr/ports/databases/tarantool/work/tarantool-3.0.0/src/lib/small/include -I/wrkdirs/usr/ports/databases/tarantool/work/.build/src/lib/small/small/include -I/wrkdirs/usr/ports/databases/tarantool/work/tarantool-3.0.0/src/lib/small/third_party -I/wrkdirs/usr/ports/databases/tarantool/work/tarantool-3.0.0/src/lib/core -I/wrkdirs/usr/ports/databases/tarantool/work/tarantool-3.0.0/third_party -I/wrkdirs/usr/ports/databases/tarantool/work/tarantool-3.0.0/third_party/xxHash -I/wrkdirs/usr/ports/databases/t
arantool/work/tarantool-3.0.0/third_party/luajit/src -I/wrkdirs/usr/ports/databases/tarantool/work/.build/third_party/luajit/src -I/usr/local/include -I/wrkdirs/usr/ports/databases/tarantool/work/tarantool-3.0.0/src/box -O2 -pipe -DLIBICONV_PLUG -fstack-protector-strong -fno-strict-aliasing  -DLIBICONV_PLUG -fexceptions -funwind-tables -fasynchronous-unwind-tables -fno-common -Wformat -Wformat-security -Werror=format-security -fstack-protector-strong -fPIC -fmacro-prefix-map=/wrkdirs/usr/ports/databases/tarantool/work/tarantool-3.0.0=. -std=c++11 -Wall -Wextra -Wno-invalid-offsetof -Wno-gnu-alignof-expression -Wno-cast-function-type -Wno-unused-parameter -Wno-unused -Wno-unused-result -Wno-tautological-compare -O2 -pipe -DLIBICONV_PLUG -fstack-protector-strong -fno-strict-aliasing  -DLIBICONV_PLUG  -DNDEBUG -MD -MT test/unit/CMakeFiles/rtree.test.dir/rtree.cc.o -MF CMakeFiles/rtree.test.dir/rtree.cc.o.d -o CMakeFiles/rtree.test.dir/rtree.cc.o -c /wrkdirs/usr/ports/databases/
tarantool/work/tarantool-3.0.0/test/unit/rtree.cc
[ 77%] Linking CXX executable rtree.test
cd /wrkdirs/usr/ports/databases/tarantool/work/.build/test/unit && /usr/local/bin/cmake -E cmake_link_script CMakeFiles/rtree.test.dir/link.txt --verbose=1
/usr/bin/c++ -O2 -pipe -DLIBICONV_PLUG -fstack-protector-strong -fno-strict-aliasing  -DLIBICONV_PLUG -fexceptions -funwind-tables -fasynchronous-unwind-tables -fno-common -Wformat -Wformat-security -Werror=format-security -fstack-protector-strong -fPIC -fmacro-prefix-map=/wrkdirs/usr/ports/databases/tarantool/work/tarantool-3.0.0=. -std=c++11 -Wall -Wextra -Wno-invalid-offsetof -Wno-gnu-alignof-expression -Wno-cast-function-type -Wno-unused-parameter -Wno-unused -Wno-unused-result -Wno-tautological-compare -O2 -pipe -DLIBICONV_PLUG -fstack-protector-strong -fno-strict-aliasing  -DLIBICONV_PLUG  -DNDEBUG  -L/usr/local/lib  -fstack-protector-strong -pie -z relro -z now CMakeFiles/rtree.test.dir/rtree.cc.o -o rtree.test  ../../src/lib/salad/libsalad.a ../../src/lib/small/libsmall.a -lm
gmake[2]: Leaving directory '/wrkdirs/usr/ports/databases/tarantool/work/.build'
[ 77%] Built target rtree.test
gmake  -f test/unit/CMakeFiles/rtree_iterator.test.dir/build.make test/unit/CMakeFiles/rtree_iterator.test.dir/depend
gmake[2]: Entering directory '/wrkdirs/usr/ports/databases/tarantool/work/.build'
cd /wrkdirs/usr/ports/databases/tarantool/work/.build && /usr/local/bin/cmake -E cmake_depends "Unix Makefiles" /wrkdirs/usr/ports/databases/tarantool/work/tarantool-3.0.0 /wrkdirs/usr/ports/databases/tarantool/work/tarantool-3.0.0/test/unit /wrkdirs/usr/ports/databases/tarantool/work/.build /wrkdirs/usr/ports/databases/tarantool/work/.build/test/unit /wrkdirs/usr/ports/databases/tarantool/work/.build/test/unit/CMakeFiles/rtree_iterator.test.dir/DependInfo.cmake
gmake[2]: Leaving directory '/wrkdirs/usr/ports/databases/tarantool/work/.build'
gmake  -f test/unit/CMakeFiles/rtree_iterator.test.dir/build.make test/unit/CMakeFiles/rtree_iterator.test.dir/build
gmake[2]: Entering directory '/wrkdirs/usr/ports/databases/tarantool/work/.build'
[ 77%] Building CXX object test/unit/CMakeFiles/rtree_iterator.test.dir/rtree_iterator.cc.o
cd /wrkdirs/usr/ports/databases/tarantool/work/.build/test/unit && /usr/bin/c++ -DCORO_ASM -DDT_NAMESPACE=tnt_ -DFIBER_STACK_SIZE_DEFAULT=528384 -DLUAJIT_SMART_STRINGS=1 -DNDEBUG -DNVALGRIND -DNVALGRIND=1 -D__STDC_CONSTANT_MACROS=1 -D__STDC_FORMAT_MACROS=1 -D__STDC_LIMIT_MACROS=1 -I/wrkdirs/usr/ports/databases/tarantool/work/tarantool-3.0.0/src -I/wrkdirs/usr/ports/databases/tarantool/work/.build/src -I/wrkdirs/usr/ports/databases/tarantool/work/tarantool-3.0.0/src/lib -I/wrkdirs/usr/ports/databases/tarantool/work/tarantool-3.0.0/src/lib/small/include -I/wrkdirs/usr/ports/databases/tarantool/work/.build/src/lib/small/small/include -I/wrkdirs/usr/ports/databases/tarantool/work/tarantool-3.0.0/src/lib/small/third_party -I/wrkdirs/usr/ports/databases/tarantool/work/tarantool-3.0.0/src/lib/core -I/wrkdirs/usr/ports/databases/tarantool/work/tarantool-3.0.0/third_party -I/wrkdirs/usr/ports/databases/tarantool/work/tarantool-3.0.0/third_party/xxHash -I/wrkdirs/usr/ports/databases/t
arantool/work/tarantool-3.0.0/third_party/luajit/src -I/wrkdirs/usr/ports/databases/tarantool/work/.build/third_party/luajit/src -I/usr/local/include -I/wrkdirs/usr/ports/databases/tarantool/work/tarantool-3.0.0/src/box -O2 -pipe -DLIBICONV_PLUG -fstack-protector-strong -fno-strict-aliasing  -DLIBICONV_PLUG -fexceptions -funwind-tables -fasynchronous-unwind-tables -fno-common -Wformat -Wformat-security -Werror=format-security -fstack-protector-strong -fPIC -fmacro-prefix-map=/wrkdirs/usr/ports/databases/tarantool/work/tarantool-3.0.0=. -std=c++11 -Wall -Wextra -Wno-invalid-offsetof -Wno-gnu-alignof-expression -Wno-cast-function-type -Wno-unused-parameter -Wno-unused -Wno-unused-result -Wno-tautological-compare -O2 -pipe -DLIBICONV_PLUG -fstack-protector-strong -fno-strict-aliasing  -DLIBICONV_PLUG  -DNDEBUG -MD -MT test/unit/CMakeFiles/rtree_iterator.test.dir/rtree_iterator.cc.o -MF CMakeFiles/rtree_iterator.test.dir/rtree_iterator.cc.o.d -o CMakeFiles/rtree_iterator.test.di
r/rtree_iterator.cc.o -c /wrkdirs/usr/ports/databases/tarantool/work/tarantool-3.0.0/test/unit/rtree_iterator.cc
[ 77%] Linking CXX executable rtree_iterator.test
cd /wrkdirs/usr/ports/databases/tarantool/work/.build/test/unit && /usr/local/bin/cmake -E cmake_link_script CMakeFiles/rtree_iterator.test.dir/link.txt --verbose=1
/usr/bin/c++ -O2 -pipe -DLIBICONV_PLUG -fstack-protector-strong -fno-strict-aliasing  -DLIBICONV_PLUG -fexceptions -funwind-tables -fasynchronous-unwind-tables -fno-common -Wformat -Wformat-security -Werror=format-security -fstack-protector-strong -fPIC -fmacro-prefix-map=/wrkdirs/usr/ports/databases/tarantool/work/tarantool-3.0.0=. -std=c++11 -Wall -Wextra -Wno-invalid-offsetof -Wno-gnu-alignof-expression -Wno-cast-function-type -Wno-unused-parameter -Wno-unused -Wno-unused-result -Wno-tautological-compare -O2 -pipe -DLIBICONV_PLUG -fstack-protector-strong -fno-strict-aliasing  -DLIBICONV_PLUG  -DNDEBUG  -L/usr/local/lib  -fstack-protector-strong -pie -z relro -z now CMakeFiles/rtree_iterator.test.dir/rtree_iterator.cc.o -o rtree_iterator.test  ../../src/lib/salad/libsalad.a ../../src/lib/small/libsmall.a -lm
gmake[2]: Leaving directory '/wrkdirs/usr/ports/databases/tarantool/work/.build'
[ 77%] Built target rtree_iterator.test
gmake  -f test/unit/CMakeFiles/rtree_multidim.test.dir/build.make test/unit/CMakeFiles/rtree_multidim.test.dir/depend
gmake[2]: Entering directory '/wrkdirs/usr/ports/databases/tarantool/work/.build'
cd /wrkdirs/usr/ports/databases/tarantool/work/.build && /usr/local/bin/cmake -E cmake_depends "Unix Makefiles" /wrkdirs/usr/ports/databases/tarantool/work/tarantool-3.0.0 /wrkdirs/usr/ports/databases/tarantool/work/tarantool-3.0.0/test/unit /wrkdirs/usr/ports/databases/tarantool/work/.build /wrkdirs/usr/ports/databases/tarantool/work/.build/test/unit /wrkdirs/usr/ports/databases/tarantool/work/.build/test/unit/CMakeFiles/rtree_multidim.test.dir/DependInfo.cmake
gmake[2]: Leaving directory '/wrkdirs/usr/ports/databases/tarantool/work/.build'
gmake  -f test/unit/CMakeFiles/rtree_multidim.test.dir/build.make test/unit/CMakeFiles/rtree_multidim.test.dir/build
gmake[2]: Entering directory '/wrkdirs/usr/ports/databases/tarantool/work/.build'
[ 78%] Building CXX object test/unit/CMakeFiles/rtree_multidim.test.dir/rtree_multidim.cc.o
cd /wrkdirs/usr/ports/databases/tarantool/work/.build/test/unit && /usr/bin/c++ -DCORO_ASM -DDT_NAMESPACE=tnt_ -DFIBER_STACK_SIZE_DEFAULT=528384 -DLUAJIT_SMART_STRINGS=1 -DNDEBUG -DNVALGRIND -DNVALGRIND=1 -D__STDC_CONSTANT_MACROS=1 -D__STDC_FORMAT_MACROS=1 -D__STDC_LIMIT_MACROS=1 -I/wrkdirs/usr/ports/databases/tarantool/work/tarantool-3.0.0/src -I/wrkdirs/usr/ports/databases/tarantool/work/.build/src -I/wrkdirs/usr/ports/databases/tarantool/work/tarantool-3.0.0/src/lib -I/wrkdirs/usr/ports/databases/tarantool/work/tarantool-3.0.0/src/lib/small/include -I/wrkdirs/usr/ports/databases/tarantool/work/.build/src/lib/small/small/include -I/wrkdirs/usr/ports/databases/tarantool/work/tarantool-3.0.0/src/lib/small/third_party -I/wrkdirs/usr/ports/databases/tarantool/work/tarantool-3.0.0/src/lib/core -I/wrkdirs/usr/ports/databases/tarantool/work/tarantool-3.0.0/third_party -I/wrkdirs/usr/ports/databases/tarantool/work/tarantool-3.0.0/third_party/xxHash -I/wrkdirs/usr/ports/databases/t
arantool/work/tarantool-3.0.0/third_party/luajit/src -I/wrkdirs/usr/ports/databases/tarantool/work/.build/third_party/luajit/src -I/usr/local/include -I/wrkdirs/usr/ports/databases/tarantool/work/tarantool-3.0.0/src/box -O2 -pipe -DLIBICONV_PLUG -fstack-protector-strong -fno-strict-aliasing  -DLIBICONV_PLUG -fexceptions -funwind-tables -fasynchronous-unwind-tables -fno-common -Wformat -Wformat-security -Werror=format-security -fstack-protector-strong -fPIC -fmacro-prefix-map=/wrkdirs/usr/ports/databases/tarantool/work/tarantool-3.0.0=. -std=c++11 -Wall -Wextra -Wno-invalid-offsetof -Wno-gnu-alignof-expression -Wno-cast-function-type -Wno-unused-parameter -Wno-unused -Wno-unused-result -Wno-tautological-compare -O2 -pipe -DLIBICONV_PLUG -fstack-protector-strong -fno-strict-aliasing  -DLIBICONV_PLUG  -DNDEBUG -MD -MT test/unit/CMakeFiles/rtree_multidim.test.dir/rtree_multidim.cc.o -MF CMakeFiles/rtree_multidim.test.dir/rtree_multidim.cc.o.d -o CMakeFiles/rtree_multidim.test.di
r/rtree_multidim.cc.o -c /wrkdirs/usr/ports/databases/tarantool/work/tarantool-3.0.0/test/unit/rtree_multidim.cc
In file included from /wrkdirs/usr/ports/databases/tarantool/work/tarantool-3.0.0/test/unit/rtree_multidim.cc:9:
In file included from /usr/include/c++/v1/vector:325:
In file included from /usr/include/c++/v1/__format/formatter_bool.h:20:
In file included from /usr/include/c++/v1/__format/formatter_integral.h:35:
In file included from /usr/include/c++/v1/locale:202:
/usr/include/c++/v1/__locale:478:33: error: a type specifier is required for all declarations
  478 |   _LIBCPP_HIDE_FROM_ABI bool is(mask __m, char_type __c) const { return do_is(__m, __c); }
      |                                 ^
/usr/include/c++/v1/__locale:478:30: error: expected ')'
  478 |   _LIBCPP_HIDE_FROM_ABI bool is(mask __m, char_type __c) const { return do_is(__m, __c); }
      |                              ^
/wrkdirs/usr/ports/databases/tarantool/work/tarantool-3.0.0/test/unit/unit.h:118:33: note: expanded from macro 'is'
  118 | #define is(a, b, ...)           _ok0((a) == (b), #a " == " #b, ##__VA_ARGS__)
      |                                          ^
/usr/include/c++/v1/__locale:478:30: note: to match this '('
/wrkdirs/usr/ports/databases/tarantool/work/tarantool-3.0.0/test/unit/unit.h:118:24: note: expanded from macro 'is'
  118 | #define is(a, b, ...)           _ok0((a) == (b), #a " == " #b, ##__VA_ARGS__)
      |                                 ^
/wrkdirs/usr/ports/databases/tarantool/work/tarantool-3.0.0/test/unit/unit.h:115:11: note: expanded from macro '_ok0'
  115 |                      _ok(cond, expr, __FILE__, __LINE__, "line %d", __LINE__))
      |                         ^
In file included from /wrkdirs/usr/ports/databases/tarantool/work/tarantool-3.0.0/test/unit/rtree_multidim.cc:9:
In file included from /usr/include/c++/v1/vector:325:
In file included from /usr/include/c++/v1/__format/formatter_bool.h:20:
In file included from /usr/include/c++/v1/__format/formatter_integral.h:35:
In file included from /usr/include/c++/v1/locale:202:
/usr/include/c++/v1/__locale:480:45: error: a type specifier is required for all declarations
  480 |   _LIBCPP_HIDE_FROM_ABI const char_type* is(const char_type* __low, const char_type* __high, mask* __vec) const {
      |                                             ^
/usr/include/c++/v1/__locale:480:42: error: expected ')'
  480 |   _LIBCPP_HIDE_FROM_ABI const char_type* is(const char_type* __low, const char_type* __high, mask* __vec) const {
      |                                          ^
/wrkdirs/usr/ports/databases/tarantool/work/tarantool-3.0.0/test/unit/unit.h:118:33: note: expanded from macro 'is'
  118 | #define is(a, b, ...)           _ok0((a) == (b), #a " == " #b, ##__VA_ARGS__)
      |                                          ^
/usr/include/c++/v1/__locale:480:42: note: to match this '('
/wrkdirs/usr/ports/databases/tarantool/work/tarantool-3.0.0/test/unit/unit.h:118:24: note: expanded from macro 'is'
  118 | #define is(a, b, ...)           _ok0((a) == (b), #a " == " #b, ##__VA_ARGS__)
      |                                 ^
/wrkdirs/usr/ports/databases/tarantool/work/tarantool-3.0.0/test/unit/unit.h:114:11: note: expanded from macro '_ok0'
  114 |                      _ok(cond, expr, __FILE__, __LINE__, __VA_ARGS__),  \
      |                         ^
In file included from /wrkdirs/usr/ports/databases/tarantool/work/tarantool-3.0.0/test/unit/rtree_multidim.cc:9:
In file included from /usr/include/c++/v1/vector:325:
In file included from /usr/include/c++/v1/__format/formatter_bool.h:20:
In file included from /usr/include/c++/v1/__format/formatter_integral.h:35:
In file included from /usr/include/c++/v1/locale:202:
/usr/include/c++/v1/__locale:478:79: error: use of undeclared identifier '__m'
  478 |   _LIBCPP_HIDE_FROM_ABI bool is(mask __m, char_type __c) const { return do_is(__m, __c); }
      |                                                                               ^
/usr/include/c++/v1/__locale:478:84: error: use of undeclared identifier '__c'
  478 |   _LIBCPP_HIDE_FROM_ABI bool is(mask __m, char_type __c) const { return do_is(__m, __c); }
      |                                                                                    ^
/usr/include/c++/v1/__locale:481:18: error: use of undeclared identifier '__low'
  481 |     return do_is(__low, __high, __vec);
      |                  ^
/usr/include/c++/v1/__locale:481:25: error: use of undeclared identifier '__high'
  481 |     return do_is(__low, __high, __vec);
      |                         ^
/usr/include/c++/v1/__locale:481:33: error: use of undeclared identifier '__vec'
  481 |     return do_is(__low, __high, __vec);
      |                                 ^
/usr/include/c++/v1/__locale:547:33: error: a type specifier is required for all declarations
  547 |   _LIBCPP_HIDE_FROM_ABI bool is(mask __m, char_type __c) const {
      |                                 ^
/usr/include/c++/v1/__locale:547:30: error: expected ')'
  547 |   _LIBCPP_HIDE_FROM_ABI bool is(mask __m, char_type __c) const {
      |                              ^
/wrkdirs/usr/ports/databases/tarantool/work/tarantool-3.0.0/test/unit/unit.h:118:33: note: expanded from macro 'is'
  118 | #define is(a, b, ...)           _ok0((a) == (b), #a " == " #b, ##__VA_ARGS__)
      |                                          ^
/usr/include/c++/v1/__locale:547:30: note: to match this '('
/wrkdirs/usr/ports/databases/tarantool/work/tarantool-3.0.0/test/unit/unit.h:118:24: note: expanded from macro 'is'
  118 | #define is(a, b, ...)           _ok0((a) == (b), #a " == " #b, ##__VA_ARGS__)
      |                                 ^
/wrkdirs/usr/ports/databases/tarantool/work/tarantool-3.0.0/test/unit/unit.h:115:11: note: expanded from macro '_ok0'
  115 |                      _ok(cond, expr, __FILE__, __LINE__, "line %d", __LINE__))
      |                         ^
In file included from /wrkdirs/usr/ports/databases/tarantool/work/tarantool-3.0.0/test/unit/rtree_multidim.cc:9:
In file included from /usr/include/c++/v1/vector:325:
In file included from /usr/include/c++/v1/__format/formatter_bool.h:20:
In file included from /usr/include/c++/v1/__format/formatter_integral.h:35:
In file included from /usr/include/c++/v1/locale:202:
/usr/include/c++/v1/__locale:551:45: error: a type specifier is required for all declarations
  551 |   _LIBCPP_HIDE_FROM_ABI const char_type* is(const char_type* __low, const char_type* __high, mask* __vec) const {
      |                                             ^
/usr/include/c++/v1/__locale:551:42: error: expected ')'
  551 |   _LIBCPP_HIDE_FROM_ABI const char_type* is(const char_type* __low, const char_type* __high, mask* __vec) const {
      |                                          ^
/wrkdirs/usr/ports/databases/tarantool/work/tarantool-3.0.0/test/unit/unit.h:118:33: note: expanded from macro 'is'
  118 | #define is(a, b, ...)           _ok0((a) == (b), #a " == " #b, ##__VA_ARGS__)
      |                                          ^
/usr/include/c++/v1/__locale:551:42: note: to match this '('
/wrkdirs/usr/ports/databases/tarantool/work/tarantool-3.0.0/test/unit/unit.h:118:24: note: expanded from macro 'is'
  118 | #define is(a, b, ...)           _ok0((a) == (b), #a " == " #b, ##__VA_ARGS__)
      |                                 ^
/wrkdirs/usr/ports/databases/tarantool/work/tarantool-3.0.0/test/unit/unit.h:114:11: note: expanded from macro '_ok0'
  114 |                      _ok(cond, expr, __FILE__, __LINE__, __VA_ARGS__),  \
      |                         ^
In file included from /wrkdirs/usr/ports/databases/tarantool/work/tarantool-3.0.0/test/unit/rtree_multidim.cc:9:
In file included from /usr/include/c++/v1/vector:325:
In file included from /usr/include/c++/v1/__format/formatter_bool.h:20:
In file included from /usr/include/c++/v1/__format/formatter_integral.h:35:
In file included from /usr/include/c++/v1/locale:202:
/usr/include/c++/v1/__locale:548:20: error: use of undeclared identifier '__c'; did you mean '__1'?
  548 |     return isascii(__c) ? (__tab_[static_cast<int>(__c)] & __m) != 0 : false;
      |                    ^
/usr/include/c++/v1/__locale:60:1: note: '__1' declared here
   60 | _LIBCPP_BEGIN_NAMESPACE_STD
      | ^
/usr/include/c++/v1/__config:888:49: note: expanded from macro '_LIBCPP_BEGIN_NAMESPACE_STD'
  888 |                                inline namespace _LIBCPP_ABI_NAMESPACE {
      |                                                 ^
/usr/include/c++/v1/__config_site:13:31: note: expanded from macro '_LIBCPP_ABI_NAMESPACE'
   13 | #define _LIBCPP_ABI_NAMESPACE __1
      |                               ^
In file included from /wrkdirs/usr/ports/databases/tarantool/work/tarantool-3.0.0/test/unit/rtree_multidim.cc:9:
In file included from /usr/include/c++/v1/vector:325:
In file included from /usr/include/c++/v1/__format/formatter_bool.h:20:
In file included from /usr/include/c++/v1/__format/formatter_integral.h:35:
In file included from /usr/include/c++/v1/locale:202:
/usr/include/c++/v1/__locale:548:20: error: unexpected namespace name '__1': expected expression
  548 |     return isascii(__c) ? (__tab_[static_cast<int>(__c)] & __m) != 0 : false;
      |                    ^
/usr/include/c++/v1/__locale:548:52: error: use of undeclared identifier '__c'
  548 |     return isascii(__c) ? (__tab_[static_cast<int>(__c)] & __m) != 0 : false;
      |                                                    ^
/usr/include/c++/v1/__locale:548:60: error: use of undeclared identifier '__m'
  548 |     return isascii(__c) ? (__tab_[static_cast<int>(__c)] & __m) != 0 : false;
      |                                                            ^
/usr/include/c++/v1/__locale:552:12: error: use of undeclared identifier '__low'
  552 |     for (; __low != __high; ++__low, ++__vec)
      |            ^
/usr/include/c++/v1/__locale:552:21: error: use of undeclared identifier '__high'
  552 |     for (; __low != __high; ++__low, ++__vec)
      |                     ^
fatal error: too many errors emitted, stopping now [-ferror-limit=]
20 errors generated.
gmake[2]: *** [test/unit/CMakeFiles/rtree_multidim.test.dir/build.make:79: test/unit/CMakeFiles/rtree_multidim.test.dir/rtree_multidim.cc.o] Error 1
gmake[2]: Leaving directory '/wrkdirs/usr/ports/databases/tarantool/work/.build'
gmake[1]: *** [CMakeFiles/Makefile2:7698: test/unit/CMakeFiles/rtree_multidim.test.dir/all] Error 2
gmake[1]: Leaving directory '/wrkdirs/usr/ports/databases/tarantool/work/.build'
gmake: *** [Makefile:159: all] Error 2
*** Error code 1

Stop.
make: stopped in /usr/ports/databases/tarantool