[package - 132i386-default][emulators/qemu-devel] Failed for qemu-devel-8.3.0.20240229 in build
- Go to: [ bottom of page ] [ top of archives ] [ this month ]
Date: Fri, 07 Jun 2024 11:51:33 UTC
You are receiving this mail as a port that you maintain
is failing to build on the FreeBSD package build server.
Please investigate the failure and submit a PR to fix
build.
Maintainer: bofh@FreeBSD.org
Log URL: https://pkg-status.freebsd.org/beefy15/data/132i386-default/3905913943f0/logs/qemu-devel-8.3.0.20240229.log
Build URL: https://pkg-status.freebsd.org/beefy15/build.html?mastername=132i386-default&build=3905913943f0
Log:
=>> Building emulators/qemu-devel
build started at Fri Jun 7 11:27:27 UTC 2024
port directory: /usr/ports/emulators/qemu-devel
package name: qemu-devel-8.3.0.20240229
building for: FreeBSD 132i386-default-job-11 13.2-RELEASE-p11 FreeBSD 13.2-RELEASE-p11 i386
maintained by: bofh@FreeBSD.org
Makefile datestamp: -rw-r--r-- 1 root wheel 5974 Apr 6 01:01 /usr/ports/emulators/qemu-devel/Makefile
Ports top last git commit: 3905913943f
Ports top unclean checkout: no
Port dir last git commit: abf68fe4a24
Port dir unclean checkout: no
Poudriere version: poudriere-git-3.4.1-30-g79e3edcd
Host OSVERSION: 1500018
Jail OSVERSION: 1302001
Job Id: 11
---Begin Environment---
SHELL=/bin/csh
BLOCKSIZE=K
MAIL=/var/mail/root
MM_CHARSET=UTF-8
LANG=C.UTF-8
OSVERSION=1302001
STATUS=1
HOME=/root
PATH=/sbin:/bin:/usr/sbin:/usr/bin:/usr/local/sbin:/usr/local/bin:/root/bin
MAKE_OBJDIR_CHECK_WRITABLE=0
UNAME_m=i386
UNAME_p=i386
UNAME_r=13.2-RELEASE-p11
LOCALBASE=/usr/local
UNAME_v=FreeBSD 13.2-RELEASE-p11
USER=root
POUDRIERE_NAME=poudriere-git
LIBEXECPREFIX=/usr/local/libexec/poudriere
POUDRIERE_VERSION=3.4.1-30-g79e3edcd
MASTERMNT=/usr/local/poudriere/data/.m/132i386-default/ref
LC_COLLATE=C
POUDRIERE_BUILD_TYPE=bulk
PACKAGE_BUILDING=yes
SAVED_TERM=
OUTPUT_REDIRECTED_STDERR=4
OUTPUT_REDIRECTED=1
PWD=/usr/local/poudriere/data/.m/132i386-default/11/.p
OUTPUT_REDIRECTED_STDOUT=3
P_PORTS_FEATURES=FLAVORS SUBPACKAGES SELECTED_OPTIONS
MASTERNAME=132i386-default
SCRIPTPREFIX=/usr/local/share/poudriere
SCRIPTNAME=bulk.sh
OLDPWD=/usr/local/poudriere/data/.m/132i386-default/ref/.p/pool
POUDRIERE_PKGNAME=poudriere-git-3.4.1-30-g79e3edcd
SCRIPTPATH=/usr/local/share/poudriere/bulk.sh
POUDRIEREPATH=/usr/local/bin/poudriere
---End Environment---
---Begin Poudriere Port Flags/Env---
PORT_FLAGS=
PKGENV=
FLAVOR=
MAKE_ARGS=
---End Poudriere Port Flags/Env---
---Begin OPTIONS List---
===> The following configuration options are available for qemu-devel-8.3.0.20240229:
CAPSTONE=on: Disassembly framework support
CDROM_DMA=on: IDE CDROM DMA
CURL=on: Data transfer support via cURL
DOCS=on: Build and/or install documentation
GNUTLS=on: gnutls dependency (vnc encryption)
GTK3=on: GTK 3 GUI toolkit support
JPEG=on: jpeg dependency (vnc lossy compression)
OPENGL=on: 2D/3D rendering support via OpenGL
PNG=on: png dependency (vnc compression)
SAMBA=off: samba dependency (for -smb)
SASL=on: cyrus-sasl dependency (vnc encryption)
STATIC_LINK=off: Statically link the executables
USBREDIR=off: usb device network redirection (experimental!)
VDE=on: vde dependency (for vde networking)
X11=on: X11 (graphics) support
X86_TARGETS=off: Build only x86 system targets
====> Console (text) interface support: you have to select exactly one of them
NCURSES_DEFAULT=on: Depend on ncurses (ports if installed, otherwise base)
NCURSES_BASE=off: Depend on ncurses in base
NCURSES_PORT=off: Depend on devel/ncurses in ports
===> Use 'make config' to modify these settings
---End OPTIONS List---
--MAINTAINER--
bofh@FreeBSD.org
--End MAINTAINER--
--CONFIGURE_ARGS--
--localstatedir=/var --mandir=share/man --extra-ldflags=-L\"/usr/lib\" --extra-ldflags=-L\"/usr/local/lib\" --enable-debug --prefix=/usr/local --cc=cc --enable-netmap --disable-kvm --disable-linux-user --disable-linux-aio --disable-xen --enable-debug-info --python=/usr/local/bin/python3.11 --disable-guest-agent --extra-cflags=-I/wrkdirs/usr/ports/emulators/qemu-devel/work/qemu-ff202817dc2b0b3b42992fa7f1ce503f081068fe\ -I/usr/local/include\ -DPREFIX=\\\"\"/usr/local\\\"\" --enable-capstone --extra-cflags=-I/usr/local/include/capstone --enable-docs --disable-usb-redir --enable-sdl
--End CONFIGURE_ARGS--
--CONFIGURE_ENV--
MAKE=gmake ac_cv_path_PERL=/usr/local/bin/perl ac_cv_path_PERL_PATH=/usr/local/bin/perl PERL_USE_UNSAFE_INC=1 PKG_CONFIG=pkgconf PYTHON="/usr/local/bin/python3.11" SDL2_CONFIG=/usr/local/bin/sdl2-config XDG_DATA_HOME=/wrkdirs/usr/ports/emulators/qemu-devel/work XDG_CONFIG_HOME=/wrkdirs/usr/ports/emulators/qemu-devel/work XDG_CACHE_HOME=/wrkdirs/usr/ports/emulators/qemu-devel/work/.cache HOME=/wrkdirs/usr/ports/emulators/qemu-devel/work TMPDIR="/tmp" PATH=/wrkdirs/usr/ports/emulators/qemu-devel/work/.bin:/sbin:/bin:/usr/sbin:/usr/bin:/usr/local/sbin:/usr/local/bin:/root/bin PKG_CONFIG_LIBDIR=/wrkdirs/usr/ports/emulators/qemu-devel/work/.pkgconfig:/usr/local/libdata/pkgconfig:/usr/local/share/pkgconfig:/usr/libdata/pkgconfig SHELL=/bin/sh CONFIG_SHELL=/bin/sh CMAKE_PREFIX_PATH="/usr/local"
--End CONFIGURE_ENV--
--MAKE_ENV--
NINJA_STATUS="[%p %s/%t] " PERL_USE_UNSAFE_INC=1 SDL2_CONFIG=/usr/local/bin/sdl2-config XDG_DATA_HOME=/wrkdirs/usr/ports/emulators/qemu-devel/work XDG_CONFIG_HOME=/wrkdirs/usr/ports/emulators/qemu-devel/work XDG_CACHE_HOME=/wrkdirs/usr/ports/emulators/qemu-devel/work/.cache HOME=/wrkdirs/usr/ports/emulators/qemu-devel/work TMPDIR="/tmp" PATH=/wrkdirs/usr/ports/emulators/qemu-devel/work/.bin:/sbin:/bin:/usr/sbin:/usr/bin:/usr/local/sbin:/usr/local/bin:/root/bin PKG_CONFIG_LIBDIR=/wrkdirs/usr/ports/emulators/qemu-devel/work/.pkgconfig:/usr/local/libdata/pkgconfig:/usr/local/share/pkgconfig:/usr/libdata/pkgconfig MK_DEBUG_FILES=no MK_KERNEL_SYMBOLS=no SHELL=/bin/sh NO_LINT=YES DESTDIR=/wrkdirs/usr/ports/emulators/qemu-devel/work/stage LDSHARED="cc -shared" PYTHONDONTWRITEBYTECODE= PYTHONOPTIMIZE= PREFIX=/usr/local LOCALBASE=/usr/local CC="cc" CFLAGS="-O2 -pipe -fstack-protector-strong -isystem /usr/local/include -fno-strict-aliasing " CPP="cpp" CPPFLAGS="-isystem /usr/lo
cal/include" LDFLAGS=" -fstack-protector-strong -L/usr/local/lib " LIBS="" CXX="c++" CXXFLAGS="-O2 -pipe -fstack-protector-strong -isystem /usr/local/include -fno-strict-aliasing -isystem /usr/local/include " BSD_INSTALL_PROGRAM="install -s -m 555" BSD_INSTALL_LIB="install -s -m 0644" BSD_INSTALL_SCRIPT="install -m 555" BSD_INSTALL_DATA="install -m 0644" BSD_INSTALL_MAN="install -m 444"
--End MAKE_ENV--
--PLIST_SUB--
PORTDOCS="" CAPSTONE="" NO_CAPSTONE="@comment " CDROM_DMA="" NO_CDROM_DMA="@comment " CURL="" NO_CURL="@comment " DOCS="" NO_DOCS="@comment " GNUTLS="" NO_GNUTLS="@comment " GTK3="" NO_GTK3="@comment " JPEG="" NO_JPEG="@comment " NCURSES_BASE="@comment " NO_NCURSES_BASE="" NCURSES_DEFAULT="" NO_NCURSES_DEFAULT="@comment " NCURSES_PORT="@comment " NO_NCURSES_PORT="" OPENGL="" NO_OPENGL="@comment " PNG="" NO_PNG="@comment " SAMBA="@comment " NO_SAMBA="" SASL="" NO_SASL="@comment " STATIC_LINK="@comment " NO_STATIC_LINK="" USBREDIR="@comment " NO_USBREDIR="" VDE="" NO_VDE="@comment " X11="" NO_X11="@comment " X86_TARGETS="@comment " NO_X86_TARGETS="" BSDUSER="" LINUXBOOT_DMA="" GTK2_VERSION="2.10.0" GTK3_VERSION="3.0.0" GTK4_VERSION="4.0.0" PYTHON_INCLUDEDIR=include/python3.11 PYTHON_LIBDIR=lib/python3.11 PYTHON_PLATFORM=freebsd13 PYTHON_SITELIBDIR=lib/python3.11/site-packages PYTHON_SUFFIX=311 PYTHON_EXT_SUFFIX=.cpython-311 PYTHON_VER=3.11 PYTHON_VERSION=python3.11 PY
THON2="@comment " PYTHON3="" OSREL=13.2 PREFIX=%D LOCALBASE=/usr/local RESETPREFIX=/usr/local LIB32DIR=lib PERL_VERSION=5.36.3 PERL_VER=5.36 PERL5_MAN1=lib/perl5/site_perl/man/man1 PERL5_MAN3=lib/perl5/site_perl/man/man3 SITE_PERL=lib/perl5/site_perl SITE_ARCH=lib/perl5/site_perl/mach/5.36 DOCSDIR="share/doc/qemu" EXAMPLESDIR="share/examples/qemu" DATADIR="share/qemu" WWWDIR="www/qemu" ETCDIR="etc/qemu"
--End PLIST_SUB--
--SUB_LIST--
CAPSTONE="" NO_CAPSTONE="@comment " CDROM_DMA="" NO_CDROM_DMA="@comment " CURL="" NO_CURL="@comment " DOCS="" NO_DOCS="@comment " GNUTLS="" NO_GNUTLS="@comment " GTK3="" NO_GTK3="@comment " JPEG="" NO_JPEG="@comment " NCURSES_BASE="@comment " NO_NCURSES_BASE="" NCURSES_DEFAULT="" NO_NCURSES_DEFAULT="@comment " NCURSES_PORT="@comment " NO_NCURSES_PORT="" OPENGL="" NO_OPENGL="@comment " PNG="" NO_PNG="@comment " SAMBA="@comment " NO_SAMBA="" SASL="" NO_SASL="@comment " STATIC_LINK="@comment " NO_STATIC_LINK="" USBREDIR="@comment " NO_USBREDIR="" VDE="" NO_VDE="@comment " X11="" NO_X11="@comment " X86_TARGETS="@comment " NO_X86_TARGETS="" PYTHON_INCLUDEDIR=/usr/local/include/python3.11 PYTHON_LIBDIR=/usr/local/lib/python3.11 PYTHON_PLATFORM=freebsd13 PYTHON_SITELIBDIR=/usr/local/lib/python3.11/site-packages PYTHON_SUFFIX=311 PYTHON_EXT_SUFFIX=.cpython-311 PYTHON_VER=3.11 PYTHON_VERSION=python3.11 PYTHON2="@comment " PYTHON3="" PREFIX=/usr/local LOCALBASE=/usr/local DAT
ADIR=/usr/local/share/qemu DOCSDIR=/usr/local/share/doc/qemu EXAMPLESDIR=/usr/local/share/examples/qemu WWWDIR=/usr/local/www/qemu ETCDIR=/usr/local/etc/qemu
--End SUB_LIST--
---Begin make.conf---
USE_PACKAGE_DEPENDS=yes
BATCH=yes
WRKDIRPREFIX=/wrkdirs
PORTSDIR=/usr/ports
PACKAGES=/packages
DISTDIR=/distfiles
PACKAGE_BUILDING=yes
PACKAGE_BUILDING_FLAVORS=yes
MACHINE=i386
MACHINE_ARCH=i386
ARCH=${MACHINE_ARCH}
#### ####
# XXX: We really need this but cannot use it while 'make checksum' does not
# try the next mirror on checksum failure. It currently retries the same
# failed mirror and then fails rather then trying another. It *does*
# try the next if the size is mismatched though.
#MASTER_SITE_FREEBSD=yes
# Build ALLOW_MAKE_JOBS_PACKAGES with 3 jobs
MAKE_JOBS_NUMBER=3
#### Misc Poudriere ####
.include "/etc/make.conf.ports_env"
GID=0
UID=0
---End make.conf---
--Resource limits--
cpu time (seconds, -t) unlimited
file size (512-blocks, -f) unlimited
data seg size (kbytes, -d) 524288
stack size (kbytes, -s) 65536
core file size (512-blocks, -c) unlimited
max memory size (kbytes, -m) unlimited
locked memory (kbytes, -l) unlimited
max user processes (-u) 89999
open files (-n) 8192
virtual mem size (kbytes, -v) unlimited
swap limit (kbytes, -w) unlimited
socket buffer size (bytes, -b) unlimited
pseudo-terminals (-p) unlimited
kqueues (-k) unlimited
umtx shared locks (-o) unlimited
--End resource limits--
=======================<phase: check-sanity >============================
===== env: NO_DEPENDS=yes USER=root UID=0 GID=0
===> License GPLv2 accepted by the user
===========================================================================
=======================<phase: pkg-depends >============================
===== env: USE_PACKAGE_DEPENDS_ONLY=1 USER=root UID=0 GID=0
===> qemu-devel-8.3.0.20240229 depends on file: /usr/local/sbin/pkg - not found
===> Installing existing package /packages/All/pkg-1.21.3.pkg
[132i386-default-job-11] Installing pkg-1.21.3...
[132i386-default-job-11] Extracting pkg-1.21.3: .......... done
===> qemu-devel-8.3.0.20240229 depends on file: /usr/local/sbin/pkg - found
===> Returning to build of qemu-devel-8.3.0.20240229
===========================================================================
=======================<phase: fetch-depends >============================
===== env: USE_PACKAGE_DEPENDS_ONLY=1 USER=root UID=0 GID=0
===========================================================================
=======================<phase: fetch >============================
===== env: NO_DEPENDS=yes USER=root UID=0 GID=0
===> License GPLv2 accepted by the user
===> Fetching all distfiles required by qemu-devel-8.3.0.20240229 for building
===========================================================================
=======================<phase: checksum >============================
===== env: NO_DEPENDS=yes USER=root UID=0 GID=0
===> License GPLv2 accepted by the user
===> Fetching all distfiles required by qemu-devel-8.3.0.20240229 for building
=> SHA256 Checksum OK for qemu/8.3.0.20240229/qemu-project-qemu-ff202817dc2b0b3b42992fa7f1ce503f081068fe_GL0.tar.gz.
=> SHA256 Checksum OK for qemu/8.3.0.20240229/qemu-project-keycodemapdb-f5772a62ec52591ff6870b7e8ef32482371f22c6_GL0.tar.gz.
=> SHA256 Checksum OK for qemu/8.3.0.20240229/qemu-project-dtc-b6910bec11614980a21e46fbccc35934b671bd81_GL0.tar.gz.
=> SHA256 Checksum OK for qemu/8.3.0.20240229/qemu-project-libvfio-user-0b28d205572c80b568a1003db2c8f37ca333e4d7_GL0.tar.gz.
=> SHA256 Checksum OK for qemu/8.3.0.20240229/qemu-project-meson-aee941559c4b88a062e88186819a820c69c200ae_GL0.tar.gz.
=> SHA256 Checksum OK for qemu/8.3.0.20240229/qemu-project-berkeley-softfloat-3-b64af41c3276f97f0e181920400ee056b9c88037_GL0.tar.gz.
=> SHA256 Checksum OK for qemu/8.3.0.20240229/qemu-project-berkeley-testfloat-3-e7af9751d9f9fd3b47911f51a5cfd08af256a9ab_GL0.tar.gz.
===========================================================================
=======================<phase: extract-depends>============================
===== env: USE_PACKAGE_DEPENDS_ONLY=1 USER=root UID=0 GID=0
===========================================================================
=======================<phase: extract >============================
===== env: NO_DEPENDS=yes USER=root UID=0 GID=0
===> License GPLv2 accepted by the user
===> Fetching all distfiles required by qemu-devel-8.3.0.20240229 for building
===> Extracting for qemu-devel-8.3.0.20240229
=> SHA256 Checksum OK for qemu/8.3.0.20240229/qemu-project-qemu-ff202817dc2b0b3b42992fa7f1ce503f081068fe_GL0.tar.gz.
=> SHA256 Checksum OK for qemu/8.3.0.20240229/qemu-project-keycodemapdb-f5772a62ec52591ff6870b7e8ef32482371f22c6_GL0.tar.gz.
=> SHA256 Checksum OK for qemu/8.3.0.20240229/qemu-project-dtc-b6910bec11614980a21e46fbccc35934b671bd81_GL0.tar.gz.
=> SHA256 Checksum OK for qemu/8.3.0.20240229/qemu-project-libvfio-user-0b28d205572c80b568a1003db2c8f37ca333e4d7_GL0.tar.gz.
=> SHA256 Checksum OK for qemu/8.3.0.20240229/qemu-project-meson-aee941559c4b88a062e88186819a820c69c200ae_GL0.tar.gz.
<snip>
[2177/6678] Compiling C object libqemu-x86_64-bsd-user.fa.p/target_target-common.c.o
[2178/6678] Compiling C object libqemu-x86_64-bsd-user.fa.p/cpu-target.c.o
[2179/6678] Compiling C object libqemu-x86_64-bsd-user.fa.p/page-vary-target.c.o
[2180/6678] Compiling C object libqemu-x86_64-bsd-user.fa.p/fpu_softfloat.c.o
[2181/6678] Compiling C object libqemu-x86_64-bsd-user.fa.p/accel_accel-target.c.o
[2182/6678] Compiling C object libqemu-x86_64-bsd-user.fa.p/accel_tcg_tcg-all.c.o
[2183/6678] Compiling C object libqemu-x86_64-bsd-user.fa.p/accel_tcg_cpu-exec.c.o
[2184/6678] Compiling C object libqemu-x86_64-bsd-user.fa.p/accel_tcg_tb-maint.c.o
[2185/6678] Compiling C object libqemu-x86_64-bsd-user.fa.p/accel_tcg_tcg-runtime-gvec.c.o
[2186/6678] Compiling C object libqemu-x86_64-bsd-user.fa.p/accel_tcg_tcg-runtime.c.o
[2187/6678] Compiling C object libqemu-x86_64-bsd-user.fa.p/accel_tcg_translate-all.c.o
[2188/6678] Compiling C object libqemu-x86_64-bsd-user.fa.p/accel_tcg_translator.c.o
[2189/6678] Compiling C object libqemu-x86_64-bsd-user.fa.p/accel_tcg_user-exec.c.o
In file included from ../accel/tcg/user-exec.c:966:
../accel/tcg/ldst_atomicity.c.inc:137:12: warning: misaligned atomic operation may incur significant performance penalty; the expected alignment (8 bytes) exceeds the actual alignment (4 bytes) [-Watomic-alignment]
return qatomic_read__nocheck(p);
^
/wrkdirs/usr/ports/emulators/qemu-devel/work/qemu-ff202817dc2b0b3b42992fa7f1ce503f081068fe/include/qemu/atomic.h:132:5: note: expanded from macro 'qatomic_read__nocheck'
__atomic_load_n(ptr, __ATOMIC_RELAXED)
^
In file included from ../accel/tcg/user-exec.c:966:
../accel/tcg/ldst_atomicity.c.inc:688:11: warning: misaligned atomic operation may incur significant performance penalty; the expected alignment (8 bytes) exceeds the actual alignment (4 bytes) [-Watomic-alignment]
old = qatomic_read__nocheck(p);
^
/wrkdirs/usr/ports/emulators/qemu-devel/work/qemu-ff202817dc2b0b3b42992fa7f1ce503f081068fe/include/qemu/atomic.h:132:5: note: expanded from macro 'qatomic_read__nocheck'
__atomic_load_n(ptr, __ATOMIC_RELAXED)
^
In file included from ../accel/tcg/user-exec.c:966:
../accel/tcg/ldst_atomicity.c.inc:691:15: warning: misaligned atomic operation may incur significant performance penalty; the expected alignment (8 bytes) exceeds the actual alignment (4 bytes) [-Watomic-alignment]
} while (!__atomic_compare_exchange_n(p, &old, new, true,
^
../accel/tcg/ldst_atomicity.c.inc:624:5: warning: misaligned atomic operation may incur significant performance penalty; the expected alignment (8 bytes) exceeds the actual alignment (4 bytes) [-Watomic-alignment]
qatomic_set__nocheck(p, val);
^
/wrkdirs/usr/ports/emulators/qemu-devel/work/qemu-ff202817dc2b0b3b42992fa7f1ce503f081068fe/include/qemu/atomic.h:141:5: note: expanded from macro 'qatomic_set__nocheck'
__atomic_store_n(ptr, i, __ATOMIC_RELAXED)
^
4 warnings generated.
[2190/6678] Compiling C object libqemu-x86_64-bsd-user.fa.p/accel_tcg_user-exec-stub.c.o
[2191/6678] Compiling C object libqemu-x86_64-bsd-user.fa.p/accel_tcg_plugin-gen.c.o
[2192/6678] Compiling C object libqemu-x86_64-bsd-user.fa.p/plugins_loader.c.o
[2193/6678] Compiling C object libqemu-x86_64-bsd-user.fa.p/plugins_core.c.o
[2194/6678] Compiling C object libqemu-x86_64-bsd-user.fa.p/plugins_api.c.o
[2195/6678] Compiling C object libqemu-x86_64-bsd-user.fa.p/bsd-user_bsd-mem.c.o
[2196/6678] Compiling C object libqemu-x86_64-bsd-user.fa.p/bsd-user_bsd-proc.c.o
[2197/6678] Compiling C object libqemu-x86_64-bsd-user.fa.p/bsd-user_bsdload.c.o
[2198/6678] Compiling C object libqemu-x86_64-bsd-user.fa.p/bsd-user_elfload.c.o
[2199/6678] Compiling C object libqemu-x86_64-bsd-user.fa.p/bsd-user_main.c.o
../bsd-user/main.c:103:32: warning: implicit conversion from 'long long' to 'unsigned long' changes value from 34359738368 to 0 [-Wconstant-conversion]
unsigned long target_dfldsiz = TARGET_DFLDSIZ; /* initial data size limit */
~~~~~~~~~~~~~~ ^~~~~~~~~~~~~~
../bsd-user/x86_64/target_arch_vmparam.h:27:29: note: expanded from macro 'TARGET_DFLDSIZ'
#define TARGET_DFLDSIZ (32 * GiB) /* initial data size limit */
~~~^~~~~
../bsd-user/main.c:104:32: warning: implicit conversion from 'long long' to 'unsigned long' changes value from 34359738368 to 0 [-Wconstant-conversion]
unsigned long target_maxdsiz = TARGET_MAXDSIZ; /* max data size */
~~~~~~~~~~~~~~ ^~~~~~~~~~~~~~
../bsd-user/x86_64/target_arch_vmparam.h:28:29: note: expanded from macro 'TARGET_MAXDSIZ'
#define TARGET_MAXDSIZ (32 * GiB) /* max data size */
~~~^~~~~
../bsd-user/main.c:395:56: warning: incompatible pointer types passing 'uintptr_t *' (aka 'unsigned int *') to parameter of type 'unsigned long *' [-Wincompatible-pointer-types]
rv = qemu_strtoul(argv[optind++], NULL, 0, &guest_base);
^~~~~~~~~~~
/wrkdirs/usr/ports/emulators/qemu-devel/work/qemu-ff202817dc2b0b3b42992fa7f1ce503f081068fe/include/qemu/cutils.h:158:33: note: passing argument to parameter 'result' here
unsigned long *result);
^
3 warnings generated.
[2200/6678] Compiling C object libqemu-x86_64-bsd-user.fa.p/bsd-user_mmap.c.o
../bsd-user/mmap.c:409:46: warning: format specifies type 'unsigned long' but the argument has type 'off_t' (aka 'long long') [-Wformat]
qemu_log("fd=%d offset=0x%lx\n", fd, offset);
~~~ ^~~~~~
%llx
1 warning generated.
[2201/6678] Compiling C object libqemu-x86_64-bsd-user.fa.p/bsd-user_signal.c.o
[2202/6678] Compiling C object libqemu-x86_64-bsd-user.fa.p/bsd-user_strace.c.o
[2203/6678] Compiling C object libqemu-x86_64-bsd-user.fa.p/bsd-user_uaccess.c.o
[2204/6678] Compiling C object libqemu-x86_64-bsd-user.fa.p/bsd-user_freebsd_os-stat.c.o
[2205/6678] Compiling C object libqemu-x86_64-bsd-user.fa.p/bsd-user_freebsd_os-proc.c.o
[2206/6678] Compiling C object libqemu-x86_64-bsd-user.fa.p/bsd-user_freebsd_os-sys.c.o
[2207/6678] Compiling C object libqemu-x86_64-bsd-user.fa.p/bsd-user_freebsd_os-syscall.c.o
In file included from ../bsd-user/freebsd/os-syscall.c:42:
../bsd-user/freebsd/os-stat.h:495:73: warning: incompatible pointer types passing 'long *' to parameter of type 'off_t *' (aka 'long long *') [-Wincompatible-pointer-types]
ret = get_errno(freebsd11_getdirentries(arg1, (char *)dirp, nbytes, &basep));
^~~~~~
../bsd-user/freebsd/os-stat.h:44:74: note: passing argument to parameter 'basep' here
ssize_t freebsd11_getdirentries(int fd, char *buf, size_t nbytes, off_t *basep);
^
../bsd-user/freebsd/os-stat.h:534:63: warning: incompatible pointer types passing 'long *' to parameter of type 'off_t *' (aka 'long long *') [-Wincompatible-pointer-types]
ret = get_errno(getdirentries(arg1, (char *)dirp, nbytes, &basep));
^~~~~~
/usr/include/dirent.h:115:52: note: passing argument to parameter here
ssize_t getdirentries(int, char *, size_t, off_t *);
^
2 warnings generated.
[2208/6678] Linking target qemu-x86_64
[2209/6678] Generating aarch64-softmmu-gdbstub-xml.c with a custom command (wrapped by meson to capture output)
[2210/6678] Generating 'libqemu-aarch64-softmmu.fa.p/decode-neon-shared.c.inc'
[2211/6678] Generating 'libqemu-aarch64-softmmu.fa.p/decode-neon-dp.c.inc'
[2212/6678] Generating 'libqemu-aarch64-softmmu.fa.p/decode-neon-ls.c.inc'
[2213/6678] Generating 'libqemu-aarch64-softmmu.fa.p/decode-vfp.c.inc'
[2214/6678] Generating 'libqemu-aarch64-softmmu.fa.p/decode-vfp-uncond.c.inc'
[2215/6678] Generating 'libqemu-aarch64-softmmu.fa.p/decode-m-nocp.c.inc'
[2216/6678] Generating 'libqemu-aarch64-softmmu.fa.p/decode-mve.c.inc'
[2217/6678] Generating 'libqemu-aarch64-softmmu.fa.p/decode-a32.c.inc'
[2218/6678] Generating 'libqemu-aarch64-softmmu.fa.p/decode-a32-uncond.c.inc'
[2219/6678] Generating 'libqemu-aarch64-softmmu.fa.p/decode-t32.c.inc'
[2220/6678] Generating 'libqemu-aarch64-softmmu.fa.p/decode-t16.c.inc'
[2221/6678] Generating 'libqemu-aarch64-softmmu.fa.p/decode-a64.c.inc'
[2222/6678] Generating 'libqemu-aarch64-softmmu.fa.p/decode-sve.c.inc'
[2223/6678] Generating 'libqemu-aarch64-softmmu.fa.p/decode-sme.c.inc'
[2224/6678] Generating 'libqemu-aarch64-softmmu.fa.p/decode-sme-fa64.c.inc'
[2225/6678] Compiling C object libqemu-aarch64-softmmu.fa.p/meson-generated_.._aarch64-softmmu-gdbstub-xml.c.o
[2226/6678] Compiling C object libqemu-aarch64-softmmu.fa.p/meson-generated_.._qapi_qapi-types-machine-target.c.o
[2227/6678] Compiling C object libqemu-aarch64-softmmu.fa.p/meson-generated_.._qapi_qapi-visit-machine-target.c.o
[2228/6678] Compiling C object libqemu-aarch64-softmmu.fa.p/meson-generated_.._qapi_qapi-events-machine-target.c.o
[2229/6678] Compiling C object libqemu-aarch64-softmmu.fa.p/meson-generated_.._qapi_qapi-commands-machine-target.c.o
[2230/6678] Compiling C object libqemu-aarch64-softmmu.fa.p/meson-generated_.._qapi_qapi-types-misc-target.c.o
[2231/6678] Compiling C object libqemu-aarch64-softmmu.fa.p/meson-generated_.._qapi_qapi-visit-misc-target.c.o
[2232/6678] Compiling C object libqemu-aarch64-softmmu.fa.p/meson-generated_.._qapi_qapi-events-misc-target.c.o
[2233/6678] Compiling C object libqemu-aarch64-softmmu.fa.p/meson-generated_.._qapi_qapi-commands-misc-target.c.o
[2234/6678] Compiling C object libqemu-aarch64-softmmu.fa.p/meson-generated_.._qapi_qapi-introspect.c.o
[2235/6678] Compiling C object libqemu-aarch64-softmmu.fa.p/meson-generated_.._qapi_qapi-types.c.o
[2236/6678] Compiling C object libqemu-aarch64-softmmu.fa.p/meson-generated_.._qapi_qapi-visit.c.o
[2237/6678] Compiling C object libqemu-aarch64-softmmu.fa.p/meson-generated_.._qapi_qapi-commands.c.o
[2238/6678] Compiling C object libqemu-aarch64-softmmu.fa.p/meson-generated_.._qapi_qapi-init-commands.c.o
[2239/6678] Compiling C object libqemu-aarch64-softmmu.fa.p/meson-generated_.._qapi_qapi-events.c.o
[2240/6678] Compiling C object libqemu-aarch64-softmmu.fa.p/meson-generated_.._qapi_qapi-emit-events.c.o
[2241/6678] Compiling C object libqemu-aarch64-softmmu.fa.p/target_arm_arch_dump.c.o
[2242/6678] Compiling C object libqemu-aarch64-softmmu.fa.p/target_arm_arm-powerctl.c.o
[2243/6678] Compiling C object libqemu-aarch64-softmmu.fa.p/target_arm_arm-qmp-cmds.c.o
[2244/6678] Compiling C object libqemu-aarch64-softmmu.fa.p/target_arm_cortex-regs.c.o
[2245/6678] Compiling C object libqemu-aarch64-softmmu.fa.p/target_arm_machine.c.o
[2246/6678] Compiling C object libqemu-aarch64-softmmu.fa.p/target_arm_ptw.c.o
../target/arm/ptw.c:669:16: warning: misaligned atomic operation may incur significant performance penalty; the expected alignment (8 bytes) exceeds the actual alignment (4 bytes) [-Watomic-alignment]
data = qatomic_read__nocheck((uint64_t *)host);
^
/wrkdirs/usr/ports/emulators/qemu-devel/work/qemu-ff202817dc2b0b3b42992fa7f1ce503f081068fe/include/qemu/atomic.h:132:5: note: expanded from macro 'qatomic_read__nocheck'
__atomic_load_n(ptr, __ATOMIC_RELAXED)
^
../target/arm/ptw.c:815:19: warning: misaligned atomic operation may incur significant performance penalty; the expected alignment (8 bytes) exceeds the actual alignment (4 bytes) [-Watomic-alignment]
cur_val = qatomic_cmpxchg__nocheck((uint64_t *)host, old_val, new_val);
^
/wrkdirs/usr/ports/emulators/qemu-devel/work/qemu-ff202817dc2b0b3b42992fa7f1ce503f081068fe/include/qemu/atomic.h:208:11: note: expanded from macro 'qatomic_cmpxchg__nocheck'
(void)__atomic_compare_exchange_n(ptr, &_old, new, false, \
^
../target/arm/ptw.c:820:19: warning: misaligned atomic operation may incur significant performance penalty; the expected alignment (8 bytes) exceeds the actual alignment (4 bytes) [-Watomic-alignment]
cur_val = qatomic_cmpxchg__nocheck((uint64_t *)host, old_val, new_val);
^
/wrkdirs/usr/ports/emulators/qemu-devel/work/qemu-ff202817dc2b0b3b42992fa7f1ce503f081068fe/include/qemu/atomic.h:208:11: note: expanded from macro 'qatomic_cmpxchg__nocheck'
(void)__atomic_compare_exchange_n(ptr, &_old, new, false, \
^
3 warnings generated.
[2247/6678] Compiling C object libqemu-aarch64-softmmu.fa.p/target_arm_tcg_psci.c.o
[2248/6678] Compiling C object libqemu-aarch64-softmmu.fa.p/hw_arm_boot.c.o
[2249/6678] Compiling C object libqemu-aarch64-softmmu.fa.p/hw_arm_virt.c.o
[2250/6678] Compiling C object libqemu-aarch64-softmmu.fa.p/hw_arm_virt-acpi-build.c.o
[2251/6678] Compiling C object libqemu-aarch64-softmmu.fa.p/hw_arm_digic_boards.c.o
[2252/6678] Compiling C object libqemu-aarch64-softmmu.fa.p/hw_arm_msf2-som.c.o
[2253/6678] Compiling C object libqemu-aarch64-softmmu.fa.p/hw_arm_highbank.c.o
[2254/6678] Compiling C object libqemu-aarch64-softmmu.fa.p/hw_arm_integratorcp.c.o
[2255/6678] Compiling C object libqemu-aarch64-softmmu.fa.p/hw_arm_mainstone.c.o
[2256/6678] Compiling C object libqemu-aarch64-softmmu.fa.p/hw_arm_microbit.c.o
[2257/6678] Compiling C object libqemu-aarch64-softmmu.fa.p/hw_arm_mps3r.c.o
[2258/6678] Compiling C object libqemu-aarch64-softmmu.fa.p/hw_arm_musicpal.c.o
[2259/6678] Compiling C object libqemu-aarch64-softmmu.fa.p/hw_arm_netduinoplus2.c.o
[2260/6678] Compiling C object libqemu-aarch64-softmmu.fa.p/hw_arm_olimex-stm32-h405.c.o
[2261/6678] Compiling C object libqemu-aarch64-softmmu.fa.p/hw_arm_npcm7xx.c.o
[2262/6678] Compiling C object libqemu-aarch64-softmmu.fa.p/hw_arm_npcm7xx_boards.c.o
[2263/6678] Compiling C object libqemu-aarch64-softmmu.fa.p/hw_arm_nseries.c.o
[2264/6678] Compiling C object libqemu-aarch64-softmmu.fa.p/hw_arm_realview.c.o
[2265/6678] Compiling C object libqemu-aarch64-softmmu.fa.p/hw_arm_sbsa-ref.c.o
[2266/6678] Compiling C object libqemu-aarch64-softmmu.fa.p/hw_arm_stellaris.c.o
[2267/6678] Compiling C object libqemu-aarch64-softmmu.fa.p/hw_arm_stm32vldiscovery.c.o
[2268/6678] Compiling C object libqemu-aarch64-softmmu.fa.p/hw_arm_xilinx_zynq.c.o
[2269/6678] Compiling C object libqemu-aarch64-softmmu.fa.p/hw_arm_sabrelite.c.o
[2270/6678] Compiling C object libqemu-aarch64-softmmu.fa.p/hw_arm_armv7m.c.o
[2271/6678] Compiling C object libqemu-aarch64-softmmu.fa.p/hw_arm_exynos4210.c.o
[2272/6678] Compiling C object libqemu-aarch64-softmmu.fa.p/hw_arm_pxa2xx.c.o
[2273/6678] Compiling C object libqemu-aarch64-softmmu.fa.p/hw_arm_pxa2xx_gpio.c.o
[2274/6678] Compiling C object libqemu-aarch64-softmmu.fa.p/hw_arm_pxa2xx_pic.c.o
[2275/6678] Compiling C object libqemu-aarch64-softmmu.fa.p/hw_arm_digic.c.o
[2276/6678] Compiling C object libqemu-aarch64-softmmu.fa.p/hw_arm_omap1.c.o
[2277/6678] Compiling C object libqemu-aarch64-softmmu.fa.p/hw_arm_allwinner-a10.c.o
FAILED: libqemu-aarch64-softmmu.fa.p/hw_arm_allwinner-a10.c.o
cc -m32 -Ilibqemu-aarch64-softmmu.fa.p -I. -I.. -Itarget/arm -I../target/arm -Isubprojects/dtc/libfdt -I../subprojects/dtc/libfdt -Iqapi -Itrace -Iui -Iui/shader -I/usr/local/include/pixman-1 -I/usr/local/include -I/usr/local/include/capstone -I/wrkdirs/usr/ports/emulators/qemu-devel/work/qemu-ff202817dc2b0b3b42992fa7f1ce503f081068fe -I/usr/local/include/glib-2.0 -I/usr/local/lib/glib-2.0/include -fcolor-diagnostics -Wall -Winvalid-pch -std=gnu11 -O0 -g -fstack-protector-strong -Wempty-body -Wendif-labels -Wexpansion-to-defined -Wformat-security -Wformat-y2k -Wignored-qualifiers -Winit-self -Wmissing-format-attribute -Wmissing-prototypes -Wnested-externs -Wold-style-definition -Wredundant-decls -Wstrict-prototypes -Wtype-limits -Wundef -Wvla -Wwrite-strings -Wno-gnu-variable-sized-type-not-at-end -Wno-initializer-overrides -Wno-missing-include-dirs -Wno-psabi -Wno-shift-negative-value -Wno-string-plus-int -Wno-tautological-type-limit-compare -Wno-typedef-redefinition -Wthrea
d-safety -iquote . -iquote /wrkdirs/usr/ports/emulators/qemu-devel/work/qemu-ff202817dc2b0b3b42992fa7f1ce503f081068fe -iquote /wrkdirs/usr/ports/emulators/qemu-devel/work/qemu-ff202817dc2b0b3b42992fa7f1ce503f081068fe/include -iquote /wrkdirs/usr/ports/emulators/qemu-devel/work/qemu-ff202817dc2b0b3b42992fa7f1ce503f081068fe/host/include/i386 -iquote /wrkdirs/usr/ports/emulators/qemu-devel/work/qemu-ff202817dc2b0b3b42992fa7f1ce503f081068fe/host/include/generic -iquote /wrkdirs/usr/ports/emulators/qemu-devel/work/qemu-ff202817dc2b0b3b42992fa7f1ce503f081068fe/tcg/i386 -pthread -D_GNU_SOURCE -D_FILE_OFFSET_BITS=64 -D_LARGEFILE_SOURCE -fno-strict-aliasing -fno-common -fwrapv -O2 -pipe -fstack-protector-strong -isystem /usr/local/include -fno-strict-aliasing '-DPREFIX=\""/usr/local\""' -fPIE -DNEED_CPU_H '-DCONFIG_TARGET="aarch64-softmmu-config-target.h"' '-DCONFIG_DEVICES="aarch64-softmmu-config-devices.h"' -MD -MQ libqemu-aarch64-softmmu.fa.p/hw_arm_allwinner-a10.c.o -MF libqemu-a
arch64-softmmu.fa.p/hw_arm_allwinner-a10.c.o.d -o libqemu-aarch64-softmmu.fa.p/hw_arm_allwinner-a10.c.o -c ../hw/arm/allwinner-a10.c
In file included from ../hw/arm/allwinner-a10.c:18:
In file included from /wrkdirs/usr/ports/emulators/qemu-devel/work/qemu-ff202817dc2b0b3b42992fa7f1ce503f081068fe/include/qemu/osdep.h:161:
/wrkdirs/usr/ports/emulators/qemu-devel/work/qemu-ff202817dc2b0b3b42992fa7f1ce503f081068fe/include/glib-compat.h:32:10: fatal error: 'glib.h' file not found
#include <glib.h>
^~~~~~~~
1 error generated.
ninja: build stopped: subcommand failed.
gmake[2]: *** [Makefile:162: run-ninja] Error 1
gmake[2]: Leaving directory '/wrkdirs/usr/ports/emulators/qemu-devel/work/qemu-ff202817dc2b0b3b42992fa7f1ce503f081068fe/build'
gmake[1]: *** [GNUmakefile:6: build] Error 2
gmake[1]: Leaving directory '/wrkdirs/usr/ports/emulators/qemu-devel/work/qemu-ff202817dc2b0b3b42992fa7f1ce503f081068fe'
*** Error code 2
Stop.
make: stopped in /usr/ports/emulators/qemu-devel