[package - main-amd64-default][sysutils/screen] Failed for screen-4.9.1_3 in build
- Go to: [ bottom of page ] [ top of archives ] [ this month ]
Date: Mon, 15 Jul 2024 08:55:02 UTC
You are receiving this mail as a port that you maintain
is failing to build on the FreeBSD package build server.
Please investigate the failure and submit a PR to fix
build.
Maintainer: cy@FreeBSD.org
Log URL: https://pkg-status.freebsd.org/beefy18/data/main-amd64-default/p91686e4da49f_s772ae9eddf8/logs/screen-4.9.1_3.log
Build URL: https://pkg-status.freebsd.org/beefy18/build.html?mastername=main-amd64-default&build=p91686e4da49f_s772ae9eddf8
Log:
=>> Building sysutils/screen
build started at Mon Jul 15 08:54:45 UTC 2024
port directory: /usr/ports/sysutils/screen
package name: screen-4.9.1_3
building for: FreeBSD main-amd64-default-job-06 15.0-CURRENT FreeBSD 15.0-CURRENT 1500020 amd64
maintained by: cy@FreeBSD.org
Makefile datestamp: -rw-r--r-- 1 root wheel 3526 Jun 23 01:01 /usr/ports/sysutils/screen/Makefile
Ports top last git commit: 91686e4da49
Ports top unclean checkout: no
Port dir last git commit: 43990464758
Port dir unclean checkout: no
Poudriere version: poudriere-git-3.4.1-30-g79e3edcd
Host OSVERSION: 1500019
Jail OSVERSION: 1500020
Job Id: 06
!!! Jail is newer than host. (Jail: 1500020, Host: 1500019) !!!
!!! This is not supported. !!!
!!! Host kernel must be same or newer than jail. !!!
!!! Expect build failures. !!!
---Begin Environment---
SHELL=/bin/sh
OSVERSION=1500020
UNAME_v=FreeBSD 15.0-CURRENT 1500020
UNAME_r=15.0-CURRENT
BLOCKSIZE=K
MAIL=/var/mail/root
MM_CHARSET=UTF-8
LANG=C.UTF-8
STATUS=1
HOME=/root
PATH=/sbin:/bin:/usr/sbin:/usr/bin:/usr/local/sbin:/usr/local/bin:/root/bin
MAKE_OBJDIR_CHECK_WRITABLE=0
LOCALBASE=/usr/local
USER=root
POUDRIERE_NAME=poudriere-git
LIBEXECPREFIX=/usr/local/libexec/poudriere
POUDRIERE_VERSION=3.4.1-30-g79e3edcd
MASTERMNT=/usr/local/poudriere/data/.m/main-amd64-default/ref
LC_COLLATE=C
POUDRIERE_BUILD_TYPE=bulk
PACKAGE_BUILDING=yes
SAVED_TERM=
OUTPUT_REDIRECTED_STDERR=4
OUTPUT_REDIRECTED=1
PWD=/usr/local/poudriere/data/.m/main-amd64-default/06/.p
OUTPUT_REDIRECTED_STDOUT=3
P_PORTS_FEATURES=FLAVORS SUBPACKAGES SELECTED_OPTIONS
MASTERNAME=main-amd64-default
SCRIPTPREFIX=/usr/local/share/poudriere
SCRIPTNAME=bulk.sh
OLDPWD=/usr/local/poudriere/data/.m/main-amd64-default/ref/.p/pool
POUDRIERE_PKGNAME=poudriere-git-3.4.1-30-g79e3edcd
SCRIPTPATH=/usr/local/share/poudriere/bulk.sh
POUDRIEREPATH=/usr/local/bin/poudriere
---End Environment---
---Begin Poudriere Port Flags/Env---
PORT_FLAGS=
PKGENV=
FLAVOR=
MAKE_ARGS=
---End Poudriere Port Flags/Env---
---Begin OPTIONS List---
===> The following configuration options are available for screen-4.9.1_3:
INFO=on: Build and/or install GNU info pages
MULTIUSER=on: Install setuid-root screen to support multiuser
NETHACK=on: Enable nethack-style messages
NOSOCKETDIR=off: Use ~/.screen instead of socketdir
SYSTEM_SCREENRC=on: Install system screenrc with helpful status line
XTERM_256=on: Enable support for 256 colour xterm
====> Options available for the single IPC: you have to select exactly one of them
SOCKETS=on: Use new (4.2.1+) sockets for IPC (default)
NAMED_PIPES=off: Use legacy (4.0.3) named pipes for IPC (override)
====> Console (text) interface support: you have to select exactly one of them
NCURSES_DEFAULT=on: Depend on ncurses (ports if installed, otherwise base)
NCURSES_BASE=off: Depend on ncurses in base
NCURSES_PORT=off: Depend on devel/ncurses in ports
===> Use 'make config' to modify these settings
---End OPTIONS List---
--MAINTAINER--
cy@FreeBSD.org
--End MAINTAINER--
--CONFIGURE_ARGS--
--prefix=/usr/local ${_LATE_CONFIGURE_ARGS}
--End CONFIGURE_ARGS--
--CONFIGURE_ENV--
MAKE=gmake XDG_DATA_HOME=/wrkdirs/usr/ports/sysutils/screen/work XDG_CONFIG_HOME=/wrkdirs/usr/ports/sysutils/screen/work XDG_CACHE_HOME=/wrkdirs/usr/ports/sysutils/screen/work/.cache HOME=/wrkdirs/usr/ports/sysutils/screen/work TMPDIR="/tmp" PATH=/wrkdirs/usr/ports/sysutils/screen/work/.bin:/sbin:/bin:/usr/sbin:/usr/bin:/usr/local/sbin:/usr/local/bin:/root/bin PKG_CONFIG_LIBDIR=/wrkdirs/usr/ports/sysutils/screen/work/.pkgconfig:/usr/local/libdata/pkgconfig:/usr/local/share/pkgconfig:/usr/libdata/pkgconfig SHELL=/bin/sh CONFIG_SHELL=/bin/sh DEFAULT_AUTOCONF=2.72 CONFIG_SITE=/usr/ports/Templates/config.site lt_cv_sys_max_cmd_len=524288
--End CONFIGURE_ENV--
--MAKE_ENV--
XDG_DATA_HOME=/wrkdirs/usr/ports/sysutils/screen/work XDG_CONFIG_HOME=/wrkdirs/usr/ports/sysutils/screen/work XDG_CACHE_HOME=/wrkdirs/usr/ports/sysutils/screen/work/.cache HOME=/wrkdirs/usr/ports/sysutils/screen/work TMPDIR="/tmp" PATH=/wrkdirs/usr/ports/sysutils/screen/work/.bin:/sbin:/bin:/usr/sbin:/usr/bin:/usr/local/sbin:/usr/local/bin:/root/bin PKG_CONFIG_LIBDIR=/wrkdirs/usr/ports/sysutils/screen/work/.pkgconfig:/usr/local/libdata/pkgconfig:/usr/local/share/pkgconfig:/usr/libdata/pkgconfig MK_DEBUG_FILES=no MK_KERNEL_SYMBOLS=no SHELL=/bin/sh NO_LINT=YES DEFAULT_AUTOCONF=2.72 PREFIX=/usr/local LOCALBASE=/usr/local CC="cc" CFLAGS="-O2 -pipe -I/usr/include -DCOLORS256 -fstack-protector-strong -fno-strict-aliasing " CPP="cpp" CPPFLAGS="" LDFLAGS=" -L/usr/lib -fstack-protector-strong " LIBS="" CXX="c++" CXXFLAGS="-O2 -pipe -I/usr/include -DCOLORS256 -fstack-protector-strong -fno-strict-aliasing " BSD_INSTALL_PROGRAM="install -s -m 555" BSD_INSTALL_LIB="install -
s -m 0644" BSD_INSTALL_SCRIPT="install -m 555" BSD_INSTALL_DATA="install -m 0644" BSD_INSTALL_MAN="install -m 444"
--End MAKE_ENV--
--PLIST_SUB--
INFO="" NO_INFO="@comment " MULTIUSER="" NO_MULTIUSER="@comment " MULTISUID="@(,,4555) " NAMED_PIPES="@comment " NO_NAMED_PIPES="" NCURSES_BASE="@comment " NO_NCURSES_BASE="" NCURSES_DEFAULT="" NO_NCURSES_DEFAULT="@comment " NCURSES_PORT="@comment " NO_NCURSES_PORT="" NETHACK="" NO_NETHACK="@comment " NOSOCKETDIR="@comment " NO_NOSOCKETDIR="" SOCKETS="" NO_SOCKETS="@comment " SYSTEM_SCREENRC="" NO_SYSTEM_SCREENRC="@comment " XTERM_256="" NO_XTERM_256="@comment " OSREL=15.0 PREFIX=%D LOCALBASE=/usr/local RESETPREFIX=/usr/local LIB32DIR=lib DOCSDIR="share/doc/screen" EXAMPLESDIR="share/examples/screen" DATADIR="share/screen" WWWDIR="www/screen" ETCDIR="etc"
--End PLIST_SUB--
--SUB_LIST--
INFO="" NO_INFO="@comment " MULTIUSER="" NO_MULTIUSER="@comment " NAMED_PIPES="@comment " NO_NAMED_PIPES="" NCURSES_BASE="@comment " NO_NCURSES_BASE="" NCURSES_DEFAULT="" NO_NCURSES_DEFAULT="@comment " NCURSES_PORT="@comment " NO_NCURSES_PORT="" NETHACK="" NO_NETHACK="@comment " NOSOCKETDIR="@comment " NO_NOSOCKETDIR="" SOCKETS="" NO_SOCKETS="@comment " SYSTEM_SCREENRC="" NO_SYSTEM_SCREENRC="@comment " XTERM_256="" NO_XTERM_256="@comment " PREFIX=/usr/local LOCALBASE=/usr/local DATADIR=/usr/local/share/screen DOCSDIR=/usr/local/share/doc/screen EXAMPLESDIR=/usr/local/share/examples/screen WWWDIR=/usr/local/www/screen ETCDIR=/usr/local/etc
--End SUB_LIST--
---Begin make.conf---
# XXX: We really need this but cannot use it while 'make checksum' does not
# try the next mirror on checksum failure. It currently retries the same
# failed mirror and then fails rather then trying another. It *does*
# try the next if the size is mismatched though.
#MASTER_SITE_FREEBSD=yes
# Build ALLOW_MAKE_JOBS_PACKAGES with 3 jobs
MAKE_JOBS_NUMBER=3
USE_PACKAGE_DEPENDS=yes
BATCH=yes
WRKDIRPREFIX=/wrkdirs
PORTSDIR=/usr/ports
PACKAGES=/packages
DISTDIR=/distfiles
PACKAGE_BUILDING=yes
PACKAGE_BUILDING_FLAVORS=yes
#### ####
# XXX: We really need this but cannot use it while 'make checksum' does not
# try the next mirror on checksum failure. It currently retries the same
# failed mirror and then fails rather then trying another. It *does*
# try the next if the size is mismatched though.
#MASTER_SITE_FREEBSD=yes
# Build ALLOW_MAKE_JOBS_PACKAGES with 3 jobs
MAKE_JOBS_NUMBER=3
#### Misc Poudriere ####
.include "/etc/make.conf.ports_env"
GID=0
UID=0
---End make.conf---
--Resource limits--
cpu time (seconds, -t) unlimited
file size (512-blocks, -f) unlimited
data seg size (kbytes, -d) 33554432
stack size (kbytes, -s) 524288
core file size (512-blocks, -c) unlimited
max memory size (kbytes, -m) unlimited
locked memory (kbytes, -l) unlimited
max user processes (-u) 89999
open files (-n) 8192
virtual mem size (kbytes, -v) unlimited
swap limit (kbytes, -w) unlimited
socket buffer size (bytes, -b) unlimited
pseudo-terminals (-p) unlimited
kqueues (-k) unlimited
umtx shared locks (-o) unlimited
--End resource limits--
=======================<phase: check-sanity >============================
===== env: NO_DEPENDS=yes USER=root UID=0 GID=0
===> License GPLv3 accepted by the user
===========================================================================
=======================<phase: pkg-depends >============================
===== env: USE_PACKAGE_DEPENDS_ONLY=1 USER=root UID=0 GID=0
===> screen-4.9.1_3 depends on file: /usr/local/sbin/pkg - not found
===> Installing existing package /packages/All/pkg-1.21.3.pkg
[main-amd64-default-job-06] Installing pkg-1.21.3...
[main-amd64-default-job-06] Extracting pkg-1.21.3: .......... done
===> screen-4.9.1_3 depends on file: /usr/local/sbin/pkg - found
===> Returning to build of screen-4.9.1_3
===========================================================================
=======================<phase: fetch-depends >============================
===== env: USE_PACKAGE_DEPENDS_ONLY=1 USER=root UID=0 GID=0
===========================================================================
=======================<phase: fetch >============================
===== env: NO_DEPENDS=yes USER=root UID=0 GID=0
===> License GPLv3 accepted by the user
===> Fetching all distfiles required by screen-4.9.1_3 for building
===========================================================================
=======================<phase: checksum >============================
===== env: NO_DEPENDS=yes USER=root UID=0 GID=0
===> License GPLv3 accepted by the user
===> Fetching all distfiles required by screen-4.9.1_3 for building
=> SHA256 Checksum OK for screen-4.9.1.tar.gz.
===========================================================================
=======================<phase: extract-depends>============================
===== env: USE_PACKAGE_DEPENDS_ONLY=1 USER=root UID=0 GID=0
===========================================================================
=======================<phase: extract >============================
===== env: NO_DEPENDS=yes USER=root UID=0 GID=0
===> License GPLv3 accepted by the user
===> Fetching all distfiles required by screen-4.9.1_3 for building
===> Extracting for screen-4.9.1_3
=> SHA256 Checksum OK for screen-4.9.1.tar.gz.
===========================================================================
=======================<phase: patch-depends >============================
===== env: USE_PACKAGE_DEPENDS_ONLY=1 USER=root UID=0 GID=0
===========================================================================
=======================<phase: patch >============================
<snip>
306 | int (vsprintf)(char * __restrict, const char * __restrict,
| ^
In file included from fileio.c:39:
In file included from ./screen.h:43:
./osdef.h:49:14: error: conflicting types for 'bzero'
49 | extern void bzero __P((char *, int));
| ^
ansi.c:252:1: warning: a function definition without a prototype is deprecated in all versions of C and is not supported in C23 [-Wdeprecated-non-prototype]
/usr/include/strings.h:48:8: note: previous declaration is here
48 | void (bzero)(void *, size_t); /* LEGACY */
| ^
252 | ResetCharsets(p)
| ^
In file included from fileio.c:39:
In file included from ./screen.h:43:
./osdef.h:63:14: error: conflicting types for 'bcopy'
63 | extern void bcopy __P((char *, chaansi.c:266:1: warning: a function definition without a prototype is deprecated in all versions of C and is not supported in C23 [-Wdeprecated-non-prototype]
r *, int));
| ^
266 | SetCharsets(p, s)
| ^
/usr/include/strings.h:47:8: note: previous declaration is here
47 | void (bcopy)(const void *, void *, size_t); /* LEGACY */
| ^
ansi.c:297:1: warning: a function definition without a prototype is deprecated in all versions of C and is not supported in C23 [-Wdeprecated-non-prototype]
297 | WriteString(wp, buf, len)
| ^
ansi.c:911:1: warning: a function definition without a prototype is deprecated in all versions of C and is not supported in C23 [-Wdeprecated-non-prototype]
911 | WLogString(p, buf, len)
| ^
ansi.c:935:1: warning: a function definition without a prototype is deprecated in all versions of C and is not supported in C23 [-Wdeprecated-non-prototype]
935 | Special(c)
| ^
ansi.c:971:1: warning: a function definition without a prototype is deprecated in all versions of C and is not supported in C23 [-Wdeprecated-non-prototype]
971 | DoESC(c, intermediate)
| ^
ansi.c:1113:1: warning: a function definition without a prototype is deprecated in all versions of C and is not supported in C23 [-Wdeprecated-non-prototype]
1113 | DoCSI(c, intermediate)
| ^
ansi.c:1497:1: warning: a function definition without a prototype is deprecated in all versions of C and is not supported in C23 [-Wdeprecated-non-prototype]
1497 | StringStart(type)
| ^
ansi.c:1506:1: warning: a function definition without a prototype is deprecated in all versions of C and is not supported in C23 [-Wdeprecated-non-prototype]
1506 | StringChar(c)
| ^
ansi.c:1682:1: warning: a function definition without a prototype is deprecated in all versions of C and is not supported in C23 [-Wdeprecated-non-prototype]
1682 | PrintChar(c)
| ^
ansi.c:1725:1: warning: a function definition without a prototype is deprecated in all versions of C and is not supported in C23 [-Wdeprecated-non-prototype]
1725 | WNewAutoFlow(win, on)
| ^
ansi.c:1741:1: warning: a function definition without a prototype is deprecated in all versions of C and is not supported in C23 [-Wdeprecated-non-prototype]
1741 | DesignateCharset(c, n)
| ^
ansi.c:1766:1: warning: a function definition without a prototype is deprecated in all versions of C and is not supported in C23 [-Wdeprecated-non-prototype]
1766 | MapCharset(n)
| ^
screen.c:276:12: warning: a function definition without a prototype is deprecated in all versions of C and is not supported in C23 [-Wdeprecated-non-prototype]
276 | static int lf_secreopen(name, wantfd, l)
| ^
ansi.c:1780:1: warning: a function definition without a prototype is deprecated in all versions of C and is not supported in C23 [-Wdeprecated-non-prototype]
1780 | MapChscreen.c:298:24: warning: a function definition without a prototype is deprecated in all versions of C and is not supported in C23 [-Wdeprecated-non-prototype]
arset 298 | static struct passwd * getpwbyname(name, ppp)
| ^
R(n)
| ^
ansi.c:1795:1: warning: a function definition without a prototype is deprecated in all versions of C and is not supported in C23 [-Wdeprecated-non-prototype]
1795 | SaveCursor(cursor)
| ^
ansi.c:1811:1: warning: a function definition without a prototype is deprecated in all versions of C and is not supported in C23 [-Wdeprecated-non-prototype]
1811 | RestoreCursor(cursor)
| ^
ansi.c:1857:1: warning: a function definition without a prototype is deprecated in all versions of C and is not supported in C23 [-Wdeprecated-non-prototype]
1857 | LineFeed(out_mode)
| ^
ansi.c:1891:1: warning: a function definition without a prototype is deprecated in all versions of C and is not supported in C23 [-Wdeprecated-non-prototype]
1891 | InsertChar(n)
| ^
ansi.c:1907:1: warning: a function definition without a prototype is deprecated in all versions of C and is not supported in C23 [-Wdeprecated-non-prototype]
1907 | DeleteChar(n)
| ^
4 errors generated.
ansi.c:1921:1: warning: a function definition without a prototype is deprecated in all versions of C and is not supported in C23 [-Wdeprecated-non-prototype]
1921 | DeleteLine(n)
| ^
ansi.c:1934:1: warning: a function definition without a prototype is deprecated in all versions of C and is not supported in C23 [-Wdeprecated-non-prototype]
1934 | InsertLine(n)
| ^
ansi.c:1947:1: warning: a function definition without a prototype is deprecated in all versions of C and is not supported in C23 [-Wdeprecated-non-prototype]
1947 | ScrollRegion(n)
| ^
ansi.c:2025:1: warning: a function definition without a prototype is deprecated in all versions of C and is not supported in C23 [-Wdeprecated-non-prototype]
2025 | ClearLineRegion(from, to)
| ^
ansi.c:2035:1: warning: a function definition without a prototype is deprecated in all versions of C and is not supported in C23 [-Wdeprecated-non-prototype]
2035 | CursorRight(n)
| ^
ansi.c:2051:1: warning: a function definition without a prototype is deprecated in all versions of C and is not supported in C23 [-Wdeprecated-non-prototype]
2051 | CursorUp(n)
| ^
ansi.c:2066:1: warning: a function definition without a prototype is deprecated in all versions of C and is not supported in C23 [-Wdeprecated-non-prototype]
2066 | CursorDown(n)
| ^
ansi.c:2081:1: warning: a function definition without a prototype is deprecated in all versions of C and is not supported in C23 [-Wdeprecated-non-prototype]
2081 | CursorLeft(n)
| ^
ansi.c:2090:1: warning: a function definition without a prototype is deprecated in all versions of C and is not supported in C23 [-Wdeprecated-non-prototype]
2090 | ASetMode(on)
| ^
ansi.c:2252:1: warning: a function definition without a prototype is deprecated in all versions of C and is not supported in C23 [-Wdeprecated-non-prototype]
2252 | ChangeAKA(p, s, l)
| ^
gmake: *** [Makefile:82: fileio.o] Error 1
gmake: *** Waiting for unfinished jobs....
ansi.c:2338:1: warning: a function definition without a prototype is deprecated in all versions of C and is not supported in C23 [-Wdeprecated-non-prototype]
2338 | Report(fmt, n1, n2)
| ^
ansi.c:2382:1: warning: a function definition without a prototype is deprecated in all versions of C and is not supported in C23 [-Wdeprecated-non-prototype]
2382 | MFixLine(p, y, mc)
| ^
ansi.c:2465:1: warning: a function definition without a prototype is deprecated in all versions of C and is not supported in C23 [-Wdeprecated-non-prototype]
2465 | MScrollH(p, n, y, xs, xe, bce)
| ^
ansi.c:2510:1: warning: a function definition without a prototype is deprecated in all versions of C and is not supported in C23 [-Wdeprecated-non-prototype]
2510 | MScrollV(p, n, ys, ye, bce)
| ^
screen.c:1492:1: warning: a function definition without a prototype is deprecated in all versions of C and is not supported in C23 [-Wdeprecated-non-prototype]
1492 | WindowDied(p, wstat, wstat_valid)
| ^
ansi.c:2630:1: warning: a function definition without a prototype is deprecated in all versions of C and is not supported in C23 [-Wdeprecated-non-prototype]
2630 | Scroll(cp, cnt1, cnt2, tmp)
| ^
ansi.c:2651:1: warning: a function definition without a prototype is deprecated in all versions of C and is not supported in C23 [-Wdeprecated-non-prototype]
2651 | MClearArea(p, xs, ys, xe, ye, bce)
| ^
screen.c:1610:17: warning: a function definition without a prototype is deprecated in all versions of C and is not supported in C23 [-Wdeprecated-non-prototype]
1610 | static sigret_t SigChld SIGDEFARG
| ^
screen.c:1617:10: warning: a function definition without a prototype is deprecated in all versions of C and is not supported in C23 [-Wdeprecated-non-prototype]
1617 | sigret_t SigHup SIGDEFARG
| ^
screen.c:1630:17: warning: a function definition without a prototype is deprecated in all versions of C and is not supported in C23 [-Wdeprecated-non-prototype]
1630 | static sigret_t SigInt SIGDEFARG
| ^
screen.c:1652:17: warning: a function definition without a prototype is deprecated in all versions of C and is not supported in C23 [-Wdeprecated-non-prototype]
1652 | static sigret_t CoreDump SIGDEFARG
| ^
ansi.c:2688:1: warning: a function definition without a prototype is deprecated in all versions of C and is not supported in C23 [-Wdeprecated-non-prototype]
2688 | MInsChar(p, c, x, y)
| ^
screen.c:1802:17: warning: a function definition without a prototype is deprecated in all versions of C and is not supported in C23 [-Wdeprecated-non-prototype]
1802 | static sigret_t FinitHandler SIGDEFARG
| ^
ansi.c:2733:1: warning: a function definition without a prototype is deprecated in all versions of C and is not supported in C23 [-Wdeprecated-non-prototype]
2733 | MPutChar(p, c, x, y)
| ^
ansi.c:2768:1: warning: a function definition without a prototype is deprecated in all versions of C and is not supported in C23 [-Wdeprecated-non-prototype]
2768 | MWrapChar(p, c, y, top, bot, ins)
| ^
ansi.c:2796:1: warning: a function definition without a prototype is deprecated in all versions of C and is not supported in C23 [-Wdeprecated-non-prototype]
2796 | MPutStr(p, s, n, r, x, y)
| ^
ansi.c:2854:1: warning: a function definition without a prototype is deprecated in all versions of C and is not supported in C23 [-Wdeprecated-non-prototype]
2854 | MBceLine(p, y, xs, xe, bce)
| ^
ansi.c:2885:1: warning: a function definition without a prototype is deprecated in all versions of C and is not supported in C23 [-Wdeprecated-non-prototype]
2885 | WAddLineToHist(wp, ml)
| ^
ansi.c:2929:1: warning: a function definition without a prototype is deprecated in all versions of C and is not supported in C23 [-Wdeprecated-non-prototype]
2929 | MFindUsedLine(p, ye, ys)
| ^
ansi.c:2976:1: warning: a function definition without a prototype is deprecated in all versions of C and is not supported in C23 [-Wdeprecated-non-prototype]
2976 | WBell(p, visual)
| ^
ansi.c:3005:1: warning: a function definition without a prototype is deprecated in all versions of C and is not supported in C23 [-Wdeprecated-non-prototype]
3005 | WReverseVideo(p, on)
| ^
ansi.c:3027:1: warning: a function definition without a prototype is deprecated in all versions of C and is not supported in C23 [-Wdeprecated-non-prototype]
3027 | WMsg(p, err, str)
| ^
ansi.c:3040:1: warning: a function definition without a prototype is deprecated in all versions of C and is not supported in C23 [-Wdeprecated-non-prototype]
3040 | WChangeSize(p, w, h)
| ^
ansi.c:3088:1: warning: a function definition without a prototype is deprecated in all versions of C and is not supported in C23 [-Wdeprecated-non-prototype]
3088 | WindowChangedCheck(s, what, hp)
| ^
ansi.c:3122:1: warning: a function definition without a prototype is deprecated in all versions of C and is not supported in C23 [-Wdeprecated-non-prototype]
3122 | WindowChanged(p, what)
| ^
51 warnings and 4 errors generated.
gmake: *** [Makefile:82: ansi.o] Error 1
8 warnings and 4 errors generated.
gmake: *** [Makefile:82: screen.o] Error 1
===> Compilation failed unexpectedly.
Try to set MAKE_JOBS_UNSAFE=yes and rebuild before reporting the failure to
the maintainer.
*** Error code 1
Stop.
make: stopped in /usr/ports/sysutils/screen