[package - main-powerpc64le-default][math/reduce] Failed for reduce-20220617_1 in build
- Go to: [ bottom of page ] [ top of archives ] [ this month ]
Date: Thu, 04 Jan 2024 02:39:26 UTC
You are receiving this mail as a port that you maintain
is failing to build on the FreeBSD package build server.
Please investigate the failure and submit a PR to fix
build.
Maintainer: yuri@FreeBSD.org
Log URL: https://pkg-status.freebsd.org/foul2/data/main-powerpc64le-default/pf47e590a6da8_seac3646fcd/logs/reduce-20220617_1.log
Build URL: https://pkg-status.freebsd.org/foul2/build.html?mastername=main-powerpc64le-default&build=pf47e590a6da8_seac3646fcd
Log:
=>> Building math/reduce
build started at Thu Jan 4 01:48:09 UTC 2024
port directory: /usr/ports/math/reduce
package name: reduce-20220617_1
building for: FreeBSD main-powerpc64le-default-job-10 15.0-CURRENT FreeBSD 15.0-CURRENT 1500007 powerpc
maintained by: yuri@FreeBSD.org
Makefile datestamp: -rw-r--r-- 1 root wheel 2036 Sep 17 01:03 /usr/ports/math/reduce/Makefile
Ports top last git commit: f47e590a6d
Ports top unclean checkout: no
Port dir last git commit: 664a2fa1e5
Port dir unclean checkout: no
Poudriere version: poudriere-git-3.4.0
Host OSVERSION: 1500000
Jail OSVERSION: 1500007
Job Id: 10
!!! Jail is newer than host. (Jail: 1500007, Host: 1500000) !!!
!!! This is not supported. !!!
!!! Host kernel must be same or newer than jail. !!!
!!! Expect build failures. !!!
---Begin Environment---
SHELL=/bin/sh
OSVERSION=1500007
UNAME_v=FreeBSD 15.0-CURRENT 1500007
UNAME_r=15.0-CURRENT
BLOCKSIZE=K
MAIL=/var/mail/root
MM_CHARSET=UTF-8
LANG=C.UTF-8
STATUS=1
HOME=/root
PATH=/sbin:/bin:/usr/sbin:/usr/bin:/usr/local/sbin:/usr/local/bin:/root/bin
MAKE_OBJDIR_CHECK_WRITABLE=0
LOCALBASE=/usr/local
USER=root
POUDRIERE_NAME=poudriere-git
LIBEXECPREFIX=/usr/local/libexec/poudriere
POUDRIERE_VERSION=3.4.0
MASTERMNT=/usr/local/poudriere/data/.m/main-powerpc64le-default/ref
LC_COLLATE=C
POUDRIERE_BUILD_TYPE=bulk
PACKAGE_BUILDING=yes
SAVED_TERM=
OUTPUT_REDIRECTED_STDERR=4
OUTPUT_REDIRECTED=1
PWD=/usr/local/poudriere/data/.m/main-powerpc64le-default/10/.p
OUTPUT_REDIRECTED_STDOUT=3
P_PORTS_FEATURES=FLAVORS SUBPACKAGES SELECTED_OPTIONS
MASTERNAME=main-powerpc64le-default
SCRIPTPREFIX=/usr/local/share/poudriere
SCRIPTNAME=bulk.sh
OLDPWD=/usr/local/poudriere/data/.m/main-powerpc64le-default/ref/.p/pool
POUDRIERE_PKGNAME=poudriere-git-3.4.0
SCRIPTPATH=/usr/local/share/poudriere/bulk.sh
POUDRIEREPATH=/usr/local/bin/poudriere
---End Environment---
---Begin Poudriere Port Flags/Env---
PORT_FLAGS=
PKGENV=
FLAVOR=
MAKE_ARGS=
---End Poudriere Port Flags/Env---
---Begin OPTIONS List---
===> The following configuration options are available for reduce-20220617_1:
DOCS=on: Build and/or install documentation
===> Use 'make config' to modify these settings
---End OPTIONS List---
--MAINTAINER--
yuri@FreeBSD.org
--End MAINTAINER--
--CONFIGURE_ARGS--
--with-csl
--End CONFIGURE_ARGS--
--CONFIGURE_ENV--
MAKE=gmake XDG_DATA_HOME=/wrkdirs/usr/ports/math/reduce/work XDG_CONFIG_HOME=/wrkdirs/usr/ports/math/reduce/work XDG_CACHE_HOME=/wrkdirs/usr/ports/math/reduce/work/.cache HOME=/wrkdirs/usr/ports/math/reduce/work TMPDIR="/tmp" PATH=/wrkdirs/usr/ports/math/reduce/work/.bin:/sbin:/bin:/usr/sbin:/usr/bin:/usr/local/sbin:/usr/local/bin:/root/bin PKG_CONFIG_LIBDIR=/wrkdirs/usr/ports/math/reduce/work/.pkgconfig:/usr/local/libdata/pkgconfig:/usr/local/share/pkgconfig:/usr/libdata/pkgconfig SHELL=/bin/sh CONFIG_SHELL=/bin/sh DEFAULT_AUTOCONF=2.71
--End CONFIGURE_ENV--
--MAKE_ENV--
XDG_DATA_HOME=/wrkdirs/usr/ports/math/reduce/work XDG_CONFIG_HOME=/wrkdirs/usr/ports/math/reduce/work XDG_CACHE_HOME=/wrkdirs/usr/ports/math/reduce/work/.cache HOME=/wrkdirs/usr/ports/math/reduce/work TMPDIR="/tmp" PATH=/wrkdirs/usr/ports/math/reduce/work/.bin:/sbin:/bin:/usr/sbin:/usr/bin:/usr/local/sbin:/usr/local/bin:/root/bin PKG_CONFIG_LIBDIR=/wrkdirs/usr/ports/math/reduce/work/.pkgconfig:/usr/local/libdata/pkgconfig:/usr/local/share/pkgconfig:/usr/libdata/pkgconfig MK_DEBUG_FILES=no MK_KERNEL_SYMBOLS=no SHELL=/bin/sh NO_LINT=YES DEFAULT_AUTOCONF=2.71 PREFIX=/usr/local LOCALBASE=/usr/local CC="cc" CFLAGS="-O2 -pipe -fstack-protector-strong -fno-strict-aliasing " CPP="cpp" CPPFLAGS="-I/usr/include `freetype-config --cflags`" LDFLAGS=" `freetype-config --libs` -fstack-protector-strong " LIBS="" CXX="c++" CXXFLAGS="-O2 -pipe -fstack-protector-strong -fno-strict-aliasing " MANPREFIX="/usr/local" BSD_INSTALL_PROGRAM="install -s -m 555" BSD_INSTALL_LIB="install -s -m 064
4" BSD_INSTALL_SCRIPT="install -m 555" BSD_INSTALL_DATA="install -m 0644" BSD_INSTALL_MAN="install -m 444"
--End MAKE_ENV--
--PLIST_SUB--
PORTDOCS="" OSREL=15.0 PREFIX=%D LOCALBASE=/usr/local RESETPREFIX=/usr/local LIB32DIR=lib DOCSDIR="share/doc/reduce" EXAMPLESDIR="share/examples/reduce" DATADIR="share/reduce" WWWDIR="www/reduce" ETCDIR="etc/reduce"
--End PLIST_SUB--
--SUB_LIST--
PREFIX=/usr/local LOCALBASE=/usr/local DATADIR=/usr/local/share/reduce DOCSDIR=/usr/local/share/doc/reduce EXAMPLESDIR=/usr/local/share/examples/reduce WWWDIR=/usr/local/www/reduce ETCDIR=/usr/local/etc/reduce
--End SUB_LIST--
---Begin make.conf---
USE_PACKAGE_DEPENDS=yes
BATCH=yes
WRKDIRPREFIX=/wrkdirs
PORTSDIR=/usr/ports
PACKAGES=/packages
DISTDIR=/distfiles
PACKAGE_BUILDING=yes
PACKAGE_BUILDING_FLAVORS=yes
#### ####
# XXX: We really need this but cannot use it while 'make checksum' does not
# try the next mirror on checksum failure. It currently retries the same
# failed mirror and then fails rather then trying another. It *does*
# try the next if the size is mismatched though.
#MASTER_SITE_FREEBSD=yes
# Build ALLOW_MAKE_JOBS_PACKAGES with 3 jobs
MAKE_JOBS_NUMBER=3
#### Misc Poudriere ####
.include "/etc/make.conf.ports_env"
GID=0
UID=0
---End make.conf---
--Resource limits--
cpu time (seconds, -t) unlimited
file size (512-blocks, -f) unlimited
data seg size (kbytes, -d) 33554432
stack size (kbytes, -s) 524288
core file size (512-blocks, -c) unlimited
max memory size (kbytes, -m) unlimited
locked memory (kbytes, -l) unlimited
max user processes (-u) 89999
open files (-n) 8192
virtual mem size (kbytes, -v) unlimited
swap limit (kbytes, -w) unlimited
socket buffer size (bytes, -b) unlimited
pseudo-terminals (-p) unlimited
kqueues (-k) unlimited
umtx shared locks (-o) unlimited
--End resource limits--
=======================<phase: check-sanity >============================
===== env: NO_DEPENDS=yes USER=root UID=0 GID=0
===> License BSD2CLAUSE accepted by the user
===========================================================================
=======================<phase: pkg-depends >============================
===== env: USE_PACKAGE_DEPENDS_ONLY=1 USER=root UID=0 GID=0
===> reduce-20220617_1 depends on file: /usr/local/sbin/pkg - not found
===> Installing existing package /packages/All/pkg-1.20.9.pkg
[main-powerpc64le-default-job-10] Installing pkg-1.20.9...
[main-powerpc64le-default-job-10] Extracting pkg-1.20.9: .......... done
===> reduce-20220617_1 depends on file: /usr/local/sbin/pkg - found
===> Returning to build of reduce-20220617_1
===========================================================================
=======================<phase: fetch-depends >============================
===== env: USE_PACKAGE_DEPENDS_ONLY=1 USER=root UID=0 GID=0
===========================================================================
=======================<phase: fetch >============================
===== env: NO_DEPENDS=yes USER=root UID=0 GID=0
===> License BSD2CLAUSE accepted by the user
===> Fetching all distfiles required by reduce-20220617_1 for building
===========================================================================
=======================<phase: checksum >============================
===== env: NO_DEPENDS=yes USER=root UID=0 GID=0
===> License BSD2CLAUSE accepted by the user
===> Fetching all distfiles required by reduce-20220617_1 for building
=> SHA256 Checksum OK for Reduce-svn6339-src.tar.gz.
===========================================================================
=======================<phase: extract-depends>============================
===== env: USE_PACKAGE_DEPENDS_ONLY=1 USER=root UID=0 GID=0
===========================================================================
=======================<phase: extract >============================
===== env: NO_DEPENDS=yes USER=root UID=0 GID=0
===> License BSD2CLAUSE accepted by the user
===> Fetching all distfiles required by reduce-20220617_1 for building
===> Extracting for reduce-20220617_1
=> SHA256 Checksum OK for Reduce-svn6339-src.tar.gz.
===========================================================================
=======================<phase: patch-depends >============================
===== env: USE_PACKAGE_DEPENDS_ONLY=1 USER=root UID=0 GID=0
===========================================================================
=======================<phase: patch >============================
===== env: NO_DEPENDS=yes USER=root UID=0 GID=0
===> Patching for reduce-20220617_1
===> Applying FreeBSD patches for reduce-20220617_1 from /usr/ports/math/reduce/files
===========================================================================
=======================<phase: build-depends >============================
===== env: USE_PACKAGE_DEPENDS_ONLY=1 USER=root UID=0 GID=0
===> reduce-20220617_1 depends on executable: gnuplot - not found
===> Installing existing package /packages/All/gnuplot-5.4.1_5.pkg
[main-powerpc64le-default-job-10] Installing gnuplot-5.4.1_5...
[main-powerpc64le-default-job-10] `-- Installing at-spi2-core-2.50.0...
[main-powerpc64le-default-job-10] | `-- Installing dbus-1.14.10_2,1...
[main-powerpc64le-default-job-10] | | `-- Installing expat-2.5.0...
[main-powerpc64le-default-job-10] | | `-- Extracting expat-2.5.0: .......... done
[main-powerpc64le-default-job-10] | | `-- Installing libICE-1.1.0_2,1...
[main-powerpc64le-default-job-10] | | `-- Extracting libICE-1.1.0_2,1: .......... done
[main-powerpc64le-default-job-10] | | `-- Installing libSM-1.2.3_1,1...
[main-powerpc64le-default-job-10] | | `-- Extracting libSM-1.2.3_1,1: .......... done
[main-powerpc64le-default-job-10] | | `-- Installing libX11-1.8.7,1...
[main-powerpc64le-default-job-10] | | `-- Installing libxcb-1.15_1...
<snip>
| %lx
/wrkdirs/usr/ports/math/reduce/work/Reduce-svn6339-src/libraries/crlibm/tests/test_val.c:100:28: warning: format specifies type 'unsigned long long *' but the argument has type 'int64_t *' (aka 'long *') [-Wformat]
100 | sscanf(argv[5],"%llx", &input2.l);
| ~~~~ ^~~~~~~~~
| %lx
/wrkdirs/usr/ports/math/reduce/work/Reduce-svn6339-src/libraries/crlibm/tests/test_val.c:156:48: warning: passing arguments to a function without a prototype is deprecated in all versions of C and is not supported in C2x [-Wdeprecated-non-prototype]
156 | if (nbarg==1) res_crlibm.d = testfun_crlibm(input.d);
| ^
/wrkdirs/usr/ports/math/reduce/work/Reduce-svn6339-src/libraries/crlibm/tests/test_val.c:157:48: warning: passing arguments to a function without a prototype is deprecated in all versions of C and is not supported in C2x [-Wdeprecated-non-prototype]
157 | if (nbarg==2) res_crlibm.d = testfun_crlibm(input.d, input2.d);
| ^
/wrkdirs/usr/ports/math/reduce/work/Reduce-svn6339-src/libraries/crlibm/tests/test_val.c:228:44: warning: passing arguments to a function without a prototype is deprecated in all versions of C and is not supported in C2x [-Wdeprecated-non-prototype]
228 | if (nbarg==1) res_libm.d = testfun_libm(input.d);
| ^
/wrkdirs/usr/ports/math/reduce/work/Reduce-svn6339-src/libraries/crlibm/tests/test_val.c:229:44: warning: passing arguments to a function without a prototype is deprecated in all versions of C and is not supported in C2x [-Wdeprecated-non-prototype]
229 | if (nbarg==2) res_libm.d = testfun_libm(input.d, input2.d);
| ^
7 warnings generated.
mv -f .deps/test_val.Tpo .deps/test_val.Po
cc -DHAVE_CONFIG_H -I. -I/wrkdirs/usr/ports/math/reduce/work/Reduce-svn6339-src/libraries/crlibm/tests -I.. -I/wrkdirs/usr/ports/math/reduce/work/Reduce-svn6339-src/libraries/crlibm -I/usr/include -O0 -std=gnu99 -O2 -pipe -fstack-protector-strong -fno-strict-aliasing -MT test_common.o -MD -MP -MF .deps/test_common.Tpo -c -o test_common.o /wrkdirs/usr/ports/math/reduce/work/Reduce-svn6339-src/libraries/crlibm/tests/test_common.c
mv -f .deps/test_common.Tpo .deps/test_common.Po
/bin/sh ../libtool --tag=CC --mode=link cc -O0 -std=gnu99 -O2 -pipe -fstack-protector-strong -fno-strict-aliasing -fstack-protector-strong -o crlibm_testval test_val.o test_common.o ../libcrlibm.a -lm
libtool: link: cc -O0 -std=gnu99 -O2 -pipe -fstack-protector-strong -fno-strict-aliasing -fstack-protector-strong -o crlibm_testval test_val.o test_common.o ../libcrlibm.a -lm
cc -DHAVE_CONFIG_H -I. -I/wrkdirs/usr/ports/math/reduce/work/Reduce-svn6339-src/libraries/crlibm/tests -I.. -I/wrkdirs/usr/ports/math/reduce/work/Reduce-svn6339-src/libraries/crlibm -I/usr/include -O0 -std=gnu99 -O2 -pipe -fstack-protector-strong -fno-strict-aliasing -MT soak_test.o -MD -MP -MF .deps/soak_test.Tpo -c -o soak_test.o /wrkdirs/usr/ports/math/reduce/work/Reduce-svn6339-src/libraries/crlibm/tests/soak_test.c
mv -f .deps/soak_test.Tpo .deps/soak_test.Po
/bin/sh ../libtool --tag=CC --mode=link cc -O0 -std=gnu99 -O2 -pipe -fstack-protector-strong -fno-strict-aliasing -fstack-protector-strong -o crlibm_soaktest soak_test.o test_common.o ../libcrlibm.a -lm
libtool: link: cc -O0 -std=gnu99 -O2 -pipe -fstack-protector-strong -fno-strict-aliasing -fstack-protector-strong -o crlibm_soaktest soak_test.o test_common.o ../libcrlibm.a -lm
cc -DHAVE_CONFIG_H -I. -I/wrkdirs/usr/ports/math/reduce/work/Reduce-svn6339-src/libraries/crlibm/tests -I.. -I/wrkdirs/usr/ports/math/reduce/work/Reduce-svn6339-src/libraries/crlibm -I/usr/include -O0 -std=gnu99 -O2 -pipe -fstack-protector-strong -fno-strict-aliasing -MT test_perf.o -MD -MP -MF .deps/test_perf.Tpo -c -o test_perf.o /wrkdirs/usr/ports/math/reduce/work/Reduce-svn6339-src/libraries/crlibm/tests/test_perf.c
/wrkdirs/usr/ports/math/reduce/work/Reduce-svn6339-src/libraries/crlibm/tests/test_perf.c:207:22: warning: passing arguments to a function without a prototype is deprecated in all versions of C and is not supported in C2x [-Wdeprecated-non-prototype]
207 | result = testfun(i1);
| ^
/wrkdirs/usr/ports/math/reduce/work/Reduce-svn6339-src/libraries/crlibm/tests/test_perf.c:214:22: warning: passing arguments to a function without a prototype is deprecated in all versions of C and is not supported in C2x [-Wdeprecated-non-prototype]
214 | result = testfun(i1,i2);
| ^
/wrkdirs/usr/ports/math/reduce/work/Reduce-svn6339-src/libraries/crlibm/tests/test_perf.c:318:19: warning: passing arguments to a function without a prototype is deprecated in all versions of C and is not supported in C2x [-Wdeprecated-non-prototype]
318 | res = testfun(i1);
| ^
/wrkdirs/usr/ports/math/reduce/work/Reduce-svn6339-src/libraries/crlibm/tests/test_perf.c:325:19: warning: passing arguments to a function without a prototype is deprecated in all versions of C and is not supported in C2x [-Wdeprecated-non-prototype]
325 | res = testfun(i1,i2);
| ^
4 warnings generated.
mv -f .deps/test_perf.Tpo .deps/test_perf.Po
/bin/sh ../libtool --tag=CC --mode=link cc -O0 -std=gnu99 -O2 -pipe -fstack-protector-strong -fno-strict-aliasing -fstack-protector-strong -o crlibm_testperf test_perf.o test_common.o ../libcrlibm.a -lm
libtool: link: cc -O0 -std=gnu99 -O2 -pipe -fstack-protector-strong -fno-strict-aliasing -fstack-protector-strong -o crlibm_testperf test_perf.o test_common.o ../libcrlibm.a -lm
cc -DHAVE_CONFIG_H -I. -I/wrkdirs/usr/ports/math/reduce/work/Reduce-svn6339-src/libraries/crlibm/tests -I.. -I/wrkdirs/usr/ports/math/reduce/work/Reduce-svn6339-src/libraries/crlibm -I/usr/include -O0 -std=gnu99 -O2 -pipe -fstack-protector-strong -fno-strict-aliasing -MT blind_test.o -MD -MP -MF .deps/blind_test.Tpo -c -o blind_test.o /wrkdirs/usr/ports/math/reduce/work/Reduce-svn6339-src/libraries/crlibm/tests/blind_test.c
/wrkdirs/usr/ports/math/reduce/work/Reduce-svn6339-src/libraries/crlibm/tests/blind_test.c:112:32: warning: passing arguments to a function without a prototype is deprecated in all versions of C and is not supported in C2x [-Wdeprecated-non-prototype]
112 | output.d = testfun_crlibm(input.d, input2.d);
| ^
/wrkdirs/usr/ports/math/reduce/work/Reduce-svn6339-src/libraries/crlibm/tests/blind_test.c:114:34: warning: passing arguments to a function without a prototype is deprecated in all versions of C and is not supported in C2x [-Wdeprecated-non-prototype]
114 | output.d = testfun_crlibm(input.d);
| ^
2 warnings generated.
mv -f .deps/blind_test.Tpo .deps/blind_test.Po
/bin/sh ../libtool --tag=CC --mode=link cc -O0 -std=gnu99 -O2 -pipe -fstack-protector-strong -fno-strict-aliasing -fstack-protector-strong -o crlibm_blindtest blind_test.o test_common.o ../libcrlibm.a -lm
libtool: link: cc -O0 -std=gnu99 -O2 -pipe -fstack-protector-strong -fno-strict-aliasing -fstack-protector-strong -o crlibm_blindtest blind_test.o test_common.o ../libcrlibm.a -lm
cc -DHAVE_CONFIG_H -I. -I/wrkdirs/usr/ports/math/reduce/work/Reduce-svn6339-src/libraries/crlibm/tests -I.. -I/wrkdirs/usr/ports/math/reduce/work/Reduce-svn6339-src/libraries/crlibm -I/usr/include -O0 -std=gnu99 -O2 -pipe -fstack-protector-strong -fno-strict-aliasing -MT generate_test_vectors.o -MD -MP -MF .deps/generate_test_vectors.Tpo -c -o generate_test_vectors.o /wrkdirs/usr/ports/math/reduce/work/Reduce-svn6339-src/libraries/crlibm/tests/generate_test_vectors.c
mv -f .deps/generate_test_vectors.Tpo .deps/generate_test_vectors.Po
/bin/sh ../libtool --tag=CC --mode=link cc -O0 -std=gnu99 -O2 -pipe -fstack-protector-strong -fno-strict-aliasing -fstack-protector-strong -o crlibm_generate_test_vectors generate_test_vectors.o test_common.o ../libcrlibm.a -lm
libtool: link: cc -O0 -std=gnu99 -O2 -pipe -fstack-protector-strong -fno-strict-aliasing -fstack-protector-strong -o crlibm_generate_test_vectors generate_test_vectors.o test_common.o ../libcrlibm.a -lm
gmake[6]: Entering directory '/wrkdirs/usr/ports/math/reduce/work/Reduce-svn6339-src/cslbuild/powerpc64le-unknown-freebsd15.0/crlibm/tests'
/wrkdirs/usr/ports/math/reduce/work/Reduce-svn6339-src/libraries/crlibm/./install-sh -c -d '/wrkdirs/usr/ports/math/reduce/work/Reduce-svn6339-src/cslbuild/powerpc64le-unknown-freebsd15.0/bin'
/bin/sh ../libtool --mode=install install -s -m 555 crlibm_testval crlibm_soaktest crlibm_testperf crlibm_blindtest crlibm_generate_test_vectors '/wrkdirs/usr/ports/math/reduce/work/Reduce-svn6339-src/cslbuild/powerpc64le-unknown-freebsd15.0/bin'
libtool: install: install -m 555 -s crlibm_testval /wrkdirs/usr/ports/math/reduce/work/Reduce-svn6339-src/cslbuild/powerpc64le-unknown-freebsd15.0/bin/crlibm_testval
libtool: install: install -m 555 -s crlibm_soaktest /wrkdirs/usr/ports/math/reduce/work/Reduce-svn6339-src/cslbuild/powerpc64le-unknown-freebsd15.0/bin/crlibm_soaktest
libtool: install: install -m 555 -s crlibm_testperf /wrkdirs/usr/ports/math/reduce/work/Reduce-svn6339-src/cslbuild/powerpc64le-unknown-freebsd15.0/bin/crlibm_testperf
libtool: install: install -m 555 -s crlibm_blindtest /wrkdirs/usr/ports/math/reduce/work/Reduce-svn6339-src/cslbuild/powerpc64le-unknown-freebsd15.0/bin/crlibm_blindtest
libtool: install: install -m 555 -s crlibm_generate_test_vectors /wrkdirs/usr/ports/math/reduce/work/Reduce-svn6339-src/cslbuild/powerpc64le-unknown-freebsd15.0/bin/crlibm_generate_test_vectors
gmake[6]: Nothing to be done for 'install-data-am'.
gmake[6]: Leaving directory '/wrkdirs/usr/ports/math/reduce/work/Reduce-svn6339-src/cslbuild/powerpc64le-unknown-freebsd15.0/crlibm/tests'
gmake[5]: Leaving directory '/wrkdirs/usr/ports/math/reduce/work/Reduce-svn6339-src/cslbuild/powerpc64le-unknown-freebsd15.0/crlibm/tests'
gmake[4]: Leaving directory '/wrkdirs/usr/ports/math/reduce/work/Reduce-svn6339-src/cslbuild/powerpc64le-unknown-freebsd15.0/crlibm'
About to build libffi for /wrkdirs/usr/ports/math/reduce/work/Reduce-svn6339-src/cslbuild/powerpc64le-unknown-freebsd15.0/csl (../include/ffi.h)
gmake[4]: Entering directory '/wrkdirs/usr/ports/math/reduce/work/Reduce-svn6339-src/cslbuild/powerpc64le-unknown-freebsd15.0/libffi'
Making install in include
gmake[5]: Entering directory '/wrkdirs/usr/ports/math/reduce/work/Reduce-svn6339-src/cslbuild/powerpc64le-unknown-freebsd15.0/libffi/include'
gmake[6]: Entering directory '/wrkdirs/usr/ports/math/reduce/work/Reduce-svn6339-src/cslbuild/powerpc64le-unknown-freebsd15.0/libffi/include'
gmake[6]: Nothing to be done for 'install-exec-am'.
/wrkdirs/usr/ports/math/reduce/work/Reduce-svn6339-src/libraries/libffi/./install-sh -c -d '/wrkdirs/usr/ports/math/reduce/work/Reduce-svn6339-src/cslbuild/powerpc64le-unknown-freebsd15.0/include'
install -m 0644 ffi.h ffitarget.h '/wrkdirs/usr/ports/math/reduce/work/Reduce-svn6339-src/cslbuild/powerpc64le-unknown-freebsd15.0/include'
gmake[6]: Leaving directory '/wrkdirs/usr/ports/math/reduce/work/Reduce-svn6339-src/cslbuild/powerpc64le-unknown-freebsd15.0/libffi/include'
gmake[5]: Leaving directory '/wrkdirs/usr/ports/math/reduce/work/Reduce-svn6339-src/cslbuild/powerpc64le-unknown-freebsd15.0/libffi/include'
Making install in testsuite
gmake[5]: Entering directory '/wrkdirs/usr/ports/math/reduce/work/Reduce-svn6339-src/cslbuild/powerpc64le-unknown-freebsd15.0/libffi/testsuite'
gmake[6]: Entering directory '/wrkdirs/usr/ports/math/reduce/work/Reduce-svn6339-src/cslbuild/powerpc64le-unknown-freebsd15.0/libffi/testsuite'
gmake[6]: Nothing to be done for 'install-exec-am'.
gmake[6]: Nothing to be done for 'install-data-am'.
gmake[6]: Leaving directory '/wrkdirs/usr/ports/math/reduce/work/Reduce-svn6339-src/cslbuild/powerpc64le-unknown-freebsd15.0/libffi/testsuite'
gmake[5]: Leaving directory '/wrkdirs/usr/ports/math/reduce/work/Reduce-svn6339-src/cslbuild/powerpc64le-unknown-freebsd15.0/libffi/testsuite'
Making install in man
gmake[5]: Entering directory '/wrkdirs/usr/ports/math/reduce/work/Reduce-svn6339-src/cslbuild/powerpc64le-unknown-freebsd15.0/libffi/man'
gmake[6]: Entering directory '/wrkdirs/usr/ports/math/reduce/work/Reduce-svn6339-src/cslbuild/powerpc64le-unknown-freebsd15.0/libffi/man'
gmake[6]: Nothing to be done for 'install-exec-am'.
/wrkdirs/usr/ports/math/reduce/work/Reduce-svn6339-src/libraries/libffi/./install-sh -c -d '/wrkdirs/usr/ports/math/reduce/work/Reduce-svn6339-src/cslbuild/powerpc64le-unknown-freebsd15.0/share/man/man3'
install -m 0644 /wrkdirs/usr/ports/math/reduce/work/Reduce-svn6339-src/libraries/libffi/man/ffi.3 /wrkdirs/usr/ports/math/reduce/work/Reduce-svn6339-src/libraries/libffi/man/ffi_call.3 /wrkdirs/usr/ports/math/reduce/work/Reduce-svn6339-src/libraries/libffi/man/ffi_prep_cif.3 /wrkdirs/usr/ports/math/reduce/work/Reduce-svn6339-src/libraries/libffi/man/ffi_prep_cif_var.3 '/wrkdirs/usr/ports/math/reduce/work/Reduce-svn6339-src/cslbuild/powerpc64le-unknown-freebsd15.0/share/man/man3'
gmake[6]: Leaving directory '/wrkdirs/usr/ports/math/reduce/work/Reduce-svn6339-src/cslbuild/powerpc64le-unknown-freebsd15.0/libffi/man'
gmake[5]: Leaving directory '/wrkdirs/usr/ports/math/reduce/work/Reduce-svn6339-src/cslbuild/powerpc64le-unknown-freebsd15.0/libffi/man'
gmake[5]: Entering directory '/wrkdirs/usr/ports/math/reduce/work/Reduce-svn6339-src/cslbuild/powerpc64le-unknown-freebsd15.0/libffi'
depbase=`echo src/prep_cif.lo | sed 's|[^/]*$|.deps/&|;s|\.lo$||'`;\
/bin/sh ./libtool --tag=CC --mode=compile cc -DHAVE_CONFIG_H -I. -I/wrkdirs/usr/ports/math/reduce/work/Reduce-svn6339-src/libraries/libffi -I. -I/wrkdirs/usr/ports/math/reduce/work/Reduce-svn6339-src/libraries/libffi/include -Iinclude -I/wrkdirs/usr/ports/math/reduce/work/Reduce-svn6339-src/libraries/libffi/src -I/usr/include -O3 -Wall -fexceptions -MT src/prep_cif.lo -MD -MP -MF $depbase.Tpo -c -o src/prep_cif.lo /wrkdirs/usr/ports/math/reduce/work/Reduce-svn6339-src/libraries/libffi/src/prep_cif.c &&\
mv -f $depbase.Tpo $depbase.Plo
libtool: compile: cc -DHAVE_CONFIG_H -I. -I/wrkdirs/usr/ports/math/reduce/work/Reduce-svn6339-src/libraries/libffi -I. -I/wrkdirs/usr/ports/math/reduce/work/Reduce-svn6339-src/libraries/libffi/include -Iinclude -I/wrkdirs/usr/ports/math/reduce/work/Reduce-svn6339-src/libraries/libffi/src -I/usr/include -O3 -Wall -fexceptions -MT src/prep_cif.lo -MD -MP -MF src/.deps/prep_cif.Tpo -c /wrkdirs/usr/ports/math/reduce/work/Reduce-svn6339-src/libraries/libffi/src/prep_cif.c -fPIC -DPIC -o src/.libs/prep_cif.o
libtool: compile: cc -DHAVE_CONFIG_H -I. -I/wrkdirs/usr/ports/math/reduce/work/Reduce-svn6339-src/libraries/libffi -I. -I/wrkdirs/usr/ports/math/reduce/work/Reduce-svn6339-src/libraries/libffi/include -Iinclude -I/wrkdirs/usr/ports/math/reduce/work/Reduce-svn6339-src/libraries/libffi/src -I/usr/include -O3 -Wall -fexceptions -MT src/prep_cif.lo -MD -MP -MF src/.deps/prep_cif.Tpo -c /wrkdirs/usr/ports/math/reduce/work/Reduce-svn6339-src/libraries/libffi/src/prep_cif.c -o src/prep_cif.o >/dev/null 2>&1
depbase=`echo src/types.lo | sed 's|[^/]*$|.deps/&|;s|\.lo$||'`;\
/bin/sh ./libtool --tag=CC --mode=compile cc -DHAVE_CONFIG_H -I. -I/wrkdirs/usr/ports/math/reduce/work/Reduce-svn6339-src/libraries/libffi -I. -I/wrkdirs/usr/ports/math/reduce/work/Reduce-svn6339-src/libraries/libffi/include -Iinclude -I/wrkdirs/usr/ports/math/reduce/work/Reduce-svn6339-src/libraries/libffi/src -I/usr/include -O3 -Wall -fexceptions -MT src/types.lo -MD -MP -MF $depbase.Tpo -c -o src/types.lo /wrkdirs/usr/ports/math/reduce/work/Reduce-svn6339-src/libraries/libffi/src/types.c &&\
mv -f $depbase.Tpo $depbase.Plo
libtool: compile: cc -DHAVE_CONFIG_H -I. -I/wrkdirs/usr/ports/math/reduce/work/Reduce-svn6339-src/libraries/libffi -I. -I/wrkdirs/usr/ports/math/reduce/work/Reduce-svn6339-src/libraries/libffi/include -Iinclude -I/wrkdirs/usr/ports/math/reduce/work/Reduce-svn6339-src/libraries/libffi/src -I/usr/include -O3 -Wall -fexceptions -MT src/types.lo -MD -MP -MF src/.deps/types.Tpo -c /wrkdirs/usr/ports/math/reduce/work/Reduce-svn6339-src/libraries/libffi/src/types.c -fPIC -DPIC -o src/.libs/types.o
libtool: compile: cc -DHAVE_CONFIG_H -I. -I/wrkdirs/usr/ports/math/reduce/work/Reduce-svn6339-src/libraries/libffi -I. -I/wrkdirs/usr/ports/math/reduce/work/Reduce-svn6339-src/libraries/libffi/include -Iinclude -I/wrkdirs/usr/ports/math/reduce/work/Reduce-svn6339-src/libraries/libffi/src -I/usr/include -O3 -Wall -fexceptions -MT src/types.lo -MD -MP -MF src/.deps/types.Tpo -c /wrkdirs/usr/ports/math/reduce/work/Reduce-svn6339-src/libraries/libffi/src/types.c -o src/types.o >/dev/null 2>&1
depbase=`echo src/raw_api.lo | sed 's|[^/]*$|.deps/&|;s|\.lo$||'`;\
/bin/sh ./libtool --tag=CC --mode=compile cc -DHAVE_CONFIG_H -I. -I/wrkdirs/usr/ports/math/reduce/work/Reduce-svn6339-src/libraries/libffi -I. -I/wrkdirs/usr/ports/math/reduce/work/Reduce-svn6339-src/libraries/libffi/include -Iinclude -I/wrkdirs/usr/ports/math/reduce/work/Reduce-svn6339-src/libraries/libffi/src -I/usr/include -O3 -Wall -fexceptions -MT src/raw_api.lo -MD -MP -MF $depbase.Tpo -c -o src/raw_api.lo /wrkdirs/usr/ports/math/reduce/work/Reduce-svn6339-src/libraries/libffi/src/raw_api.c &&\
mv -f $depbase.Tpo $depbase.Plo
libtool: compile: cc -DHAVE_CONFIG_H -I. -I/wrkdirs/usr/ports/math/reduce/work/Reduce-svn6339-src/libraries/libffi -I. -I/wrkdirs/usr/ports/math/reduce/work/Reduce-svn6339-src/libraries/libffi/include -Iinclude -I/wrkdirs/usr/ports/math/reduce/work/Reduce-svn6339-src/libraries/libffi/src -I/usr/include -O3 -Wall -fexceptions -MT src/raw_api.lo -MD -MP -MF src/.deps/raw_api.Tpo -c /wrkdirs/usr/ports/math/reduce/work/Reduce-svn6339-src/libraries/libffi/src/raw_api.c -fPIC -DPIC -o src/.libs/raw_api.o
libtool: compile: cc -DHAVE_CONFIG_H -I. -I/wrkdirs/usr/ports/math/reduce/work/Reduce-svn6339-src/libraries/libffi -I. -I/wrkdirs/usr/ports/math/reduce/work/Reduce-svn6339-src/libraries/libffi/include -Iinclude -I/wrkdirs/usr/ports/math/reduce/work/Reduce-svn6339-src/libraries/libffi/src -I/usr/include -O3 -Wall -fexceptions -MT src/raw_api.lo -MD -MP -MF src/.deps/raw_api.Tpo -c /wrkdirs/usr/ports/math/reduce/work/Reduce-svn6339-src/libraries/libffi/src/raw_api.c -o src/raw_api.o >/dev/null 2>&1
depbase=`echo src/java_raw_api.lo | sed 's|[^/]*$|.deps/&|;s|\.lo$||'`;\
/bin/sh ./libtool --tag=CC --mode=compile cc -DHAVE_CONFIG_H -I. -I/wrkdirs/usr/ports/math/reduce/work/Reduce-svn6339-src/libraries/libffi -I. -I/wrkdirs/usr/ports/math/reduce/work/Reduce-svn6339-src/libraries/libffi/include -Iinclude -I/wrkdirs/usr/ports/math/reduce/work/Reduce-svn6339-src/libraries/libffi/src -I/usr/include -O3 -Wall -fexceptions -MT src/java_raw_api.lo -MD -MP -MF $depbase.Tpo -c -o src/java_raw_api.lo /wrkdirs/usr/ports/math/reduce/work/Reduce-svn6339-src/libraries/libffi/src/java_raw_api.c &&\
mv -f $depbase.Tpo $depbase.Plo
libtool: compile: cc -DHAVE_CONFIG_H -I. -I/wrkdirs/usr/ports/math/reduce/work/Reduce-svn6339-src/libraries/libffi -I. -I/wrkdirs/usr/ports/math/reduce/work/Reduce-svn6339-src/libraries/libffi/include -Iinclude -I/wrkdirs/usr/ports/math/reduce/work/Reduce-svn6339-src/libraries/libffi/src -I/usr/include -O3 -Wall -fexceptions -MT src/java_raw_api.lo -MD -MP -MF src/.deps/java_raw_api.Tpo -c /wrkdirs/usr/ports/math/reduce/work/Reduce-svn6339-src/libraries/libffi/src/java_raw_api.c -fPIC -DPIC -o src/.libs/java_raw_api.o
libtool: compile: cc -DHAVE_CONFIG_H -I. -I/wrkdirs/usr/ports/math/reduce/work/Reduce-svn6339-src/libraries/libffi -I. -I/wrkdirs/usr/ports/math/reduce/work/Reduce-svn6339-src/libraries/libffi/include -Iinclude -I/wrkdirs/usr/ports/math/reduce/work/Reduce-svn6339-src/libraries/libffi/src -I/usr/include -O3 -Wall -fexceptions -MT src/java_raw_api.lo -MD -MP -MF src/.deps/java_raw_api.Tpo -c /wrkdirs/usr/ports/math/reduce/work/Reduce-svn6339-src/libraries/libffi/src/java_raw_api.c -o src/java_raw_api.o >/dev/null 2>&1
depbase=`echo src/closures.lo | sed 's|[^/]*$|.deps/&|;s|\.lo$||'`;\
/bin/sh ./libtool --tag=CC --mode=compile cc -DHAVE_CONFIG_H -I. -I/wrkdirs/usr/ports/math/reduce/work/Reduce-svn6339-src/libraries/libffi -I. -I/wrkdirs/usr/ports/math/reduce/work/Reduce-svn6339-src/libraries/libffi/include -Iinclude -I/wrkdirs/usr/ports/math/reduce/work/Reduce-svn6339-src/libraries/libffi/src -I/usr/include -O3 -Wall -fexceptions -MT src/closures.lo -MD -MP -MF $depbase.Tpo -c -o src/closures.lo /wrkdirs/usr/ports/math/reduce/work/Reduce-svn6339-src/libraries/libffi/src/closures.c &&\
mv -f $depbase.Tpo $depbase.Plo
libtool: compile: cc -DHAVE_CONFIG_H -I. -I/wrkdirs/usr/ports/math/reduce/work/Reduce-svn6339-src/libraries/libffi -I. -I/wrkdirs/usr/ports/math/reduce/work/Reduce-svn6339-src/libraries/libffi/include -Iinclude -I/wrkdirs/usr/ports/math/reduce/work/Reduce-svn6339-src/libraries/libffi/src -I/usr/include -O3 -Wall -fexceptions -MT src/closures.lo -MD -MP -MF src/.deps/closures.Tpo -c /wrkdirs/usr/ports/math/reduce/work/Reduce-svn6339-src/libraries/libffi/src/closures.c -fPIC -DPIC -o src/.libs/closures.o
In file included from /wrkdirs/usr/ports/math/reduce/work/Reduce-svn6339-src/libraries/libffi/src/closures.c:523:
/wrkdirs/usr/ports/math/reduce/work/Reduce-svn6339-src/libraries/libffi/src/dlmalloc.c:3385:7: warning: variable 'nfences' set but not used [-Wunused-but-set-variable]
3385 | int nfences = 0;
| ^
1 warning generated.
libtool: compile: cc -DHAVE_CONFIG_H -I. -I/wrkdirs/usr/ports/math/reduce/work/Reduce-svn6339-src/libraries/libffi -I. -I/wrkdirs/usr/ports/math/reduce/work/Reduce-svn6339-src/libraries/libffi/include -Iinclude -I/wrkdirs/usr/ports/math/reduce/work/Reduce-svn6339-src/libraries/libffi/src -I/usr/include -O3 -Wall -fexceptions -MT src/closures.lo -MD -MP -MF src/.deps/closures.Tpo -c /wrkdirs/usr/ports/math/reduce/work/Reduce-svn6339-src/libraries/libffi/src/closures.c -o src/closures.o >/dev/null 2>&1
depbase=`echo src/powerpc/ffi.lo | sed 's|[^/]*$|.deps/&|;s|\.lo$||'`;\
/bin/sh ./libtool --tag=CC --mode=compile cc -DHAVE_CONFIG_H -I. -I/wrkdirs/usr/ports/math/reduce/work/Reduce-svn6339-src/libraries/libffi -I. -I/wrkdirs/usr/ports/math/reduce/work/Reduce-svn6339-src/libraries/libffi/include -Iinclude -I/wrkdirs/usr/ports/math/reduce/work/Reduce-svn6339-src/libraries/libffi/src -I/usr/include -O3 -Wall -fexceptions -MT src/powerpc/ffi.lo -MD -MP -MF $depbase.Tpo -c -o src/powerpc/ffi.lo /wrkdirs/usr/ports/math/reduce/work/Reduce-svn6339-src/libraries/libffi/src/powerpc/ffi.c &&\
mv -f $depbase.Tpo $depbase.Plo
libtool: compile: cc -DHAVE_CONFIG_H -I. -I/wrkdirs/usr/ports/math/reduce/work/Reduce-svn6339-src/libraries/libffi -I. -I/wrkdirs/usr/ports/math/reduce/work/Reduce-svn6339-src/libraries/libffi/include -Iinclude -I/wrkdirs/usr/ports/math/reduce/work/Reduce-svn6339-src/libraries/libffi/src -I/usr/include -O3 -Wall -fexceptions -MT src/powerpc/ffi.lo -MD -MP -MF src/powerpc/.deps/ffi.Tpo -c /wrkdirs/usr/ports/math/reduce/work/Reduce-svn6339-src/libraries/libffi/src/powerpc/ffi.c -fPIC -DPIC -o src/powerpc/.libs/ffi.o
libtool: compile: cc -DHAVE_CONFIG_H -I. -I/wrkdirs/usr/ports/math/reduce/work/Reduce-svn6339-src/libraries/libffi -I. -I/wrkdirs/usr/ports/math/reduce/work/Reduce-svn6339-src/libraries/libffi/include -Iinclude -I/wrkdirs/usr/ports/math/reduce/work/Reduce-svn6339-src/libraries/libffi/src -I/usr/include -O3 -Wall -fexceptions -MT src/powerpc/ffi.lo -MD -MP -MF src/powerpc/.deps/ffi.Tpo -c /wrkdirs/usr/ports/math/reduce/work/Reduce-svn6339-src/libraries/libffi/src/powerpc/ffi.c -o src/powerpc/ffi.o >/dev/null 2>&1
depbase=`echo src/powerpc/ffi_sysv.lo | sed 's|[^/]*$|.deps/&|;s|\.lo$||'`;\
/bin/sh ./libtool --tag=CC --mode=compile cc -DHAVE_CONFIG_H -I. -I/wrkdirs/usr/ports/math/reduce/work/Reduce-svn6339-src/libraries/libffi -I. -I/wrkdirs/usr/ports/math/reduce/work/Reduce-svn6339-src/libraries/libffi/include -Iinclude -I/wrkdirs/usr/ports/math/reduce/work/Reduce-svn6339-src/libraries/libffi/src -I/usr/include -O3 -Wall -fexceptions -MT src/powerpc/ffi_sysv.lo -MD -MP -MF $depbase.Tpo -c -o src/powerpc/ffi_sysv.lo /wrkdirs/usr/ports/math/reduce/work/Reduce-svn6339-src/libraries/libffi/src/powerpc/ffi_sysv.c &&\
mv -f $depbase.Tpo $depbase.Plo
libtool: compile: cc -DHAVE_CONFIG_H -I. -I/wrkdirs/usr/ports/math/reduce/work/Reduce-svn6339-src/libraries/libffi -I. -I/wrkdirs/usr/ports/math/reduce/work/Reduce-svn6339-src/libraries/libffi/include -Iinclude -I/wrkdirs/usr/ports/math/reduce/work/Reduce-svn6339-src/libraries/libffi/src -I/usr/include -O3 -Wall -fexceptions -MT src/powerpc/ffi_sysv.lo -MD -MP -MF src/powerpc/.deps/ffi_sysv.Tpo -c /wrkdirs/usr/ports/math/reduce/work/Reduce-svn6339-src/libraries/libffi/src/powerpc/ffi_sysv.c -fPIC -DPIC -o src/powerpc/.libs/ffi_sysv.o
libtool: compile: cc -DHAVE_CONFIG_H -I. -I/wrkdirs/usr/ports/math/reduce/work/Reduce-svn6339-src/libraries/libffi -I. -I/wrkdirs/usr/ports/math/reduce/work/Reduce-svn6339-src/libraries/libffi/include -Iinclude -I/wrkdirs/usr/ports/math/reduce/work/Reduce-svn6339-src/libraries/libffi/src -I/usr/include -O3 -Wall -fexceptions -MT src/powerpc/ffi_sysv.lo -MD -MP -MF src/powerpc/.deps/ffi_sysv.Tpo -c /wrkdirs/usr/ports/math/reduce/work/Reduce-svn6339-src/libraries/libffi/src/powerpc/ffi_sysv.c -o src/powerpc/ffi_sysv.o >/dev/null 2>&1
depbase=`echo src/powerpc/ffi_linux64.lo | sed 's|[^/]*$|.deps/&|;s|\.lo$||'`;\
/bin/sh ./libtool --tag=CC --mode=compile cc -DHAVE_CONFIG_H -I. -I/wrkdirs/usr/ports/math/reduce/work/Reduce-svn6339-src/libraries/libffi -I. -I/wrkdirs/usr/ports/math/reduce/work/Reduce-svn6339-src/libraries/libffi/include -Iinclude -I/wrkdirs/usr/ports/math/reduce/work/Reduce-svn6339-src/libraries/libffi/src -I/usr/include -O3 -Wall -fexceptions -MT src/powerpc/ffi_linux64.lo -MD -MP -MF $depbase.Tpo -c -o src/powerpc/ffi_linux64.lo /wrkdirs/usr/ports/math/reduce/work/Reduce-svn6339-src/libraries/libffi/src/powerpc/ffi_linux64.c &&\
mv -f $depbase.Tpo $depbase.Plo
libtool: compile: cc -DHAVE_CONFIG_H -I. -I/wrkdirs/usr/ports/math/reduce/work/Reduce-svn6339-src/libraries/libffi -I. -I/wrkdirs/usr/ports/math/reduce/work/Reduce-svn6339-src/libraries/libffi/include -Iinclude -I/wrkdirs/usr/ports/math/reduce/work/Reduce-svn6339-src/libraries/libffi/src -I/usr/include -O3 -Wall -fexceptions -MT src/powerpc/ffi_linux64.lo -MD -MP -MF src/powerpc/.deps/ffi_linux64.Tpo -c /wrkdirs/usr/ports/math/reduce/work/Reduce-svn6339-src/libraries/libffi/src/powerpc/ffi_linux64.c -fPIC -DPIC -o src/powerpc/.libs/ffi_linux64.o
/wrkdirs/usr/ports/math/reduce/work/Reduce-svn6339-src/libraries/libffi/src/powerpc/ffi_linux64.c:495:2: warning: unused label 'do_double' [-Wunused-label]
495 | do_double:
| ^~~~~~~~~~
/wrkdirs/usr/ports/math/reduce/work/Reduce-svn6339-src/libraries/libffi/src/powerpc/ffi_linux64.c:514:2: warning: unused label 'do_float' [-Wunused-label]
514 | do_float:
| ^~~~~~~~~
/wrkdirs/usr/ports/math/reduce/work/Reduce-svn6339-src/libraries/libffi/src/powerpc/ffi_linux64.c:918:2: warning: unused label 'do_double' [-Wunused-label]
918 | do_double:
| ^~~~~~~~~~
/wrkdirs/usr/ports/math/reduce/work/Reduce-svn6339-src/libraries/libffi/src/powerpc/ffi_linux64.c:933:2: warning: unused label 'do_float' [-Wunused-label]
933 | do_float:
| ^~~~~~~~~
4 warnings generated.
libtool: compile: cc -DHAVE_CONFIG_H -I. -I/wrkdirs/usr/ports/math/reduce/work/Reduce-svn6339-src/libraries/libffi -I. -I/wrkdirs/usr/ports/math/reduce/work/Reduce-svn6339-src/libraries/libffi/include -Iinclude -I/wrkdirs/usr/ports/math/reduce/work/Reduce-svn6339-src/libraries/libffi/src -I/usr/include -O3 -Wall -fexceptions -MT src/powerpc/ffi_linux64.lo -MD -MP -MF src/powerpc/.deps/ffi_linux64.Tpo -c /wrkdirs/usr/ports/math/reduce/work/Reduce-svn6339-src/libraries/libffi/src/powerpc/ffi_linux64.c -o src/powerpc/ffi_linux64.o >/dev/null 2>&1
depbase=`echo src/powerpc/sysv.lo | sed 's|[^/]*$|.deps/&|;s|\.lo$||'`;\
/bin/sh ./libtool --tag=CC --mode=compile cc -DHAVE_CONFIG_H -I. -I/wrkdirs/usr/ports/math/reduce/work/Reduce-svn6339-src/libraries/libffi -I. -I/wrkdirs/usr/ports/math/reduce/work/Reduce-svn6339-src/libraries/libffi/include -Iinclude -I/wrkdirs/usr/ports/math/reduce/work/Reduce-svn6339-src/libraries/libffi/src -I/usr/include -I. -I/wrkdirs/usr/ports/math/reduce/work/Reduce-svn6339-src/libraries/libffi/include -Iinclude -I/wrkdirs/usr/ports/math/reduce/work/Reduce-svn6339-src/libraries/libffi/src -O2 -pipe -fstack-protector-strong -fno-strict-aliasing -MT src/powerpc/sysv.lo -MD -MP -MF $depbase.Tpo -c -o src/powerpc/sysv.lo /wrkdirs/usr/ports/math/reduce/work/Reduce-svn6339-src/libraries/libffi/src/powerpc/sysv.S &&\
mv -f $depbase.Tpo $depbase.Plo
libtool: compile: cc -DHAVE_CONFIG_H -I. -I/wrkdirs/usr/ports/math/reduce/work/Reduce-svn6339-src/libraries/libffi -I. -I/wrkdirs/usr/ports/math/reduce/work/Reduce-svn6339-src/libraries/libffi/include -Iinclude -I/wrkdirs/usr/ports/math/reduce/work/Reduce-svn6339-src/libraries/libffi/src -I/usr/include -I. -I/wrkdirs/usr/ports/math/reduce/work/Reduce-svn6339-src/libraries/libffi/include -Iinclude -I/wrkdirs/usr/ports/math/reduce/work/Reduce-svn6339-src/libraries/libffi/src -O2 -pipe -fstack-protector-strong -fno-strict-aliasing -MT src/powerpc/sysv.lo -MD -MP -MF src/powerpc/.deps/sysv.Tpo -c /wrkdirs/usr/ports/math/reduce/work/Reduce-svn6339-src/libraries/libffi/src/powerpc/sysv.S -fPIC -DPIC -o src/powerpc/.libs/sysv.o
libtool: compile: cc -DHAVE_CONFIG_H -I. -I/wrkdirs/usr/ports/math/reduce/work/Reduce-svn6339-src/libraries/libffi -I. -I/wrkdirs/usr/ports/math/reduce/work/Reduce-svn6339-src/libraries/libffi/include -Iinclude -I/wrkdirs/usr/ports/math/reduce/work/Reduce-svn6339-src/libraries/libffi/src -I/usr/include -I. -I/wrkdirs/usr/ports/math/reduce/work/Reduce-svn6339-src/libraries/libffi/include -Iinclude -I/wrkdirs/usr/ports/math/reduce/work/Reduce-svn6339-src/libraries/libffi/src -O2 -pipe -fstack-protector-strong -fno-strict-aliasing -MT src/powerpc/sysv.lo -MD -MP -MF src/powerpc/.deps/sysv.Tpo -c /wrkdirs/usr/ports/math/reduce/work/Reduce-svn6339-src/libraries/libffi/src/powerpc/sysv.S -o src/powerpc/sysv.o >/dev/null 2>&1
depbase=`echo src/powerpc/ppc_closure.lo | sed 's|[^/]*$|.deps/&|;s|\.lo$||'`;\
/bin/sh ./libtool --tag=CC --mode=compile cc -DHAVE_CONFIG_H -I. -I/wrkdirs/usr/ports/math/reduce/work/Reduce-svn6339-src/libraries/libffi -I. -I/wrkdirs/usr/ports/math/reduce/work/Reduce-svn6339-src/libraries/libffi/include -Iinclude -I/wrkdirs/usr/ports/math/reduce/work/Reduce-svn6339-src/libraries/libffi/src -I/usr/include -I. -I/wrkdirs/usr/ports/math/reduce/work/Reduce-svn6339-src/libraries/libffi/include -Iinclude -I/wrkdirs/usr/ports/math/reduce/work/Reduce-svn6339-src/libraries/libffi/src -O2 -pipe -fstack-protector-strong -fno-strict-aliasing -MT src/powerpc/ppc_closure.lo -MD -MP -MF $depbase.Tpo -c -o src/powerpc/ppc_closure.lo /wrkdirs/usr/ports/math/reduce/work/Reduce-svn6339-src/libraries/libffi/src/powerpc/ppc_closure.S &&\
mv -f $depbase.Tpo $depbase.Plo
libtool: compile: cc -DHAVE_CONFIG_H -I. -I/wrkdirs/usr/ports/math/reduce/work/Reduce-svn6339-src/libraries/libffi -I. -I/wrkdirs/usr/ports/math/reduce/work/Reduce-svn6339-src/libraries/libffi/include -Iinclude -I/wrkdirs/usr/ports/math/reduce/work/Reduce-svn6339-src/libraries/libffi/src -I/usr/include -I. -I/wrkdirs/usr/ports/math/reduce/work/Reduce-svn6339-src/libraries/libffi/include -Iinclude -I/wrkdirs/usr/ports/math/reduce/work/Reduce-svn6339-src/libraries/libffi/src -O2 -pipe -fstack-protector-strong -fno-strict-aliasing -MT src/powerpc/ppc_closure.lo -MD -MP -MF src/powerpc/.deps/ppc_closure.Tpo -c /wrkdirs/usr/ports/math/reduce/work/Reduce-svn6339-src/libraries/libffi/src/powerpc/ppc_closure.S -fPIC -DPIC -o src/powerpc/.libs/ppc_closure.o
libtool: compile: cc -DHAVE_CONFIG_H -I. -I/wrkdirs/usr/ports/math/reduce/work/Reduce-svn6339-src/libraries/libffi -I. -I/wrkdirs/usr/ports/math/reduce/work/Reduce-svn6339-src/libraries/libffi/include -Iinclude -I/wrkdirs/usr/ports/math/reduce/work/Reduce-svn6339-src/libraries/libffi/src -I/usr/include -I. -I/wrkdirs/usr/ports/math/reduce/work/Reduce-svn6339-src/libraries/libffi/include -Iinclude -I/wrkdirs/usr/ports/math/reduce/work/Reduce-svn6339-src/libraries/libffi/src -O2 -pipe -fstack-protector-strong -fno-strict-aliasing -MT src/powerpc/ppc_closure.lo -MD -MP -MF src/powerpc/.deps/ppc_closure.Tpo -c /wrkdirs/usr/ports/math/reduce/work/Reduce-svn6339-src/libraries/libffi/src/powerpc/ppc_closure.S -o src/powerpc/ppc_closure.o >/dev/null 2>&1
depbase=`echo src/powerpc/linux64.lo | sed 's|[^/]*$|.deps/&|;s|\.lo$||'`;\
/bin/sh ./libtool --tag=CC --mode=compile cc -DHAVE_CONFIG_H -I. -I/wrkdirs/usr/ports/math/reduce/work/Reduce-svn6339-src/libraries/libffi -I. -I/wrkdirs/usr/ports/math/reduce/work/Reduce-svn6339-src/libraries/libffi/include -Iinclude -I/wrkdirs/usr/ports/math/reduce/work/Reduce-svn6339-src/libraries/libffi/src -I/usr/include -I. -I/wrkdirs/usr/ports/math/reduce/work/Reduce-svn6339-src/libraries/libffi/include -Iinclude -I/wrkdirs/usr/ports/math/reduce/work/Reduce-svn6339-src/libraries/libffi/src -O2 -pipe -fstack-protector-strong -fno-strict-aliasing -MT src/powerpc/linux64.lo -MD -MP -MF $depbase.Tpo -c -o src/powerpc/linux64.lo /wrkdirs/usr/ports/math/reduce/work/Reduce-svn6339-src/libraries/libffi/src/powerpc/linux64.S &&\
mv -f $depbase.Tpo $depbase.Plo
libtool: compile: cc -DHAVE_CONFIG_H -I. -I/wrkdirs/usr/ports/math/reduce/work/Reduce-svn6339-src/libraries/libffi -I. -I/wrkdirs/usr/ports/math/reduce/work/Reduce-svn6339-src/libraries/libffi/include -Iinclude -I/wrkdirs/usr/ports/math/reduce/work/Reduce-svn6339-src/libraries/libffi/src -I/usr/include -I. -I/wrkdirs/usr/ports/math/reduce/work/Reduce-svn6339-src/libraries/libffi/include -Iinclude -I/wrkdirs/usr/ports/math/reduce/work/Reduce-svn6339-src/libraries/libffi/src -O2 -pipe -fstack-protector-strong -fno-strict-aliasing -MT src/powerpc/linux64.lo -MD -MP -MF src/powerpc/.deps/linux64.Tpo -c /wrkdirs/usr/ports/math/reduce/work/Reduce-svn6339-src/libraries/libffi/src/powerpc/linux64.S -fPIC -DPIC -o src/powerpc/.libs/linux64.o
libtool: compile: cc -DHAVE_CONFIG_H -I. -I/wrkdirs/usr/ports/math/reduce/work/Reduce-svn6339-src/libraries/libffi -I. -I/wrkdirs/usr/ports/math/reduce/work/Reduce-svn6339-src/libraries/libffi/include -Iinclude -I/wrkdirs/usr/ports/math/reduce/work/Reduce-svn6339-src/libraries/libffi/src -I/usr/include -I. -I/wrkdirs/usr/ports/math/reduce/work/Reduce-svn6339-src/libraries/libffi/include -Iinclude -I/wrkdirs/usr/ports/math/reduce/work/Reduce-svn6339-src/libraries/libffi/src -O2 -pipe -fstack-protector-strong -fno-strict-aliasing -MT src/powerpc/linux64.lo -MD -MP -MF src/powerpc/.deps/linux64.Tpo -c /wrkdirs/usr/ports/math/reduce/work/Reduce-svn6339-src/libraries/libffi/src/powerpc/linux64.S -o src/powerpc/linux64.o >/dev/null 2>&1
depbase=`echo src/powerpc/linux64_closure.lo | sed 's|[^/]*$|.deps/&|;s|\.lo$||'`;\
/bin/sh ./libtool --tag=CC --mode=compile cc -DHAVE_CONFIG_H -I. -I/wrkdirs/usr/ports/math/reduce/work/Reduce-svn6339-src/libraries/libffi -I. -I/wrkdirs/usr/ports/math/reduce/work/Reduce-svn6339-src/libraries/libffi/include -Iinclude -I/wrkdirs/usr/ports/math/reduce/work/Reduce-svn6339-src/libraries/libffi/src -I/usr/include -I. -I/wrkdirs/usr/ports/math/reduce/work/Reduce-svn6339-src/libraries/libffi/include -Iinclude -I/wrkdirs/usr/ports/math/reduce/work/Reduce-svn6339-src/libraries/libffi/src -O2 -pipe -fstack-protector-strong -fno-strict-aliasing -MT src/powerpc/linux64_closure.lo -MD -MP -MF $depbase.Tpo -c -o src/powerpc/linux64_closure.lo /wrkdirs/usr/ports/math/reduce/work/Reduce-svn6339-src/libraries/libffi/src/powerpc/linux64_closure.S &&\
mv -f $depbase.Tpo $depbase.Plo
libtool: compile: cc -DHAVE_CONFIG_H -I. -I/wrkdirs/usr/ports/math/reduce/work/Reduce-svn6339-src/libraries/libffi -I. -I/wrkdirs/usr/ports/math/reduce/work/Reduce-svn6339-src/libraries/libffi/include -Iinclude -I/wrkdirs/usr/ports/math/reduce/work/Reduce-svn6339-src/libraries/libffi/src -I/usr/include -I. -I/wrkdirs/usr/ports/math/reduce/work/Reduce-svn6339-src/libraries/libffi/include -Iinclude -I/wrkdirs/usr/ports/math/reduce/work/Reduce-svn6339-src/libraries/libffi/src -O2 -pipe -fstack-protector-strong -fno-strict-aliasing -MT src/powerpc/linux64_closure.lo -MD -MP -MF src/powerpc/.deps/linux64_closure.Tpo -c /wrkdirs/usr/ports/math/reduce/work/Reduce-svn6339-src/libraries/libffi/src/powerpc/linux64_closure.S -fPIC -DPIC -o src/powerpc/.libs/linux64_closure.o
libtool: compile: cc -DHAVE_CONFIG_H -I. -I/wrkdirs/usr/ports/math/reduce/work/Reduce-svn6339-src/libraries/libffi -I. -I/wrkdirs/usr/ports/math/reduce/work/Reduce-svn6339-src/libraries/libffi/include -Iinclude -I/wrkdirs/usr/ports/math/reduce/work/Reduce-svn6339-src/libraries/libffi/src -I/usr/include -I. -I/wrkdirs/usr/ports/math/reduce/work/Reduce-svn6339-src/libraries/libffi/include -Iinclude -I/wrkdirs/usr/ports/math/reduce/work/Reduce-svn6339-src/libraries/libffi/src -O2 -pipe -fstack-protector-strong -fno-strict-aliasing -MT src/powerpc/linux64_closure.lo -MD -MP -MF src/powerpc/.deps/linux64_closure.Tpo -c /wrkdirs/usr/ports/math/reduce/work/Reduce-svn6339-src/libraries/libffi/src/powerpc/linux64_closure.S -o src/powerpc/linux64_closure.o >/dev/null 2>&1
cc -DHAVE_CONFIG_H -I. -I/wrkdirs/usr/ports/math/reduce/work/Reduce-svn6339-src/libraries/libffi -I. -I/wrkdirs/usr/ports/math/reduce/work/Reduce-svn6339-src/libraries/libffi/include -Iinclude -I/wrkdirs/usr/ports/math/reduce/work/Reduce-svn6339-src/libraries/libffi/src -I/usr/include -O3 -Wall -fexceptions -DPOWERPC -E -x assembler-with-cpp -o libffi.map /wrkdirs/usr/ports/math/reduce/work/Reduce-svn6339-src/libraries/libffi/libffi.map.in
/bin/sh ./libtool --tag=CC --mode=link cc -O3 -Wall -fexceptions -fstack-protector-strong -o libffi_convenience.la src/prep_cif.lo src/types.lo src/raw_api.lo src/java_raw_api.lo src/closures.lo src/powerpc/ffi.lo src/powerpc/ffi_sysv.lo src/powerpc/ffi_linux64.lo src/powerpc/sysv.lo src/powerpc/ppc_closure.lo src/powerpc/linux64.lo src/powerpc/linux64_closure.lo
libtool: link: ar cr .libs/libffi_convenience.a src/.libs/prep_cif.o src/.libs/types.o src/.libs/raw_api.o src/.libs/java_raw_api.o src/.libs/closures.o src/powerpc/.libs/ffi.o src/powerpc/.libs/ffi_sysv.o src/powerpc/.libs/ffi_linux64.o src/powerpc/.libs/sysv.o src/powerpc/.libs/ppc_closure.o src/powerpc/.libs/linux64.o src/powerpc/.libs/linux64_closure.o
libtool: link: ranlib .libs/libffi_convenience.a
libtool: link: ( cd ".libs" && rm -f "libffi_convenience.la" && ln -s "../libffi_convenience.la" "libffi_convenience.la" )
/bin/sh ./libtool --tag=CC --mode=link cc -O3 -Wall -fexceptions -no-undefined -version-info `grep -v '^#' /wrkdirs/usr/ports/math/reduce/work/Reduce-svn6339-src/libraries/libffi/libtool-version` -Wl,--version-script,libffi.map -Xcompiler '-fstack-protector-strong' -fstack-protector-strong -o libffi.la -rpath /wrkdirs/usr/ports/math/reduce/work/Reduce-svn6339-src/cslbuild/powerpc64le-unknown-freebsd15.0/lib src/prep_cif.lo src/types.lo src/raw_api.lo src/java_raw_api.lo src/closures.lo src/powerpc/ffi.lo src/powerpc/ffi_sysv.lo src/powerpc/ffi_linux64.lo src/powerpc/sysv.lo src/powerpc/ppc_closure.lo src/powerpc/linux64.lo src/powerpc/linux64_closure.lo
libtool: link: cc -shared -fPIC -DPIC src/.libs/prep_cif.o src/.libs/types.o src/.libs/raw_api.o src/.libs/java_raw_api.o src/.libs/closures.o src/powerpc/.libs/ffi.o src/powerpc/.libs/ffi_sysv.o src/powerpc/.libs/ffi_linux64.o src/powerpc/.libs/sysv.o src/powerpc/.libs/ppc_closure.o src/powerpc/.libs/linux64.o src/powerpc/.libs/linux64_closure.o -O3 -Wl,--version-script -Wl,libffi.map -fstack-protector-strong -fstack-protector-strong -Wl,-soname -Wl,libffi.so.7 -o .libs/libffi.so.7.1.0
ld: error: version script assignment of 'LIBFFI_BASE_7.0' to symbol 'ffi_type_longdouble' failed: symbol not defined
cc: error: linker command failed with exit code 1 (use -v to see invocation)
gmake[5]: *** [Makefile:1078: libffi.la] Error 1
gmake[5]: Leaving directory '/wrkdirs/usr/ports/math/reduce/work/Reduce-svn6339-src/cslbuild/powerpc64le-unknown-freebsd15.0/libffi'
gmake[4]: *** [Makefile:1355: install-recursive] Error 1
gmake[4]: Leaving directory '/wrkdirs/usr/ports/math/reduce/work/Reduce-svn6339-src/cslbuild/powerpc64le-unknown-freebsd15.0/libffi'
gmake[3]: *** [Makefile:6125: ../include/ffi.h] Error 2
gmake[3]: Leaving directory '/wrkdirs/usr/ports/math/reduce/work/Reduce-svn6339-src/cslbuild/powerpc64le-unknown-freebsd15.0/csl'
gmake[2]: *** [Makefile:1433: all] Error 2
gmake[2]: Leaving directory '/wrkdirs/usr/ports/math/reduce/work/Reduce-svn6339-src/cslbuild/powerpc64le-unknown-freebsd15.0/csl'
Reduce build tasks finished: Highest return code 2
gmake[1]: *** [Makefile:34: all] Error 2
gmake[1]: Leaving directory '/wrkdirs/usr/ports/math/reduce/work/Reduce-svn6339-src'
*** Error code 1
Stop.
make: stopped in /usr/ports/math/reduce