[package - 132arm64-quarterly][cad/netgen] Failed for netgen-6.2.2307 in build
- Go to: [ bottom of page ] [ top of archives ] [ this month ]
Date: Sat, 17 Feb 2024 22:23:54 UTC
You are receiving this mail as a port that you maintain
is failing to build on the FreeBSD package build server.
Please investigate the failure and submit a PR to fix
build.
Maintainer: stephen@FreeBSD.org
Log URL: https://pkg-status.freebsd.org/ampere1/data/132arm64-quarterly/b3e5282399eb/logs/netgen-6.2.2307.log
Build URL: https://pkg-status.freebsd.org/ampere1/build.html?mastername=132arm64-quarterly&build=b3e5282399eb
Log:
=>> Building cad/netgen
build started at Sat Feb 17 22:22:33 UTC 2024
port directory: /usr/ports/cad/netgen
package name: netgen-6.2.2307
building for: FreeBSD 132arm64-quarterly-job-04 13.2-RELEASE-p10 FreeBSD 13.2-RELEASE-p10 arm64
maintained by: stephen@FreeBSD.org
Makefile datestamp: -rw-r--r-- 1 root wheel 1274 Jan 16 01:02 /usr/ports/cad/netgen/Makefile
Ports top last git commit: b3e528239
Ports top unclean checkout: no
Port dir last git commit: 72cbe1a32
Port dir unclean checkout: no
Poudriere version: poudriere-git-3.4.1
Host OSVERSION: 1500006
Jail OSVERSION: 1302001
Job Id: 04
---Begin Environment---
SHELL=/bin/csh
OSVERSION=1302001
UNAME_v=FreeBSD 13.2-RELEASE-p10
UNAME_r=13.2-RELEASE-p10
BLOCKSIZE=K
MAIL=/var/mail/root
MM_CHARSET=UTF-8
LANG=C.UTF-8
STATUS=1
HOME=/root
PATH=/sbin:/bin:/usr/sbin:/usr/bin:/usr/local/sbin:/usr/local/bin:/root/bin
MAKE_OBJDIR_CHECK_WRITABLE=0
LOCALBASE=/usr/local
USER=root
POUDRIERE_NAME=poudriere-git
LIBEXECPREFIX=/usr/local/libexec/poudriere
POUDRIERE_VERSION=3.4.1
MASTERMNT=/usr/local/poudriere/data/.m/132arm64-quarterly/ref
LC_COLLATE=C
POUDRIERE_BUILD_TYPE=bulk
PACKAGE_BUILDING=yes
SAVED_TERM=
OUTPUT_REDIRECTED_STDERR=4
OUTPUT_REDIRECTED=1
PWD=/usr/local/poudriere/data/.m/132arm64-quarterly/04/.p
OUTPUT_REDIRECTED_STDOUT=3
P_PORTS_FEATURES=FLAVORS SUBPACKAGES SELECTED_OPTIONS
MASTERNAME=132arm64-quarterly
SCRIPTPREFIX=/usr/local/share/poudriere
SCRIPTNAME=bulk.sh
OLDPWD=/usr/local/poudriere/data/.m/132arm64-quarterly/ref/.p/pool
POUDRIERE_PKGNAME=poudriere-git-3.4.1
SCRIPTPATH=/usr/local/share/poudriere/bulk.sh
POUDRIEREPATH=/usr/local/bin/poudriere
---End Environment---
---Begin Poudriere Port Flags/Env---
PORT_FLAGS=
PKGENV=
FLAVOR=
MAKE_ARGS=
---End Poudriere Port Flags/Env---
---Begin OPTIONS List---
===> The following configuration options are available for netgen-6.2.2307:
CGNS=off: Enable CGNS file read/write support
JPEG=off: Enable snapshots using jpeg
MPEG=off: Enable recording with FFmpeg
===> Use 'make config' to modify these settings
---End OPTIONS List---
--MAINTAINER--
stephen@FreeBSD.org
--End MAINTAINER--
--CONFIGURE_ARGS--
--End CONFIGURE_ARGS--
--CONFIGURE_ENV--
PYTHON="/usr/local/bin/python3.9" XDG_DATA_HOME=/wrkdirs/usr/ports/cad/netgen/work XDG_CONFIG_HOME=/wrkdirs/usr/ports/cad/netgen/work XDG_CACHE_HOME=/wrkdirs/usr/ports/cad/netgen/work/.cache HOME=/wrkdirs/usr/ports/cad/netgen/work TMPDIR="/tmp" PATH=/wrkdirs/usr/ports/cad/netgen/work/.bin:/sbin:/bin:/usr/sbin:/usr/bin:/usr/local/sbin:/usr/local/bin:/root/bin PKG_CONFIG_LIBDIR=/wrkdirs/usr/ports/cad/netgen/work/.pkgconfig:/usr/local/libdata/pkgconfig:/usr/local/share/pkgconfig:/usr/libdata/pkgconfig SHELL=/bin/sh CONFIG_SHELL=/bin/sh
--End CONFIGURE_ENV--
--MAKE_ENV--
NINJA_STATUS="[%p %s/%t] " XDG_DATA_HOME=/wrkdirs/usr/ports/cad/netgen/work XDG_CONFIG_HOME=/wrkdirs/usr/ports/cad/netgen/work XDG_CACHE_HOME=/wrkdirs/usr/ports/cad/netgen/work/.cache HOME=/wrkdirs/usr/ports/cad/netgen/work TMPDIR="/tmp" PATH=/wrkdirs/usr/ports/cad/netgen/work/.bin:/sbin:/bin:/usr/sbin:/usr/bin:/usr/local/sbin:/usr/local/bin:/root/bin PKG_CONFIG_LIBDIR=/wrkdirs/usr/ports/cad/netgen/work/.pkgconfig:/usr/local/libdata/pkgconfig:/usr/local/share/pkgconfig:/usr/libdata/pkgconfig MK_DEBUG_FILES=no MK_KERNEL_SYMBOLS=no SHELL=/bin/sh NO_LINT=YES DESTDIR=/wrkdirs/usr/ports/cad/netgen/work/stage PREFIX=/usr/local LOCALBASE=/usr/local CC="cc" CFLAGS="-O2 -pipe -I/usr/local/include -I/usr/local/include/tk8.6/generic -I/usr/local/include/tk8.6/unix -fstack-protector-strong -fno-strict-aliasing " CPP="cpp" CPPFLAGS="" LDFLAGS=" -lexecinfo -fstack-protector-strong " LIBS="" CXX="c++" CXXFLAGS="-O2 -pipe -I/usr/local/include -I/usr/local/include/tk8.6/generic -I/u
sr/local/include/tk8.6/unix -fstack-protector-strong -fno-strict-aliasing -I/usr/local/include -I/usr/local/include/tk8.6/generic -I/usr/local/include/tk8.6/unix " MANPREFIX="/usr/local" BSD_INSTALL_PROGRAM="install -s -m 555" BSD_INSTALL_LIB="install -s -m 0644" BSD_INSTALL_SCRIPT="install -m 555" BSD_INSTALL_DATA="install -m 0644" BSD_INSTALL_MAN="install -m 444"
--End MAKE_ENV--
--PLIST_SUB--
CMAKE_BUILD_TYPE="release" PYTHON_INCLUDEDIR=include/python3.9 PYTHON_LIBDIR=lib/python3.9 PYTHON_PLATFORM=freebsd13 PYTHON_SITELIBDIR=lib/python3.9/site-packages PYTHON_SUFFIX=39 PYTHON_EXT_SUFFIX=.cpython-39 PYTHON_VER=3.9 PYTHON_VERSION=python3.9 PYTHON2="@comment " PYTHON3="" OSREL=13.2 PREFIX=%D LOCALBASE=/usr/local RESETPREFIX=/usr/local LIB32DIR=lib DOCSDIR="share/doc/netgen" EXAMPLESDIR="share/examples/netgen" DATADIR="share/netgen" WWWDIR="www/netgen" ETCDIR="etc/netgen"
--End PLIST_SUB--
--SUB_LIST--
PYTHON_INCLUDEDIR=/usr/local/include/python3.9 PYTHON_LIBDIR=/usr/local/lib/python3.9 PYTHON_PLATFORM=freebsd13 PYTHON_SITELIBDIR=/usr/local/lib/python3.9/site-packages PYTHON_SUFFIX=39 PYTHON_EXT_SUFFIX=.cpython-39 PYTHON_VER=3.9 PYTHON_VERSION=python3.9 PYTHON2="@comment " PYTHON3="" PREFIX=/usr/local LOCALBASE=/usr/local DATADIR=/usr/local/share/netgen DOCSDIR=/usr/local/share/doc/netgen EXAMPLESDIR=/usr/local/share/examples/netgen WWWDIR=/usr/local/www/netgen ETCDIR=/usr/local/etc/netgen
--End SUB_LIST--
---Begin make.conf---
USE_PACKAGE_DEPENDS=yes
BATCH=yes
WRKDIRPREFIX=/wrkdirs
PORTSDIR=/usr/ports
PACKAGES=/packages
DISTDIR=/distfiles
PACKAGE_BUILDING=yes
PACKAGE_BUILDING_FLAVORS=yes
#### ####
# XXX: We really need this but cannot use it while 'make checksum' does not
# try the next mirror on checksum failure. It currently retries the same
# failed mirror and then fails rather then trying another. It *does*
# try the next if the size is mismatched though.
#MASTER_SITE_FREEBSD=yes
# Build ALLOW_MAKE_JOBS_PACKAGES with 3 jobs
MAKE_JOBS_NUMBER=3
#### Misc Poudriere ####
.include "/etc/make.conf.ports_env"
GID=0
UID=0
---End make.conf---
--Resource limits--
cpu time (seconds, -t) unlimited
file size (512-blocks, -f) unlimited
data seg size (kbytes, -d) 1048576
stack size (kbytes, -s) 1048576
core file size (512-blocks, -c) unlimited
max memory size (kbytes, -m) unlimited
locked memory (kbytes, -l) unlimited
max user processes (-u) 89999
open files (-n) 8192
virtual mem size (kbytes, -v) unlimited
swap limit (kbytes, -w) unlimited
socket buffer size (bytes, -b) unlimited
pseudo-terminals (-p) unlimited
kqueues (-k) unlimited
umtx shared locks (-o) unlimited
--End resource limits--
=======================<phase: check-sanity >============================
===== env: NO_DEPENDS=yes USER=root UID=0 GID=0
===> License GPLv2 accepted by the user
===========================================================================
=======================<phase: pkg-depends >============================
===== env: USE_PACKAGE_DEPENDS_ONLY=1 USER=root UID=0 GID=0
===> netgen-6.2.2307 depends on file: /usr/local/sbin/pkg - not found
===> Installing existing package /packages/All/pkg-1.20.9.pkg
[132arm64-quarterly-job-04] Installing pkg-1.20.9...
[132arm64-quarterly-job-04] Extracting pkg-1.20.9: .......... done
===> netgen-6.2.2307 depends on file: /usr/local/sbin/pkg - found
===> Returning to build of netgen-6.2.2307
===========================================================================
=======================<phase: fetch-depends >============================
===== env: USE_PACKAGE_DEPENDS_ONLY=1 USER=root UID=0 GID=0
===========================================================================
=======================<phase: fetch >============================
===== env: NO_DEPENDS=yes USER=root UID=0 GID=0
===> License GPLv2 accepted by the user
===> Fetching all distfiles required by netgen-6.2.2307 for building
===========================================================================
=======================<phase: checksum >============================
===== env: NO_DEPENDS=yes USER=root UID=0 GID=0
===> License GPLv2 accepted by the user
===> Fetching all distfiles required by netgen-6.2.2307 for building
=> SHA256 Checksum OK for NGSolve-netgen-v6.2.2307_GH0.tar.gz.
=> SHA256 Checksum OK for NGSolve-pybind11-v2.7.1_GH0.tar.gz.
===========================================================================
=======================<phase: extract-depends>============================
===== env: USE_PACKAGE_DEPENDS_ONLY=1 USER=root UID=0 GID=0
===========================================================================
=======================<phase: extract >============================
===== env: NO_DEPENDS=yes USER=root UID=0 GID=0
===> License GPLv2 accepted by the user
===> Fetching all distfiles required by netgen-6.2.2307 for building
===> Extracting for netgen-6.2.2307
=> SHA256 Checksum OK for NGSolve-netgen-v6.2.2307_GH0.tar.gz.
=> SHA256 Checksum OK for NGSolve-pybind11-v2.7.1_GH0.tar.gz.
===========================================================================
=======================<phase: patch-depends >============================
===== env: USE_PACKAGE_DEPENDS_ONLY=1 USER=root UID=0 GID=0
===========================================================================
=======================<phase: patch >============================
===== env: NO_DEPENDS=yes USER=root UID=0 GID=0
===> Patching for netgen-6.2.2307
===> Applying FreeBSD patches for netgen-6.2.2307 from /usr/ports/cad/netgen/files
===========================================================================
=======================<phase: build-depends >============================
===== env: USE_PACKAGE_DEPENDS_ONLY=1 USER=root UID=0 GID=0
===> netgen-6.2.2307 depends on package: py39-pytest>=0 - not found
===> Installing existing package /packages/All/py39-pytest-7.4.3,1.pkg
[132arm64-quarterly-job-04] Installing py39-pytest-7.4.3,1...
[132arm64-quarterly-job-04] `-- Installing py39-exceptiongroup-1.2.0...
[132arm64-quarterly-job-04] | `-- Installing python39-3.9.18...
[132arm64-quarterly-job-04] | | `-- Installing gettext-runtime-0.22.3...
[132arm64-quarterly-job-04] | | `-- Installing indexinfo-0.3.1...
[132arm64-quarterly-job-04] | | `-- Extracting indexinfo-0.3.1: .... done
[132arm64-quarterly-job-04] | | `-- Extracting gettext-runtime-0.22.3: .......... done
[132arm64-quarterly-job-04] | | `-- Installing libffi-3.4.4...
[132arm64-quarterly-job-04] | | `-- Extracting libffi-3.4.4: .......... done
[132arm64-quarterly-job-04] | | `-- Installing mpdecimal-2.5.1...
[132arm64-quarterly-job-04] | | `-- Extracting mpdecimal-2.5.1: .......... done
[132arm64-quarterly-job-04] | | `-- Installing readline-8.2.7...
[132arm64-quarterly-job-04] | | `-- Extracting readline-8.2.7: .......... done
[132arm64-quarterly-job-04] | `-- Extracting python39-3.9.18: .......... done
[132arm64-quarterly-job-04] `-- Extracting py39-exceptiongroup-1.2.0: .......... done
[132arm64-quarterly-job-04] `-- Installing py39-iniconfig-1.1.1_1...
[132arm64-quarterly-job-04] | `-- Installing py39-setuptools-63.1.0_1...
<snip>
In file included from /wrkdirs/usr/ports/cad/netgen/work/netgen-6.2.2307/libsrc/include/mydefs.hpp:14:
In file included from /wrkdirs/usr/ports/cad/netgen/work/netgen-6.2.2307/libsrc/core/ngcore.hpp:16:
In file included from /wrkdirs/usr/ports/cad/netgen/work/netgen-6.2.2307/libsrc/core/simd.hpp:32:
/wrkdirs/usr/ports/cad/netgen/work/netgen-6.2.2307/libsrc/core/simd_arm64.hpp:162:16: error: use of undeclared identifier 'vcmlaq_f64'; did you mean 'vmlaq_f64'?
auto tmp = vcmlaq_f64(c.Data(), a.Data(), b.Data()); // are * b
^~~~~~~~~~
vmlaq_f64
/usr/lib/clang/14.0.5/include/arm_neon.h:55332:18: note: 'vmlaq_f64' declared here
__ai float64x2_t vmlaq_f64(float64x2_t __p0, float64x2_t __p1, float64x2_t __p2) {
^
In file included from /wrkdirs/usr/ports/cad/netgen/work/netgen-6.2.2307/libsrc/meshing/bisect.cpp:3:
In file included from /wrkdirs/usr/ports/cad/netgen/work/netgen-6.2.2307/libsrc/meshing/bisect.hpp:4:
In file included from /wrkdirs/usr/ports/cad/netgen/work/netgen-6.2.2307/libsrc/include/mydefs.hpp:14:
In file included from /wrkdirs/usr/ports/cad/netgen/work/netgen-6.2.2307/libsrc/core/ngcore.hpp:16:
In file included from /wrkdirs/usr/ports/cad/netgen/work/netgen-6.2.2307/libsrc/core/simd.hpp:32:
/wrkdirs/usr/ports/cad/netgen/work/netgen-6.2.2307/libsrc/core/simd_arm64.hpp:163:9: error: use of undeclared identifier 'vcmlaq_rot90_f64'
c = vcmlaq_rot90_f64(tmp, a.Data(), b.Data()); // += i*aim * b
^
2 errors generated.
[ 32% 69/196] /usr/bin/c++ -DHAVE_DLFCN_H -DNETGEN_PYTHON -DNG_PYTHON -DPYBIND11_SIMPLE_GIL_MANAGEMENT -Dnglib_EXPORTS -I/wrkdirs/usr/ports/cad/netgen/work/.build/netgen -I/wrkdirs/usr/ports/cad/netgen/work/netgen-6.2.2307 -I/wrkdirs/usr/ports/cad/netgen/work/netgen-6.2.2307/include -I/wrkdirs/usr/ports/cad/netgen/work/netgen-6.2.2307/libsrc -I/wrkdirs/usr/ports/cad/netgen/work/netgen-6.2.2307/libsrc/include -I/wrkdirs/usr/ports/cad/netgen/work/netgen-6.2.2307/external_dependencies/pybind11/include -I/usr/local/include/python3.9 -O2 -pipe -I/usr/local/include -I/usr/local/include/tk8.6/generic -I/usr/local/include/tk8.6/unix -fstack-protector-strong -fno-strict-aliasing -I/usr/local/include -I/usr/local/include/tk8.6/generic -I/usr/local/include/tk8.6/unix -O2 -pipe -I/usr/local/include -I/usr/local/include/tk8.6/generic -I/usr/local/include/tk8.6/unix -fstack-protector-strong -fno-strict-aliasing -I/usr/local/include -I/usr/local/include/tk8.6/generic -I/usr/local/include
/tk8.6/unix -DNDEBUG -std=gnu++17 -fPIC -fvisibility=hidden -MD -MT CMakeFiles/nglib.dir/libsrc/meshing/delaunay.cpp.o -MF CMakeFiles/nglib.dir/libsrc/meshing/delaunay.cpp.o.d -o CMakeFiles/nglib.dir/libsrc/meshing/delaunay.cpp.o -c /wrkdirs/usr/ports/cad/netgen/work/netgen-6.2.2307/libsrc/meshing/delaunay.cpp
FAILED: CMakeFiles/nglib.dir/libsrc/meshing/delaunay.cpp.o
/usr/bin/c++ -DHAVE_DLFCN_H -DNETGEN_PYTHON -DNG_PYTHON -DPYBIND11_SIMPLE_GIL_MANAGEMENT -Dnglib_EXPORTS -I/wrkdirs/usr/ports/cad/netgen/work/.build/netgen -I/wrkdirs/usr/ports/cad/netgen/work/netgen-6.2.2307 -I/wrkdirs/usr/ports/cad/netgen/work/netgen-6.2.2307/include -I/wrkdirs/usr/ports/cad/netgen/work/netgen-6.2.2307/libsrc -I/wrkdirs/usr/ports/cad/netgen/work/netgen-6.2.2307/libsrc/include -I/wrkdirs/usr/ports/cad/netgen/work/netgen-6.2.2307/external_dependencies/pybind11/include -I/usr/local/include/python3.9 -O2 -pipe -I/usr/local/include -I/usr/local/include/tk8.6/generic -I/usr/local/include/tk8.6/unix -fstack-protector-strong -fno-strict-aliasing -I/usr/local/include -I/usr/local/include/tk8.6/generic -I/usr/local/include/tk8.6/unix -O2 -pipe -I/usr/local/include -I/usr/local/include/tk8.6/generic -I/usr/local/include/tk8.6/unix -fstack-protector-strong -fno-strict-aliasing -I/usr/local/include -I/usr/local/include/tk8.6/generic -I/usr/local/include/tk8.6/unix -
DNDEBUG -std=gnu++17 -fPIC -fvisibility=hidden -MD -MT CMakeFiles/nglib.dir/libsrc/meshing/delaunay.cpp.o -MF CMakeFiles/nglib.dir/libsrc/meshing/delaunay.cpp.o.d -o CMakeFiles/nglib.dir/libsrc/meshing/delaunay.cpp.o -c /wrkdirs/usr/ports/cad/netgen/work/netgen-6.2.2307/libsrc/meshing/delaunay.cpp
In file included from /wrkdirs/usr/ports/cad/netgen/work/netgen-6.2.2307/libsrc/meshing/delaunay.cpp:2:
In file included from /wrkdirs/usr/ports/cad/netgen/work/netgen-6.2.2307/libsrc/meshing/meshing.hpp:6:
In file included from /wrkdirs/usr/ports/cad/netgen/work/netgen-6.2.2307/libsrc/meshing/../include/myadt.hpp:1:
In file included from /wrkdirs/usr/ports/cad/netgen/work/netgen-6.2.2307/libsrc/include/../general/myadt.hpp:16:
In file included from /wrkdirs/usr/ports/cad/netgen/work/netgen-6.2.2307/libsrc/include/../general/../include/mydefs.hpp:14:
In file included from /wrkdirs/usr/ports/cad/netgen/work/netgen-6.2.2307/libsrc/core/ngcore.hpp:16:
In file included from /wrkdirs/usr/ports/cad/netgen/work/netgen-6.2.2307/libsrc/core/simd.hpp:32:
/wrkdirs/usr/ports/cad/netgen/work/netgen-6.2.2307/libsrc/core/simd_arm64.hpp:162:16: error: use of undeclared identifier 'vcmlaq_f64'; did you mean 'vmlaq_f64'?
auto tmp = vcmlaq_f64(c.Data(), a.Data(), b.Data()); // are * b
^~~~~~~~~~
vmlaq_f64
/usr/lib/clang/14.0.5/include/arm_neon.h:55332:18: note: 'vmlaq_f64' declared here
__ai float64x2_t vmlaq_f64(float64x2_t __p0, float64x2_t __p1, float64x2_t __p2) {
^
In file included from /wrkdirs/usr/ports/cad/netgen/work/netgen-6.2.2307/libsrc/meshing/delaunay.cpp:2:
In file included from /wrkdirs/usr/ports/cad/netgen/work/netgen-6.2.2307/libsrc/meshing/meshing.hpp:6:
In file included from /wrkdirs/usr/ports/cad/netgen/work/netgen-6.2.2307/libsrc/meshing/../include/myadt.hpp:1:
In file included from /wrkdirs/usr/ports/cad/netgen/work/netgen-6.2.2307/libsrc/include/../general/myadt.hpp:16:
In file included from /wrkdirs/usr/ports/cad/netgen/work/netgen-6.2.2307/libsrc/include/../general/../include/mydefs.hpp:14:
In file included from /wrkdirs/usr/ports/cad/netgen/work/netgen-6.2.2307/libsrc/core/ngcore.hpp:16:
In file included from /wrkdirs/usr/ports/cad/netgen/work/netgen-6.2.2307/libsrc/core/simd.hpp:32:
/wrkdirs/usr/ports/cad/netgen/work/netgen-6.2.2307/libsrc/core/simd_arm64.hpp:163:9: error: use of undeclared identifier 'vcmlaq_rot90_f64'
c = vcmlaq_rot90_f64(tmp, a.Data(), b.Data()); // += i*aim * b
^
2 errors generated.
[ 32% 69/196] /usr/bin/c++ -DHAVE_DLFCN_H -DNETGEN_PYTHON -DNG_PYTHON -DPYBIND11_SIMPLE_GIL_MANAGEMENT -Dnglib_EXPORTS -I/wrkdirs/usr/ports/cad/netgen/work/.build/netgen -I/wrkdirs/usr/ports/cad/netgen/work/netgen-6.2.2307 -I/wrkdirs/usr/ports/cad/netgen/work/netgen-6.2.2307/include -I/wrkdirs/usr/ports/cad/netgen/work/netgen-6.2.2307/libsrc -I/wrkdirs/usr/ports/cad/netgen/work/netgen-6.2.2307/libsrc/include -I/wrkdirs/usr/ports/cad/netgen/work/netgen-6.2.2307/external_dependencies/pybind11/include -I/usr/local/include/python3.9 -O2 -pipe -I/usr/local/include -I/usr/local/include/tk8.6/generic -I/usr/local/include/tk8.6/unix -fstack-protector-strong -fno-strict-aliasing -I/usr/local/include -I/usr/local/include/tk8.6/generic -I/usr/local/include/tk8.6/unix -O2 -pipe -I/usr/local/include -I/usr/local/include/tk8.6/generic -I/usr/local/include/tk8.6/unix -fstack-protector-strong -fno-strict-aliasing -I/usr/local/include -I/usr/local/include/tk8.6/generic -I/usr/local/include
/tk8.6/unix -DNDEBUG -std=gnu++17 -fPIC -fvisibility=hidden -MD -MT CMakeFiles/nglib.dir/libsrc/meshing/boundarylayer.cpp.o -MF CMakeFiles/nglib.dir/libsrc/meshing/boundarylayer.cpp.o.d -o CMakeFiles/nglib.dir/libsrc/meshing/boundarylayer.cpp.o -c /wrkdirs/usr/ports/cad/netgen/work/netgen-6.2.2307/libsrc/meshing/boundarylayer.cpp
FAILED: CMakeFiles/nglib.dir/libsrc/meshing/boundarylayer.cpp.o
/usr/bin/c++ -DHAVE_DLFCN_H -DNETGEN_PYTHON -DNG_PYTHON -DPYBIND11_SIMPLE_GIL_MANAGEMENT -Dnglib_EXPORTS -I/wrkdirs/usr/ports/cad/netgen/work/.build/netgen -I/wrkdirs/usr/ports/cad/netgen/work/netgen-6.2.2307 -I/wrkdirs/usr/ports/cad/netgen/work/netgen-6.2.2307/include -I/wrkdirs/usr/ports/cad/netgen/work/netgen-6.2.2307/libsrc -I/wrkdirs/usr/ports/cad/netgen/work/netgen-6.2.2307/libsrc/include -I/wrkdirs/usr/ports/cad/netgen/work/netgen-6.2.2307/external_dependencies/pybind11/include -I/usr/local/include/python3.9 -O2 -pipe -I/usr/local/include -I/usr/local/include/tk8.6/generic -I/usr/local/include/tk8.6/unix -fstack-protector-strong -fno-strict-aliasing -I/usr/local/include -I/usr/local/include/tk8.6/generic -I/usr/local/include/tk8.6/unix -O2 -pipe -I/usr/local/include -I/usr/local/include/tk8.6/generic -I/usr/local/include/tk8.6/unix -fstack-protector-strong -fno-strict-aliasing -I/usr/local/include -I/usr/local/include/tk8.6/generic -I/usr/local/include/tk8.6/unix -
DNDEBUG -std=gnu++17 -fPIC -fvisibility=hidden -MD -MT CMakeFiles/nglib.dir/libsrc/meshing/boundarylayer.cpp.o -MF CMakeFiles/nglib.dir/libsrc/meshing/boundarylayer.cpp.o.d -o CMakeFiles/nglib.dir/libsrc/meshing/boundarylayer.cpp.o -c /wrkdirs/usr/ports/cad/netgen/work/netgen-6.2.2307/libsrc/meshing/boundarylayer.cpp
In file included from /wrkdirs/usr/ports/cad/netgen/work/netgen-6.2.2307/libsrc/meshing/boundarylayer.cpp:6:
In file included from /wrkdirs/usr/ports/cad/netgen/work/netgen-6.2.2307/libsrc/meshing/global.hpp:15:
In file included from /wrkdirs/usr/ports/cad/netgen/work/netgen-6.2.2307/libsrc/include/mydefs.hpp:14:
In file included from /wrkdirs/usr/ports/cad/netgen/work/netgen-6.2.2307/libsrc/core/ngcore.hpp:16:
In file included from /wrkdirs/usr/ports/cad/netgen/work/netgen-6.2.2307/libsrc/core/simd.hpp:32:
/wrkdirs/usr/ports/cad/netgen/work/netgen-6.2.2307/libsrc/core/simd_arm64.hpp:162:16: error: use of undeclared identifier 'vcmlaq_f64'; did you mean 'vmlaq_f64'?
auto tmp = vcmlaq_f64(c.Data(), a.Data(), b.Data()); // are * b
^~~~~~~~~~
vmlaq_f64
/usr/lib/clang/14.0.5/include/arm_neon.h:55332:18: note: 'vmlaq_f64' declared here
__ai float64x2_t vmlaq_f64(float64x2_t __p0, float64x2_t __p1, float64x2_t __p2) {
^
In file included from /wrkdirs/usr/ports/cad/netgen/work/netgen-6.2.2307/libsrc/meshing/boundarylayer.cpp:6:
In file included from /wrkdirs/usr/ports/cad/netgen/work/netgen-6.2.2307/libsrc/meshing/global.hpp:15:
In file included from /wrkdirs/usr/ports/cad/netgen/work/netgen-6.2.2307/libsrc/include/mydefs.hpp:14:
In file included from /wrkdirs/usr/ports/cad/netgen/work/netgen-6.2.2307/libsrc/core/ngcore.hpp:16:
In file included from /wrkdirs/usr/ports/cad/netgen/work/netgen-6.2.2307/libsrc/core/simd.hpp:32:
/wrkdirs/usr/ports/cad/netgen/work/netgen-6.2.2307/libsrc/core/simd_arm64.hpp:163:9: error: use of undeclared identifier 'vcmlaq_rot90_f64'
c = vcmlaq_rot90_f64(tmp, a.Data(), b.Data()); // += i*aim * b
^
2 errors generated.
[ 33% 69/196] /usr/bin/c++ -DHAVE_DLFCN_H -DNETGEN_PYTHON -DNG_PYTHON -DPYBIND11_SIMPLE_GIL_MANAGEMENT -Dnglib_EXPORTS -I/wrkdirs/usr/ports/cad/netgen/work/.build/netgen -I/wrkdirs/usr/ports/cad/netgen/work/netgen-6.2.2307 -I/wrkdirs/usr/ports/cad/netgen/work/netgen-6.2.2307/include -I/wrkdirs/usr/ports/cad/netgen/work/netgen-6.2.2307/libsrc -I/wrkdirs/usr/ports/cad/netgen/work/netgen-6.2.2307/libsrc/include -I/wrkdirs/usr/ports/cad/netgen/work/netgen-6.2.2307/external_dependencies/pybind11/include -I/usr/local/include/python3.9 -O2 -pipe -I/usr/local/include -I/usr/local/include/tk8.6/generic -I/usr/local/include/tk8.6/unix -fstack-protector-strong -fno-strict-aliasing -I/usr/local/include -I/usr/local/include/tk8.6/generic -I/usr/local/include/tk8.6/unix -O2 -pipe -I/usr/local/include -I/usr/local/include/tk8.6/generic -I/usr/local/include/tk8.6/unix -fstack-protector-strong -fno-strict-aliasing -I/usr/local/include -I/usr/local/include/tk8.6/generic -I/usr/local/include
/tk8.6/unix -DNDEBUG -std=gnu++17 -fPIC -fvisibility=hidden -MD -MT CMakeFiles/nglib.dir/libsrc/meshing/delaunay2d.cpp.o -MF CMakeFiles/nglib.dir/libsrc/meshing/delaunay2d.cpp.o.d -o CMakeFiles/nglib.dir/libsrc/meshing/delaunay2d.cpp.o -c /wrkdirs/usr/ports/cad/netgen/work/netgen-6.2.2307/libsrc/meshing/delaunay2d.cpp
FAILED: CMakeFiles/nglib.dir/libsrc/meshing/delaunay2d.cpp.o
/usr/bin/c++ -DHAVE_DLFCN_H -DNETGEN_PYTHON -DNG_PYTHON -DPYBIND11_SIMPLE_GIL_MANAGEMENT -Dnglib_EXPORTS -I/wrkdirs/usr/ports/cad/netgen/work/.build/netgen -I/wrkdirs/usr/ports/cad/netgen/work/netgen-6.2.2307 -I/wrkdirs/usr/ports/cad/netgen/work/netgen-6.2.2307/include -I/wrkdirs/usr/ports/cad/netgen/work/netgen-6.2.2307/libsrc -I/wrkdirs/usr/ports/cad/netgen/work/netgen-6.2.2307/libsrc/include -I/wrkdirs/usr/ports/cad/netgen/work/netgen-6.2.2307/external_dependencies/pybind11/include -I/usr/local/include/python3.9 -O2 -pipe -I/usr/local/include -I/usr/local/include/tk8.6/generic -I/usr/local/include/tk8.6/unix -fstack-protector-strong -fno-strict-aliasing -I/usr/local/include -I/usr/local/include/tk8.6/generic -I/usr/local/include/tk8.6/unix -O2 -pipe -I/usr/local/include -I/usr/local/include/tk8.6/generic -I/usr/local/include/tk8.6/unix -fstack-protector-strong -fno-strict-aliasing -I/usr/local/include -I/usr/local/include/tk8.6/generic -I/usr/local/include/tk8.6/unix -
DNDEBUG -std=gnu++17 -fPIC -fvisibility=hidden -MD -MT CMakeFiles/nglib.dir/libsrc/meshing/delaunay2d.cpp.o -MF CMakeFiles/nglib.dir/libsrc/meshing/delaunay2d.cpp.o.d -o CMakeFiles/nglib.dir/libsrc/meshing/delaunay2d.cpp.o -c /wrkdirs/usr/ports/cad/netgen/work/netgen-6.2.2307/libsrc/meshing/delaunay2d.cpp
In file included from /wrkdirs/usr/ports/cad/netgen/work/netgen-6.2.2307/libsrc/meshing/delaunay2d.cpp:2:
In file included from /wrkdirs/usr/ports/cad/netgen/work/netgen-6.2.2307/libsrc/meshing/delaunay2d.hpp:1:
In file included from /wrkdirs/usr/ports/cad/netgen/work/netgen-6.2.2307/libsrc/meshing/meshing.hpp:6:
In file included from /wrkdirs/usr/ports/cad/netgen/work/netgen-6.2.2307/libsrc/meshing/../include/myadt.hpp:1:
In file included from /wrkdirs/usr/ports/cad/netgen/work/netgen-6.2.2307/libsrc/include/../general/myadt.hpp:16:
In file included from /wrkdirs/usr/ports/cad/netgen/work/netgen-6.2.2307/libsrc/include/../general/../include/mydefs.hpp:14:
In file included from /wrkdirs/usr/ports/cad/netgen/work/netgen-6.2.2307/libsrc/core/ngcore.hpp:16:
In file included from /wrkdirs/usr/ports/cad/netgen/work/netgen-6.2.2307/libsrc/core/simd.hpp:32:
/wrkdirs/usr/ports/cad/netgen/work/netgen-6.2.2307/libsrc/core/simd_arm64.hpp:162:16: error: use of undeclared identifier 'vcmlaq_f64'; did you mean 'vmlaq_f64'?
auto tmp = vcmlaq_f64(c.Data(), a.Data(), b.Data()); // are * b
^~~~~~~~~~
vmlaq_f64
/usr/lib/clang/14.0.5/include/arm_neon.h:55332:18: note: 'vmlaq_f64' declared here
__ai float64x2_t vmlaq_f64(float64x2_t __p0, float64x2_t __p1, float64x2_t __p2) {
^
In file included from /wrkdirs/usr/ports/cad/netgen/work/netgen-6.2.2307/libsrc/meshing/delaunay2d.cpp:2:
In file included from /wrkdirs/usr/ports/cad/netgen/work/netgen-6.2.2307/libsrc/meshing/delaunay2d.hpp:1:
In file included from /wrkdirs/usr/ports/cad/netgen/work/netgen-6.2.2307/libsrc/meshing/meshing.hpp:6:
In file included from /wrkdirs/usr/ports/cad/netgen/work/netgen-6.2.2307/libsrc/meshing/../include/myadt.hpp:1:
In file included from /wrkdirs/usr/ports/cad/netgen/work/netgen-6.2.2307/libsrc/include/../general/myadt.hpp:16:
In file included from /wrkdirs/usr/ports/cad/netgen/work/netgen-6.2.2307/libsrc/include/../general/../include/mydefs.hpp:14:
In file included from /wrkdirs/usr/ports/cad/netgen/work/netgen-6.2.2307/libsrc/core/ngcore.hpp:16:
In file included from /wrkdirs/usr/ports/cad/netgen/work/netgen-6.2.2307/libsrc/core/simd.hpp:32:
/wrkdirs/usr/ports/cad/netgen/work/netgen-6.2.2307/libsrc/core/simd_arm64.hpp:163:9: error: use of undeclared identifier 'vcmlaq_rot90_f64'
c = vcmlaq_rot90_f64(tmp, a.Data(), b.Data()); // += i*aim * b
^
2 errors generated.
[ 33% 69/196] /usr/bin/c++ -DHAVE_DLFCN_H -DNETGEN_PYTHON -DNG_PYTHON -DPYBIND11_SIMPLE_GIL_MANAGEMENT -Dnglib_EXPORTS -I/wrkdirs/usr/ports/cad/netgen/work/.build/netgen -I/wrkdirs/usr/ports/cad/netgen/work/netgen-6.2.2307 -I/wrkdirs/usr/ports/cad/netgen/work/netgen-6.2.2307/include -I/wrkdirs/usr/ports/cad/netgen/work/netgen-6.2.2307/libsrc -I/wrkdirs/usr/ports/cad/netgen/work/netgen-6.2.2307/libsrc/include -I/wrkdirs/usr/ports/cad/netgen/work/netgen-6.2.2307/external_dependencies/pybind11/include -I/usr/local/include/python3.9 -O2 -pipe -I/usr/local/include -I/usr/local/include/tk8.6/generic -I/usr/local/include/tk8.6/unix -fstack-protector-strong -fno-strict-aliasing -I/usr/local/include -I/usr/local/include/tk8.6/generic -I/usr/local/include/tk8.6/unix -O2 -pipe -I/usr/local/include -I/usr/local/include/tk8.6/generic -I/usr/local/include/tk8.6/unix -fstack-protector-strong -fno-strict-aliasing -I/usr/local/include -I/usr/local/include/tk8.6/generic -I/usr/local/include
/tk8.6/unix -DNDEBUG -std=gnu++17 -fPIC -fvisibility=hidden -MD -MT CMakeFiles/nglib.dir/libsrc/gprim/splinegeometry.cpp.o -MF CMakeFiles/nglib.dir/libsrc/gprim/splinegeometry.cpp.o.d -o CMakeFiles/nglib.dir/libsrc/gprim/splinegeometry.cpp.o -c /wrkdirs/usr/ports/cad/netgen/work/netgen-6.2.2307/libsrc/gprim/splinegeometry.cpp
FAILED: CMakeFiles/nglib.dir/libsrc/gprim/splinegeometry.cpp.o
/usr/bin/c++ -DHAVE_DLFCN_H -DNETGEN_PYTHON -DNG_PYTHON -DPYBIND11_SIMPLE_GIL_MANAGEMENT -Dnglib_EXPORTS -I/wrkdirs/usr/ports/cad/netgen/work/.build/netgen -I/wrkdirs/usr/ports/cad/netgen/work/netgen-6.2.2307 -I/wrkdirs/usr/ports/cad/netgen/work/netgen-6.2.2307/include -I/wrkdirs/usr/ports/cad/netgen/work/netgen-6.2.2307/libsrc -I/wrkdirs/usr/ports/cad/netgen/work/netgen-6.2.2307/libsrc/include -I/wrkdirs/usr/ports/cad/netgen/work/netgen-6.2.2307/external_dependencies/pybind11/include -I/usr/local/include/python3.9 -O2 -pipe -I/usr/local/include -I/usr/local/include/tk8.6/generic -I/usr/local/include/tk8.6/unix -fstack-protector-strong -fno-strict-aliasing -I/usr/local/include -I/usr/local/include/tk8.6/generic -I/usr/local/include/tk8.6/unix -O2 -pipe -I/usr/local/include -I/usr/local/include/tk8.6/generic -I/usr/local/include/tk8.6/unix -fstack-protector-strong -fno-strict-aliasing -I/usr/local/include -I/usr/local/include/tk8.6/generic -I/usr/local/include/tk8.6/unix -
DNDEBUG -std=gnu++17 -fPIC -fvisibility=hidden -MD -MT CMakeFiles/nglib.dir/libsrc/gprim/splinegeometry.cpp.o -MF CMakeFiles/nglib.dir/libsrc/gprim/splinegeometry.cpp.o.d -o CMakeFiles/nglib.dir/libsrc/gprim/splinegeometry.cpp.o -c /wrkdirs/usr/ports/cad/netgen/work/netgen-6.2.2307/libsrc/gprim/splinegeometry.cpp
In file included from /wrkdirs/usr/ports/cad/netgen/work/netgen-6.2.2307/libsrc/gprim/splinegeometry.cpp:9:
In file included from /wrkdirs/usr/ports/cad/netgen/work/netgen-6.2.2307/libsrc/include/linalg.hpp:1:
In file included from /wrkdirs/usr/ports/cad/netgen/work/netgen-6.2.2307/libsrc/include/../linalg/linalg.hpp:23:
In file included from /wrkdirs/usr/ports/cad/netgen/work/netgen-6.2.2307/libsrc/include/../linalg/../include/myadt.hpp:1:
In file included from /wrkdirs/usr/ports/cad/netgen/work/netgen-6.2.2307/libsrc/include/../general/myadt.hpp:16:
In file included from /wrkdirs/usr/ports/cad/netgen/work/netgen-6.2.2307/libsrc/include/../general/../include/mydefs.hpp:14:
In file included from /wrkdirs/usr/ports/cad/netgen/work/netgen-6.2.2307/libsrc/core/ngcore.hpp:16:
In file included from /wrkdirs/usr/ports/cad/netgen/work/netgen-6.2.2307/libsrc/core/simd.hpp:32:
/wrkdirs/usr/ports/cad/netgen/work/netgen-6.2.2307/libsrc/core/simd_arm64.hpp:162:16: error: use of undeclared identifier 'vcmlaq_f64'; did you mean 'vmlaq_f64'?
auto tmp = vcmlaq_f64(c.Data(), a.Data(), b.Data()); // are * b
^~~~~~~~~~
vmlaq_f64
/usr/lib/clang/14.0.5/include/arm_neon.h:55332:18: note: 'vmlaq_f64' declared here
__ai float64x2_t vmlaq_f64(float64x2_t __p0, float64x2_t __p1, float64x2_t __p2) {
^
In file included from /wrkdirs/usr/ports/cad/netgen/work/netgen-6.2.2307/libsrc/gprim/splinegeometry.cpp:9:
In file included from /wrkdirs/usr/ports/cad/netgen/work/netgen-6.2.2307/libsrc/include/linalg.hpp:1:
In file included from /wrkdirs/usr/ports/cad/netgen/work/netgen-6.2.2307/libsrc/include/../linalg/linalg.hpp:23:
In file included from /wrkdirs/usr/ports/cad/netgen/work/netgen-6.2.2307/libsrc/include/../linalg/../include/myadt.hpp:1:
In file included from /wrkdirs/usr/ports/cad/netgen/work/netgen-6.2.2307/libsrc/include/../general/myadt.hpp:16:
In file included from /wrkdirs/usr/ports/cad/netgen/work/netgen-6.2.2307/libsrc/include/../general/../include/mydefs.hpp:14:
In file included from /wrkdirs/usr/ports/cad/netgen/work/netgen-6.2.2307/libsrc/core/ngcore.hpp:16:
In file included from /wrkdirs/usr/ports/cad/netgen/work/netgen-6.2.2307/libsrc/core/simd.hpp:32:
/wrkdirs/usr/ports/cad/netgen/work/netgen-6.2.2307/libsrc/core/simd_arm64.hpp:163:9: error: use of undeclared identifier 'vcmlaq_rot90_f64'
c = vcmlaq_rot90_f64(tmp, a.Data(), b.Data()); // += i*aim * b
^
2 errors generated.
[ 34% 69/196] /usr/bin/c++ -DHAVE_DLFCN_H -DNETGEN_PYTHON -DNG_PYTHON -DPYBIND11_SIMPLE_GIL_MANAGEMENT -Dnglib_EXPORTS -I/wrkdirs/usr/ports/cad/netgen/work/.build/netgen -I/wrkdirs/usr/ports/cad/netgen/work/netgen-6.2.2307 -I/wrkdirs/usr/ports/cad/netgen/work/netgen-6.2.2307/include -I/wrkdirs/usr/ports/cad/netgen/work/netgen-6.2.2307/libsrc -I/wrkdirs/usr/ports/cad/netgen/work/netgen-6.2.2307/libsrc/include -I/wrkdirs/usr/ports/cad/netgen/work/netgen-6.2.2307/external_dependencies/pybind11/include -I/usr/local/include/python3.9 -O2 -pipe -I/usr/local/include -I/usr/local/include/tk8.6/generic -I/usr/local/include/tk8.6/unix -fstack-protector-strong -fno-strict-aliasing -I/usr/local/include -I/usr/local/include/tk8.6/generic -I/usr/local/include/tk8.6/unix -O2 -pipe -I/usr/local/include -I/usr/local/include/tk8.6/generic -I/usr/local/include/tk8.6/unix -fstack-protector-strong -fno-strict-aliasing -I/usr/local/include -I/usr/local/include/tk8.6/generic -I/usr/local/include
/tk8.6/unix -DNDEBUG -std=gnu++17 -fPIC -fvisibility=hidden -MD -MT CMakeFiles/nglib.dir/libsrc/gprim/spline.cpp.o -MF CMakeFiles/nglib.dir/libsrc/gprim/spline.cpp.o.d -o CMakeFiles/nglib.dir/libsrc/gprim/spline.cpp.o -c /wrkdirs/usr/ports/cad/netgen/work/netgen-6.2.2307/libsrc/gprim/spline.cpp
FAILED: CMakeFiles/nglib.dir/libsrc/gprim/spline.cpp.o
/usr/bin/c++ -DHAVE_DLFCN_H -DNETGEN_PYTHON -DNG_PYTHON -DPYBIND11_SIMPLE_GIL_MANAGEMENT -Dnglib_EXPORTS -I/wrkdirs/usr/ports/cad/netgen/work/.build/netgen -I/wrkdirs/usr/ports/cad/netgen/work/netgen-6.2.2307 -I/wrkdirs/usr/ports/cad/netgen/work/netgen-6.2.2307/include -I/wrkdirs/usr/ports/cad/netgen/work/netgen-6.2.2307/libsrc -I/wrkdirs/usr/ports/cad/netgen/work/netgen-6.2.2307/libsrc/include -I/wrkdirs/usr/ports/cad/netgen/work/netgen-6.2.2307/external_dependencies/pybind11/include -I/usr/local/include/python3.9 -O2 -pipe -I/usr/local/include -I/usr/local/include/tk8.6/generic -I/usr/local/include/tk8.6/unix -fstack-protector-strong -fno-strict-aliasing -I/usr/local/include -I/usr/local/include/tk8.6/generic -I/usr/local/include/tk8.6/unix -O2 -pipe -I/usr/local/include -I/usr/local/include/tk8.6/generic -I/usr/local/include/tk8.6/unix -fstack-protector-strong -fno-strict-aliasing -I/usr/local/include -I/usr/local/include/tk8.6/generic -I/usr/local/include/tk8.6/unix -
DNDEBUG -std=gnu++17 -fPIC -fvisibility=hidden -MD -MT CMakeFiles/nglib.dir/libsrc/gprim/spline.cpp.o -MF CMakeFiles/nglib.dir/libsrc/gprim/spline.cpp.o.d -o CMakeFiles/nglib.dir/libsrc/gprim/spline.cpp.o -c /wrkdirs/usr/ports/cad/netgen/work/netgen-6.2.2307/libsrc/gprim/spline.cpp
In file included from /wrkdirs/usr/ports/cad/netgen/work/netgen-6.2.2307/libsrc/gprim/spline.cpp:8:
In file included from /wrkdirs/usr/ports/cad/netgen/work/netgen-6.2.2307/libsrc/include/linalg.hpp:1:
In file included from /wrkdirs/usr/ports/cad/netgen/work/netgen-6.2.2307/libsrc/include/../linalg/linalg.hpp:23:
In file included from /wrkdirs/usr/ports/cad/netgen/work/netgen-6.2.2307/libsrc/include/../linalg/../include/myadt.hpp:1:
In file included from /wrkdirs/usr/ports/cad/netgen/work/netgen-6.2.2307/libsrc/include/../general/myadt.hpp:16:
In file included from /wrkdirs/usr/ports/cad/netgen/work/netgen-6.2.2307/libsrc/include/../general/../include/mydefs.hpp:14:
In file included from /wrkdirs/usr/ports/cad/netgen/work/netgen-6.2.2307/libsrc/core/ngcore.hpp:16:
In file included from /wrkdirs/usr/ports/cad/netgen/work/netgen-6.2.2307/libsrc/core/simd.hpp:32:
/wrkdirs/usr/ports/cad/netgen/work/netgen-6.2.2307/libsrc/core/simd_arm64.hpp:162:16: error: use of undeclared identifier 'vcmlaq_f64'; did you mean 'vmlaq_f64'?
auto tmp = vcmlaq_f64(c.Data(), a.Data(), b.Data()); // are * b
^~~~~~~~~~
vmlaq_f64
/usr/lib/clang/14.0.5/include/arm_neon.h:55332:18: note: 'vmlaq_f64' declared here
__ai float64x2_t vmlaq_f64(float64x2_t __p0, float64x2_t __p1, float64x2_t __p2) {
^
In file included from /wrkdirs/usr/ports/cad/netgen/work/netgen-6.2.2307/libsrc/gprim/spline.cpp:8:
In file included from /wrkdirs/usr/ports/cad/netgen/work/netgen-6.2.2307/libsrc/include/linalg.hpp:1:
In file included from /wrkdirs/usr/ports/cad/netgen/work/netgen-6.2.2307/libsrc/include/../linalg/linalg.hpp:23:
In file included from /wrkdirs/usr/ports/cad/netgen/work/netgen-6.2.2307/libsrc/include/../linalg/../include/myadt.hpp:1:
In file included from /wrkdirs/usr/ports/cad/netgen/work/netgen-6.2.2307/libsrc/include/../general/myadt.hpp:16:
In file included from /wrkdirs/usr/ports/cad/netgen/work/netgen-6.2.2307/libsrc/include/../general/../include/mydefs.hpp:14:
In file included from /wrkdirs/usr/ports/cad/netgen/work/netgen-6.2.2307/libsrc/core/ngcore.hpp:16:
In file included from /wrkdirs/usr/ports/cad/netgen/work/netgen-6.2.2307/libsrc/core/simd.hpp:32:
/wrkdirs/usr/ports/cad/netgen/work/netgen-6.2.2307/libsrc/core/simd_arm64.hpp:163:9: error: use of undeclared identifier 'vcmlaq_rot90_f64'
c = vcmlaq_rot90_f64(tmp, a.Data(), b.Data()); // += i*aim * b
^
2 errors generated.
[ 34% 69/196] /usr/bin/c++ -DHAVE_DLFCN_H -DNETGEN_PYTHON -DNG_PYTHON -DPYBIND11_SIMPLE_GIL_MANAGEMENT -Dnglib_EXPORTS -I/wrkdirs/usr/ports/cad/netgen/work/.build/netgen -I/wrkdirs/usr/ports/cad/netgen/work/netgen-6.2.2307 -I/wrkdirs/usr/ports/cad/netgen/work/netgen-6.2.2307/include -I/wrkdirs/usr/ports/cad/netgen/work/netgen-6.2.2307/libsrc -I/wrkdirs/usr/ports/cad/netgen/work/netgen-6.2.2307/libsrc/include -I/wrkdirs/usr/ports/cad/netgen/work/netgen-6.2.2307/external_dependencies/pybind11/include -I/usr/local/include/python3.9 -O2 -pipe -I/usr/local/include -I/usr/local/include/tk8.6/generic -I/usr/local/include/tk8.6/unix -fstack-protector-strong -fno-strict-aliasing -I/usr/local/include -I/usr/local/include/tk8.6/generic -I/usr/local/include/tk8.6/unix -O2 -pipe -I/usr/local/include -I/usr/local/include/tk8.6/generic -I/usr/local/include/tk8.6/unix -fstack-protector-strong -fno-strict-aliasing -I/usr/local/include -I/usr/local/include/tk8.6/generic -I/usr/local/include
/tk8.6/unix -DNDEBUG -std=gnu++17 -fPIC -fvisibility=hidden -MD -MT CMakeFiles/nglib.dir/libsrc/meshing/curvedelems.cpp.o -MF CMakeFiles/nglib.dir/libsrc/meshing/curvedelems.cpp.o.d -o CMakeFiles/nglib.dir/libsrc/meshing/curvedelems.cpp.o -c /wrkdirs/usr/ports/cad/netgen/work/netgen-6.2.2307/libsrc/meshing/curvedelems.cpp
FAILED: CMakeFiles/nglib.dir/libsrc/meshing/curvedelems.cpp.o
/usr/bin/c++ -DHAVE_DLFCN_H -DNETGEN_PYTHON -DNG_PYTHON -DPYBIND11_SIMPLE_GIL_MANAGEMENT -Dnglib_EXPORTS -I/wrkdirs/usr/ports/cad/netgen/work/.build/netgen -I/wrkdirs/usr/ports/cad/netgen/work/netgen-6.2.2307 -I/wrkdirs/usr/ports/cad/netgen/work/netgen-6.2.2307/include -I/wrkdirs/usr/ports/cad/netgen/work/netgen-6.2.2307/libsrc -I/wrkdirs/usr/ports/cad/netgen/work/netgen-6.2.2307/libsrc/include -I/wrkdirs/usr/ports/cad/netgen/work/netgen-6.2.2307/external_dependencies/pybind11/include -I/usr/local/include/python3.9 -O2 -pipe -I/usr/local/include -I/usr/local/include/tk8.6/generic -I/usr/local/include/tk8.6/unix -fstack-protector-strong -fno-strict-aliasing -I/usr/local/include -I/usr/local/include/tk8.6/generic -I/usr/local/include/tk8.6/unix -O2 -pipe -I/usr/local/include -I/usr/local/include/tk8.6/generic -I/usr/local/include/tk8.6/unix -fstack-protector-strong -fno-strict-aliasing -I/usr/local/include -I/usr/local/include/tk8.6/generic -I/usr/local/include/tk8.6/unix -
DNDEBUG -std=gnu++17 -fPIC -fvisibility=hidden -MD -MT CMakeFiles/nglib.dir/libsrc/meshing/curvedelems.cpp.o -MF CMakeFiles/nglib.dir/libsrc/meshing/curvedelems.cpp.o.d -o CMakeFiles/nglib.dir/libsrc/meshing/curvedelems.cpp.o -c /wrkdirs/usr/ports/cad/netgen/work/netgen-6.2.2307/libsrc/meshing/curvedelems.cpp
In file included from /wrkdirs/usr/ports/cad/netgen/work/netgen-6.2.2307/libsrc/meshing/curvedelems.cpp:3:
In file included from /wrkdirs/usr/ports/cad/netgen/work/netgen-6.2.2307/libsrc/meshing/meshing.hpp:6:
In file included from /wrkdirs/usr/ports/cad/netgen/work/netgen-6.2.2307/libsrc/meshing/../include/myadt.hpp:1:
In file included from /wrkdirs/usr/ports/cad/netgen/work/netgen-6.2.2307/libsrc/include/../general/myadt.hpp:16:
In file included from /wrkdirs/usr/ports/cad/netgen/work/netgen-6.2.2307/libsrc/include/../general/../include/mydefs.hpp:14:
In file included from /wrkdirs/usr/ports/cad/netgen/work/netgen-6.2.2307/libsrc/core/ngcore.hpp:16:
In file included from /wrkdirs/usr/ports/cad/netgen/work/netgen-6.2.2307/libsrc/core/simd.hpp:32:
/wrkdirs/usr/ports/cad/netgen/work/netgen-6.2.2307/libsrc/core/simd_arm64.hpp:162:16: error: use of undeclared identifier 'vcmlaq_f64'; did you mean 'vmlaq_f64'?
auto tmp = vcmlaq_f64(c.Data(), a.Data(), b.Data()); // are * b
^~~~~~~~~~
vmlaq_f64
/usr/lib/clang/14.0.5/include/arm_neon.h:55332:18: note: 'vmlaq_f64' declared here
__ai float64x2_t vmlaq_f64(float64x2_t __p0, float64x2_t __p1, float64x2_t __p2) {
^
In file included from /wrkdirs/usr/ports/cad/netgen/work/netgen-6.2.2307/libsrc/meshing/curvedelems.cpp:3:
In file included from /wrkdirs/usr/ports/cad/netgen/work/netgen-6.2.2307/libsrc/meshing/meshing.hpp:6:
In file included from /wrkdirs/usr/ports/cad/netgen/work/netgen-6.2.2307/libsrc/meshing/../include/myadt.hpp:1:
In file included from /wrkdirs/usr/ports/cad/netgen/work/netgen-6.2.2307/libsrc/include/../general/myadt.hpp:16:
In file included from /wrkdirs/usr/ports/cad/netgen/work/netgen-6.2.2307/libsrc/include/../general/../include/mydefs.hpp:14:
In file included from /wrkdirs/usr/ports/cad/netgen/work/netgen-6.2.2307/libsrc/core/ngcore.hpp:16:
In file included from /wrkdirs/usr/ports/cad/netgen/work/netgen-6.2.2307/libsrc/core/simd.hpp:32:
/wrkdirs/usr/ports/cad/netgen/work/netgen-6.2.2307/libsrc/core/simd_arm64.hpp:163:9: error: use of undeclared identifier 'vcmlaq_rot90_f64'
c = vcmlaq_rot90_f64(tmp, a.Data(), b.Data()); // += i*aim * b
^
2 errors generated.
[ 35% 69/196] /usr/bin/c++ -DHAVE_DLFCN_H -DNETGEN_PYTHON -DNG_PYTHON -DPYBIND11_SIMPLE_GIL_MANAGEMENT -Dpyngcore_EXPORTS -I/wrkdirs/usr/ports/cad/netgen/work/.build/netgen/libsrc/core -I/wrkdirs/usr/ports/cad/netgen/work/netgen-6.2.2307/libsrc/core -I/wrkdirs/usr/ports/cad/netgen/work/.build/netgen -I/wrkdirs/usr/ports/cad/netgen/work/netgen-6.2.2307/include -I/wrkdirs/usr/ports/cad/netgen/work/netgen-6.2.2307/libsrc -I/wrkdirs/usr/ports/cad/netgen/work/netgen-6.2.2307/libsrc/include -isystem /usr/local/include/python3.9 -isystem /wrkdirs/usr/ports/cad/netgen/work/netgen-6.2.2307/external_dependencies/pybind11/include -O2 -pipe -I/usr/local/include -I/usr/local/include/tk8.6/generic -I/usr/local/include/tk8.6/unix -fstack-protector-strong -fno-strict-aliasing -I/usr/local/include -I/usr/local/include/tk8.6/generic -I/usr/local/include/tk8.6/unix -O2 -pipe -I/usr/local/include -I/usr/local/include/tk8.6/generic -I/usr/local/include/tk8.6/unix -fstack-protector-strong -fno-s
trict-aliasing -I/usr/local/include -I/usr/local/include/tk8.6/generic -I/usr/local/include/tk8.6/unix -DNDEBUG -std=gnu++17 -fPIC -fvisibility=hidden -flto -MD -MT libsrc/core/CMakeFiles/pyngcore.dir/python_ngcore_export.cpp.o -MF libsrc/core/CMakeFiles/pyngcore.dir/python_ngcore_export.cpp.o.d -o libsrc/core/CMakeFiles/pyngcore.dir/python_ngcore_export.cpp.o -c /wrkdirs/usr/ports/cad/netgen/work/netgen-6.2.2307/libsrc/core/python_ngcore_export.cpp
ninja: build stopped: subcommand failed.
ninja: build stopped: subcommand failed.
===> Compilation failed unexpectedly.
Try to set MAKE_JOBS_UNSAFE=yes and rebuild before reporting the failure to
the maintainer.
*** Error code 1
Stop.
make: stopped in /usr/ports/cad/netgen