[package - 132powerpc64-quarterly][www/librewolf] Failed for librewolf-117.0.1.1_3 in build
- Go to: [ bottom of page ] [ top of archives ] [ this month ]
Date: Fri, 09 Feb 2024 06:56:18 UTC
You are receiving this mail as a port that you maintain
is failing to build on the FreeBSD package build server.
Please investigate the failure and submit a PR to fix
build.
Maintainer: freebsd@sysctl.cz
Log URL: https://pkg-status.freebsd.org/foul1/data/132powerpc64-quarterly/aa3532662c1f/logs/librewolf-117.0.1.1_3.log
Build URL: https://pkg-status.freebsd.org/foul1/build.html?mastername=132powerpc64-quarterly&build=aa3532662c1f
Log:
=>> Building www/librewolf
build started at Fri Feb 9 02:31:41 UTC 2024
port directory: /usr/ports/www/librewolf
package name: librewolf-117.0.1.1_3
building for: FreeBSD 132powerpc64-quarterly-job-11 13.2-RELEASE FreeBSD 13.2-RELEASE powerpc
maintained by: freebsd@sysctl.cz
Makefile datestamp: -rw-r--r-- 1 root wheel 3807 Feb 3 01:03 /usr/ports/www/librewolf/Makefile
Ports top last git commit: aa3532662
Ports top unclean checkout: no
Port dir last git commit: aa3532662
Port dir unclean checkout: no
Poudriere version: poudriere-git-3.4.1
Host OSVERSION: 1500003
Jail OSVERSION: 1302001
Job Id: 11
---Begin Environment---
SHELL=/bin/csh
OSVERSION=1302001
UNAME_v=FreeBSD 13.2-RELEASE
UNAME_r=13.2-RELEASE
BLOCKSIZE=K
MAIL=/var/mail/root
MM_CHARSET=UTF-8
LANG=C.UTF-8
STATUS=1
HOME=/root
PATH=/sbin:/bin:/usr/sbin:/usr/bin:/usr/local/sbin:/usr/local/bin:/root/bin
MAKE_OBJDIR_CHECK_WRITABLE=0
LOCALBASE=/usr/local
USER=root
POUDRIERE_NAME=poudriere-git
LIBEXECPREFIX=/usr/local/libexec/poudriere
POUDRIERE_VERSION=3.4.1
MASTERMNT=/usr/local/poudriere/data/.m/132powerpc64-quarterly/ref
LC_COLLATE=C
POUDRIERE_BUILD_TYPE=bulk
PACKAGE_BUILDING=yes
SAVED_TERM=
OUTPUT_REDIRECTED_STDERR=4
OUTPUT_REDIRECTED=1
PWD=/usr/local/poudriere/data/.m/132powerpc64-quarterly/11/.p
OUTPUT_REDIRECTED_STDOUT=3
P_PORTS_FEATURES=FLAVORS SUBPACKAGES SELECTED_OPTIONS
MASTERNAME=132powerpc64-quarterly
SCRIPTPREFIX=/usr/local/share/poudriere
SCRIPTNAME=bulk.sh
OLDPWD=/usr/local/poudriere/data/.m/132powerpc64-quarterly/ref/.p/pool
POUDRIERE_PKGNAME=poudriere-git-3.4.1
SCRIPTPATH=/usr/local/share/poudriere/bulk.sh
POUDRIEREPATH=/usr/local/bin/poudriere
---End Environment---
---Begin Poudriere Port Flags/Env---
PORT_FLAGS=
PKGENV=
FLAVOR=
MAKE_ARGS=
---End Poudriere Port Flags/Env---
---Begin OPTIONS List---
===> The following configuration options are available for librewolf-117.0.1.1_3:
CANBERRA=off: Sound theme alerts
DBUS=on: D-Bus IPC system support
DEBUG=off: Build with debugging support
FFMPEG=on: FFmpeg support (WMA, AIFF, AC3, APE...)
LIBPROXY=off: Proxy support via libproxy
LTO=off: Use Link-Time Optimization
OPTIMIZED_CFLAGS=on: Use extra compiler optimizations
PROFILE=on: Build with profiling support
TEST=off: Build and/or run tests
====> Extra cubeb audio backends (OSS is always available)
ALSA=off: ALSA audio architecture support
JACK=on: JACK audio server support
PULSEAUDIO=on: PulseAudio sound server support
SNDIO=on: Sndio audio support
===> Use 'make config' to modify these settings
---End OPTIONS List---
--MAINTAINER--
freebsd@sysctl.cz
--End MAINTAINER--
--CONFIGURE_ARGS--
--End CONFIGURE_ARGS--
--CONFIGURE_ENV--
BINDGEN_CFLAGS="-I/usr/local/include" MOZ_REQUIRE_SIGNING="" MAKE=gmake PKG_CONFIG=pkgconf PYTHON="/usr/local/bin/python3.9" XDG_DATA_HOME=/wrkdirs/usr/ports/www/librewolf/work XDG_CONFIG_HOME=/wrkdirs/usr/ports/www/librewolf/work XDG_CACHE_HOME=/wrkdirs/usr/ports/www/librewolf/work/.cache HOME=/wrkdirs/usr/ports/www/librewolf/work TMPDIR="/tmp" PATH=/wrkdirs/usr/ports/www/librewolf/work/.bin:/sbin:/bin:/usr/sbin:/usr/bin:/usr/local/sbin:/usr/local/bin:/root/bin PKG_CONFIG_LIBDIR=/wrkdirs/usr/ports/www/librewolf/work/.pkgconfig:/usr/local/libdata/pkgconfig:/usr/local/share/pkgconfig:/usr/libdata/pkgconfig SHELL=/bin/sh CONFIG_SHELL=/bin/sh CMAKE_PREFIX_PATH="/usr/local" LANG=en_US.UTF-8 LC_ALL=en_US.UTF-8
--End CONFIGURE_ENV--
--MAKE_ENV--
XDG_DATA_HOME=/wrkdirs/usr/ports/www/librewolf/work XDG_CONFIG_HOME=/wrkdirs/usr/ports/www/librewolf/work XDG_CACHE_HOME=/wrkdirs/usr/ports/www/librewolf/work/.cache HOME=/wrkdirs/usr/ports/www/librewolf/work TMPDIR="/tmp" PATH=/wrkdirs/usr/ports/www/librewolf/work/.bin:/sbin:/bin:/usr/sbin:/usr/bin:/usr/local/sbin:/usr/local/bin:/root/bin PKG_CONFIG_LIBDIR=/wrkdirs/usr/ports/www/librewolf/work/.pkgconfig:/usr/local/libdata/pkgconfig:/usr/local/share/pkgconfig:/usr/libdata/pkgconfig MK_DEBUG_FILES=no MK_KERNEL_SYMBOLS=no SHELL=/bin/sh NO_LINT=YES LANG=en_US.UTF-8 LC_ALL=en_US.UTF-8 PREFIX=/usr/local LOCALBASE=/usr/local CC="/usr/local/bin/clang15" CFLAGS="-O2 -pipe -O3 -DLIBICONV_PLUG -fstack-protector-strong -isystem /usr/local/include -fno-strict-aliasing " CPP="/usr/local/bin/clang-cpp15" CPPFLAGS="-DLIBICONV_PLUG -isystem /usr/local/include" LDFLAGS=" -Wl,--as-needed -fstack-protector-strong " LIBS="-L/usr/local/lib" CXX="/usr/local/bin/clang++15" CXXFLAGS="-O2 -pipe -O3
-DLIBICONV_PLUG -fstack-protector-strong -isystem /usr/local/include -fno-strict-aliasing -DLIBICONV_PLUG -isystem /usr/local/include " MANPREFIX="/usr/local" BSD_INSTALL_PROGRAM="install -m 555" BSD_INSTALL_LIB="install -m 0644" BSD_INSTALL_SCRIPT="install -m 555" BSD_INSTALL_DATA="install -m 0644" BSD_INSTALL_MAN="install -m 444"
--End MAKE_ENV--
--PLIST_SUB--
GTK2_VERSION="2.10.0" GTK3_VERSION="3.0.0" GTK4_VERSION="4.0.0" PYTHON_INCLUDEDIR=include/python3.9 PYTHON_LIBDIR=lib/python3.9 PYTHON_PLATFORM=freebsd13 PYTHON_SITELIBDIR=lib/python3.9/site-packages PYTHON_SUFFIX=39 PYTHON_EXT_SUFFIX=.cpython-39 PYTHON_VER=3.9 PYTHON_VERSION=python3.9 PYTHON2="@comment " PYTHON3="" OSREL=13.2 PREFIX=%D LOCALBASE=/usr/local RESETPREFIX=/usr/local LIB32DIR=lib DOCSDIR="share/doc/librewolf" EXAMPLESDIR="share/examples/librewolf" DATADIR="share/librewolf" WWWDIR="www/librewolf" ETCDIR="etc/librewolf"
--End PLIST_SUB--
--SUB_LIST--
PYTHON_INCLUDEDIR=/usr/local/include/python3.9 PYTHON_LIBDIR=/usr/local/lib/python3.9 PYTHON_PLATFORM=freebsd13 PYTHON_SITELIBDIR=/usr/local/lib/python3.9/site-packages PYTHON_SUFFIX=39 PYTHON_EXT_SUFFIX=.cpython-39 PYTHON_VER=3.9 PYTHON_VERSION=python3.9 PYTHON2="@comment " PYTHON3="" PREFIX=/usr/local LOCALBASE=/usr/local DATADIR=/usr/local/share/librewolf DOCSDIR=/usr/local/share/doc/librewolf EXAMPLESDIR=/usr/local/share/examples/librewolf WWWDIR=/usr/local/www/librewolf ETCDIR=/usr/local/etc/librewolf
--End SUB_LIST--
---Begin make.conf---
USE_PACKAGE_DEPENDS=yes
BATCH=yes
WRKDIRPREFIX=/wrkdirs
PORTSDIR=/usr/ports
PACKAGES=/packages
DISTDIR=/distfiles
PACKAGE_BUILDING=yes
PACKAGE_BUILDING_FLAVORS=yes
#### ####
# XXX: We really need this but cannot use it while 'make checksum' does not
# try the next mirror on checksum failure. It currently retries the same
# failed mirror and then fails rather then trying another. It *does*
# try the next if the size is mismatched though.
#MASTER_SITE_FREEBSD=yes
# Build ALLOW_MAKE_JOBS_PACKAGES with 3 jobs
MAKE_JOBS_NUMBER=3
#### Misc Poudriere ####
.include "/etc/make.conf.ports_env"
GID=0
UID=0
---End make.conf---
--Resource limits--
cpu time (seconds, -t) unlimited
file size (512-blocks, -f) unlimited
data seg size (kbytes, -d) 33554432
stack size (kbytes, -s) 524288
core file size (512-blocks, -c) unlimited
max memory size (kbytes, -m) unlimited
locked memory (kbytes, -l) unlimited
max user processes (-u) 89999
open files (-n) 8192
virtual mem size (kbytes, -v) unlimited
swap limit (kbytes, -w) unlimited
socket buffer size (bytes, -b) unlimited
pseudo-terminals (-p) unlimited
kqueues (-k) unlimited
umtx shared locks (-o) unlimited
--End resource limits--
=======================<phase: check-sanity >============================
===== env: NO_DEPENDS=yes USER=root UID=0 GID=0
===> License MPL20 accepted by the user
===========================================================================
=======================<phase: pkg-depends >============================
===== env: USE_PACKAGE_DEPENDS_ONLY=1 USER=root UID=0 GID=0
===> librewolf-117.0.1.1_3 depends on file: /usr/local/sbin/pkg - not found
===> Installing existing package /packages/All/pkg-1.20.9.pkg
[132powerpc64-quarterly-job-11] Installing pkg-1.20.9...
[132powerpc64-quarterly-job-11] Extracting pkg-1.20.9: .......... done
===> librewolf-117.0.1.1_3 depends on file: /usr/local/sbin/pkg - found
===> Returning to build of librewolf-117.0.1.1_3
===========================================================================
=======================<phase: fetch-depends >============================
===== env: USE_PACKAGE_DEPENDS_ONLY=1 USER=root UID=0 GID=0
===========================================================================
=======================<phase: fetch >============================
===== env: NO_DEPENDS=yes USER=root UID=0 GID=0
===> License MPL20 accepted by the user
=> librewolf-117.0-1.source.tar.gz doesn't seem to exist in /portdistfiles/.
=> Attempting to fetch https://gitlab.com/api/v4/projects/32320088/packages/generic/librewolf-source/117.0-1/librewolf-117.0-1.source.tar.gz
librewolf-117.0-1.source.tar.gz 861 MB 66 MBps 13s
===> Fetching all distfiles required by librewolf-117.0.1.1_3 for building
===========================================================================
=======================<phase: checksum >============================
===== env: NO_DEPENDS=yes USER=root UID=0 GID=0
===> License MPL20 accepted by the user
===> Fetching all distfiles required by librewolf-117.0.1.1_3 for building
=> SHA256 Checksum OK for librewolf-117.0-1.source.tar.gz.
=> SHA256 Checksum mismatch for patches/unity_kde/unity-menubar.patch?inline=false.
===> Refetch for 1 more times files: patches/unity_kde/unity-menubar.patch?inline=false
===> License MPL20 accepted by the user
=> patches/unity_kde/unity-menubar.patch?inline=false doesn't seem to exist in /portdistfiles/.
=> Attempting to fetch https://gitlab.com/librewolf-community/browser/source/-/raw/5a211f7bad8dcf188a96b408cc143082df8d30a8/patches/unity_kde/unity-menubar.patch?inline=false
patches/unity_kde/unity-menubar.patch?inline=false 159 kB 7575 kBps 00s
===> Fetching all distfiles required by librewolf-117.0.1.1_3 for building
===> License MPL20 accepted by the user
===> Fetching all distfiles required by librewolf-117.0.1.1_3 for building
=> SHA256 Checksum OK for librewolf-117.0-1.source.tar.gz.
=> SHA256 Checksum OK for patches/unity_kde/unity-menubar.patch?inline=false.
===========================================================================
=======================<phase: extract-depends>============================
===== env: USE_PACKAGE_DEPENDS_ONLY=1 USER=root UID=0 GID=0
===========================================================================
=======================<phase: extract >============================
===== env: NO_DEPENDS=yes USER=root UID=0 GID=0
===> License MPL20 accepted by the user
===> Fetching all distfiles required by librewolf-117.0.1.1_3 for building
===> Extracting for librewolf-117.0.1.1_3
=> SHA256 Checksum OK for librewolf-117.0-1.source.tar.gz.
=> SHA256 Checksum OK for patches/unity_kde/unity-menubar.patch?inline=false.
===========================================================================
=======================<phase: patch-depends >============================
===== env: USE_PACKAGE_DEPENDS_ONLY=1 USER=root UID=0 GID=0
===========================================================================
=======================<phase: patch >============================
===== env: NO_DEPENDS=yes USER=root UID=0 GID=0
<snip>
gmake[4]: Entering directory '/wrkdirs/usr/ports/www/librewolf/work/.build/media/highway'
mkdir -p '.deps/'
media/highway/aligned_allocator.o
/usr/local/bin/clang++15 -std=gnu++17 -o aligned_allocator.o -c -I/wrkdirs/usr/ports/www/librewolf/work/.build/dist/stl_wrappers -I/wrkdirs/usr/ports/www/librewolf/work/.build/dist/system_wrappers -include /wrkdirs/usr/ports/www/librewolf/work/librewolf-117.0-1/config/gcc_hidden.h -U_FORTIFY_SOURCE -D_FORTIFY_SOURCE=2 -fstack-protector-strong -fstack-clash-protection -DNDEBUG=1 -DTRIMMED=1 -DMOZ_HAS_MOZGLUE -DMOZILLA_INTERNAL_API -DIMPL_LIBXUL -DSTATIC_EXPORTABLE_JS_API -I/wrkdirs/usr/ports/www/librewolf/work/librewolf-117.0-1/media/highway -I/wrkdirs/usr/ports/www/librewolf/work/.build/media/highway -I/wrkdirs/usr/ports/www/librewolf/work/librewolf-117.0-1/third_party/highway -I/wrkdirs/usr/ports/www/librewolf/work/.build/dist/include -I/usr/local/include/nspr -I/usr/local/include -I/usr/local/include/nss -I/usr/local/include/nspr -I/wrkdirs/usr/ports/www/librewolf/work/.build/dist/include/nss -I/usr/local/include -I/usr/local/include/libpng16 -I/usr/local/include/pixman-1 -I/usr/l
ocal/include -DMOZILLA_CLIENT -include /wrkdirs/usr/ports/www/librewolf/work/.build/mozilla-config.h -DLIBICONV_PLUG -isystem /usr/local/include -fno-sized-deallocation -fno-aligned-new -O2 -pipe -O3 -DLIBICONV_PLUG -fstack-protector-strong -isystem /usr/local/include -fno-strict-aliasing -DLIBICONV_PLUG -isystem /usr/local/include -fno-exceptions -fPIC -fno-rtti -ffunction-sections -fdata-sections -fno-exceptions -fno-math-errno -pipe -O2 -O3 -fno-omit-frame-pointer -funwind-tables -Wall -Wbitfield-enum-conversion -Wdeprecated-this-capture -Wempty-body -Wformat-type-confusion -Wignored-qualifiers -Wpointer-arith -Wshadow-field-in-constructor-modified -Wsign-compare -Wtautological-constant-in-range-compare -Wtype-limits -Wno-error=tautological-type-limit-compare -Wunreachable-code -Wunreachable-code-return -Wunused-but-set-parameter -Wno-invalid-offsetof -Wclass-varargs -Wempty-init-stmt -Wfloat-overflow-conversion -Wfloat-zero-conversion -Wloop-analysis -Wno-range-loop-analysis -Wc
++2a-compat -Wenum-compare-conditional -Wenu!
m-float-conversion -Wno-error=deprecated -Wno-error=deprecated-anon-enum-enum-conversion -Wno-error=deprecated-enum-enum-conversion -Wno-error=deprecated-pragma -Wno-error=deprecated-this-capture -Wcomma -Wimplicit-fallthrough -Wstring-conversion -Wno-inline-new-delete -Wno-error=deprecated-declarations -Wno-error=array-bounds -Wno-error=free-nonheap-object -Wno-error=atomic-alignment -Wno-error=deprecated-builtins -Wformat -Wformat-security -Wno-psabi -Wthread-safety -Wno-error=builtin-macro-redefined -Wno-unknown-warning-option -fno-strict-aliasing -ffp-contract=off -MD -MP -MF .deps/aligned_allocator.o.pp /wrkdirs/usr/ports/www/librewolf/work/librewolf-117.0-1/third_party/highway/hwy/aligned_allocator.cc
media/highway/image.o
/usr/local/bin/clang++15 -std=gnu++17 -o image.o -c -I/wrkdirs/usr/ports/www/librewolf/work/.build/dist/stl_wrappers -I/wrkdirs/usr/ports/www/librewolf/work/.build/dist/system_wrappers -include /wrkdirs/usr/ports/www/librewolf/work/librewolf-117.0-1/config/gcc_hidden.h -U_FORTIFY_SOURCE -D_FORTIFY_SOURCE=2 -fstack-protector-strong -fstack-clash-protection -DNDEBUG=1 -DTRIMMED=1 -DMOZ_HAS_MOZGLUE -DMOZILLA_INTERNAL_API -DIMPL_LIBXUL -DSTATIC_EXPORTABLE_JS_API -I/wrkdirs/usr/ports/www/librewolf/work/librewolf-117.0-1/media/highway -I/wrkdirs/usr/ports/www/librewolf/work/.build/media/highway -I/wrkdirs/usr/ports/www/librewolf/work/librewolf-117.0-1/third_party/highway -I/wrkdirs/usr/ports/www/librewolf/work/.build/dist/include -I/usr/local/include/nspr -I/usr/local/include -I/usr/local/include/nss -I/usr/local/include/nspr -I/wrkdirs/usr/ports/www/librewolf/work/.build/dist/include/nss -I/usr/local/include -I/usr/local/include/libpng16 -I/usr/local/include/pixman-1 -I/usr/local/include
-DMOZILLA_CLIENT -include /wrkdirs/usr/ports/www/librewolf/work/.build/mozilla-config.h -DLIBICONV_PLUG -isystem /usr/local/include -fno-sized-deallocation -fno-aligned-new -O2 -pipe -O3 -DLIBICONV_PLUG -fstack-protector-strong -isystem /usr/local/include -fno-strict-aliasing -DLIBICONV_PLUG -isystem /usr/local/include -fno-exceptions -fPIC -fno-rtti -ffunction-sections -fdata-sections -fno-exceptions -fno-math-errno -pipe -O2 -O3 -fno-omit-frame-pointer -funwind-tables -Wall -Wbitfield-enum-conversion -Wdeprecated-this-capture -Wempty-body -Wformat-type-confusion -Wignored-qualifiers -Wpointer-arith -Wshadow-field-in-constructor-modified -Wsign-compare -Wtautological-constant-in-range-compare -Wtype-limits -Wno-error=tautological-type-limit-compare -Wunreachable-code -Wunreachable-code-return -Wunused-but-set-parameter -Wno-invalid-offsetof -Wclass-varargs -Wempty-init-stmt -Wfloat-overflow-conversion -Wfloat-zero-conversion -Wloop-analysis -Wno-range-loop-analysis -Wc++2a-compat
-Wenum-compare-conditional -Wenum-float-conv!
ersion -Wno-error=deprecated -Wno-error=deprecated-anon-enum-enum-conversion -Wno-error=deprecated-enum-enum-conversion -Wno-error=deprecated-pragma -Wno-error=deprecated-this-capture -Wcomma -Wimplicit-fallthrough -Wstring-conversion -Wno-inline-new-delete -Wno-error=deprecated-declarations -Wno-error=array-bounds -Wno-error=free-nonheap-object -Wno-error=atomic-alignment -Wno-error=deprecated-builtins -Wformat -Wformat-security -Wno-psabi -Wthread-safety -Wno-error=builtin-macro-redefined -Wno-unknown-warning-option -fno-strict-aliasing -ffp-contract=off -MD -MP -MF .deps/image.o.pp /wrkdirs/usr/ports/www/librewolf/work/librewolf-117.0-1/third_party/highway/hwy/contrib/image/image.cc
media/highway/per_target.o
In file included from /wrkdirs/usr/ports/www/librewolf/work/librewolf-117.0-1/third_party/highway/hwy/contrib/image/image.cc:23:
In file included from /wrkdirs/usr/ports/www/librewolf/work/librewolf-117.0-1/third_party/highway/hwy/foreach_target.h:233:
In file included from /wrkdirs/usr/ports/www/librewolf/work/librewolf-117.0-1/third_party/highway/hwy/contrib/image/image.cc:24:
In file included from /wrkdirs/usr/ports/www/librewolf/work/librewolf-117.0-1/third_party/highway/hwy/highway.h:407:
/wrkdirs/usr/ports/www/librewolf/work/librewolf-117.0-1/third_party/highway/hwy/ops/ppc_vsx-inl.h:92:32: error: use of 'long long' with '__vector' requires VSX support (available on POWER7 or later) to be enabled
HWY_VSX_RAW128(int64_t, signed long long, long long) // NOLINT(runtime/int)
^
/wrkdirs/usr/ports/www/librewolf/work/librewolf-117.0-1/third_party/highway/hwy/ops/ppc_vsx-inl.h:92:43: error: use of 'long long' with '__vector' requires VSX support (available on POWER7 or later) to be enabled
HWY_VSX_RAW128(int64_t, signed long long, long long) // NOLINT(runtime/int)
^
/wrkdirs/usr/ports/www/librewolf/work/librewolf-117.0-1/third_party/highway/hwy/ops/ppc_vsx-inl.h:93:35: error: use of 'long long' with '__vector' requires VSX support (available on POWER7 or later) to be enabled
HWY_VSX_RAW128(uint64_t, unsigned long long, long long) // NOLINT(runtime/int)
^
/wrkdirs/usr/ports/www/librewolf/work/librewolf-117.0-1/third_party/highway/hwy/ops/ppc_vsx-inl.h:93:46: error: use of 'long long' with '__vector' requires VSX support (available on POWER7 or later) to be enabled
HWY_VSX_RAW128(uint64_t, unsigned long long, long long) // NOLINT(runtime/int)
^
/wrkdirs/usr/ports/www/librewolf/work/librewolf-117.0-1/third_party/highway/hwy/ops/ppc_vsx-inl.h:95:24: error: use of 'double' with '__vector' requires VSX support to be enabled (available on POWER7 or later)
HWY_VSX_RAW128(double, double, long long) // NOLINT(runtime/int)
^
/wrkdirs/usr/ports/www/librewolf/work/librewolf-117.0-1/third_party/highway/hwy/ops/ppc_vsx-inl.h:95:32: error: use of 'long long' with '__vector' requires VSX support (available on POWER7 or later) to be enabled
HWY_VSX_RAW128(double, double, long long) // NOLINT(runtime/int)
^
/wrkdirs/usr/ports/www/librewolf/work/librewolf-117.0-1/third_party/highway/hwy/ops/ppc_vsx-inl.h:664:44: error: call to 'vec_splats' is ambiguous
return Vec128<int64_t, N>{vec_sra(v.raw, vec_splats(63ULL))};
^~~~~~~~~~
/usr/local/llvm15/lib/clang/15.0.7/include/altivec.h:14706:51: note: candidate function
static __inline__ vector signed char __ATTRS_o_ai vec_splats(signed char __a) {
^
/usr/local/llvm15/lib/clang/15.0.7/include/altivec.h:14711:1: note: candidate function
vec_splats(unsigned char __a) {
^
/usr/local/llvm15/lib/clang/15.0.7/include/altivec.h:14715:45: note: candidate function
static __inline__ vector short __ATTRS_o_ai vec_splats(short __a) {
^
/usr/local/llvm15/lib/clang/15.0.7/include/altivec.h:14720:1: note: candidate function
vec_splats(unsigned short __a) {
^
/usr/local/llvm15/lib/clang/15.0.7/include/altivec.h:14724:43: note: candidate function
static __inline__ vector int __ATTRS_o_ai vec_splats(int __a) {
^
/usr/local/llvm15/lib/clang/15.0.7/include/altivec.h:14729:1: note: candidate function
vec_splats(unsigned int __a) {
^
/usr/local/llvm15/lib/clang/15.0.7/include/altivec.h:14763:45: note: candidate function
static __inline__ vector float __ATTRS_o_ai vec_splats(float __a) {
^
In file included from /wrkdirs/usr/ports/www/librewolf/work/librewolf-117.0-1/third_party/highway/hwy/contrib/image/image.cc:23:
In file included from /wrkdirs/usr/ports/www/librewolf/work/librewolf-117.0-1/third_party/highway/hwy/foreach_target.h:233:
In file included from /wrkdirs/usr/ports/www/librewolf/work/librewolf-117.0-1/third_party/highway/hwy/contrib/image/image.cc:24:
In file included from /wrkdirs/usr/ports/www/librewolf/work/librewolf-117.0-1/third_party/highway/hwy/highway.h:407:
/wrkdirs/usr/ports/www/librewolf/work/librewolf-117.0-1/third_party/highway/hwy/ops/ppc_vsx-inl.h:1025:31: error: use of 'long long' with '__vector' requires VSX support (available on POWER7 or later) to be enabled
constexpr __vector unsigned long long kU64Iota0 = {0, 1};
^
/wrkdirs/usr/ports/www/librewolf/work/librewolf-117.0-1/third_party/highway/hwy/ops/ppc_vsx-inl.h:1037:22: error: use of 'double' with '__vector' requires VSX support to be enabled (available on POWER7 or later)
constexpr __vector double kF64Iota0 = {0.0, 1.0};
^
/wrkdirs/usr/ports/www/librewolf/work/librewolf-117.0-1/third_party/highway/hwy/ops/ppc_vsx-inl.h:1192:65: error: use of 'long long' with '__vector' requires VSX support (available on POWER7 or later) to be enabled
return BitCast(d, VFromD<decltype(du64)>{(__vector unsigned long long){
^
/wrkdirs/usr/ports/www/librewolf/work/librewolf-117.0-1/third_party/highway/hwy/ops/ppc_vsx-inl.h:2751:20: error: use of undeclared identifier 'vec_doublee'
return VFromD<D>{vec_doublee(raw_v)};
^
/wrkdirs/usr/ports/www/librewolf/work/librewolf-117.0-1/third_party/highway/hwy/ops/ppc_vsx-inl.h:2761:20: error: use of undeclared identifier 'vec_doublee'
return VFromD<D>{vec_doublee(raw_v)};
^
/wrkdirs/usr/ports/www/librewolf/work/librewolf-117.0-1/third_party/highway/hwy/ops/ppc_vsx-inl.h:2996:23: error: use of undeclared identifier 'vec_floate'; did you mean 'vec_float'?
return Vec32<float>{vec_floate(v.raw)};
^~~~~~~~~~
vec_float
/usr/local/llvm15/lib/clang/15.0.7/include/altivec.h:3572:1: note: 'vec_float' declared here
vec_float(vector unsigned int __a) {
^
In file included from /wrkdirs/usr/ports/www/librewolf/work/librewolf-117.0-1/third_party/highway/hwy/contrib/image/image.cc:23:
In file included from /wrkdirs/usr/ports/www/librewolf/work/librewolf-117.0-1/third_party/highway/hwy/foreach_target.h:233:
In file included from /wrkdirs/usr/ports/www/librewolf/work/librewolf-117.0-1/third_party/highway/hwy/contrib/image/image.cc:24:
In file included from /wrkdirs/usr/ports/www/librewolf/work/librewolf-117.0-1/third_party/highway/hwy/highway.h:407:
/wrkdirs/usr/ports/www/librewolf/work/librewolf-117.0-1/third_party/highway/hwy/ops/ppc_vsx-inl.h:2996:34: warning: Implicit conversion between vector types (''hwy::N_PPC8::Vec128<double, 1>::Raw' (aka 'hwy::N_PPC8::detail::Raw128<double>::type')' and ''__vector unsigned int' (vector of 4 'unsigned int' values)') is deprecated. In the future, the behavior implied by '-fno-lax-vector-conversions' will be the default. [-Wdeprecate-lax-vec-conv-all]
return Vec32<float>{vec_floate(v.raw)};
^
/wrkdirs/usr/ports/www/librewolf/work/librewolf-117.0-1/third_party/highway/hwy/ops/ppc_vsx-inl.h:3004:34: error: use of undeclared identifier 'vec_floato'; did you mean 'vec_float'?
const Vec128<float> f64_to_f32{vec_floato(v.raw)};
^~~~~~~~~~
vec_float
/usr/local/llvm15/lib/clang/15.0.7/include/altivec.h:3572:1: note: 'vec_float' declared here
vec_float(vector unsigned int __a) {
^
In file included from /wrkdirs/usr/ports/www/librewolf/work/librewolf-117.0-1/third_party/highway/hwy/contrib/image/image.cc:23:
In file included from /wrkdirs/usr/ports/www/librewolf/work/librewolf-117.0-1/third_party/highway/hwy/foreach_target.h:233:
In file included from /wrkdirs/usr/ports/www/librewolf/work/librewolf-117.0-1/third_party/highway/hwy/contrib/image/image.cc:24:
In file included from /wrkdirs/usr/ports/www/librewolf/work/librewolf-117.0-1/third_party/highway/hwy/highway.h:407:
/wrkdirs/usr/ports/www/librewolf/work/librewolf-117.0-1/third_party/highway/hwy/ops/ppc_vsx-inl.h:3004:45: warning: Implicit conversion between vector types (''hwy::N_PPC8::Vec128<double, 2>::Raw' (aka 'hwy::N_PPC8::detail::Raw128<double>::type')' and ''__vector unsigned int' (vector of 4 'unsigned int' values)') is deprecated. In the future, the behavior implied by '-fno-lax-vector-conversions' will be the default. [-Wdeprecate-lax-vec-conv-all]
const Vec128<float> f64_to_f32{vec_floato(v.raw)};
^
/wrkdirs/usr/ports/www/librewolf/work/librewolf-117.0-1/third_party/highway/hwy/ops/ppc_vsx-inl.h:3015:25: error: use of undeclared identifier 'vec_signede'; did you mean 'vec_signed'?
return Vec32<int32_t>{vec_signede(v.raw)};
^~~~~~~~~~~
vec_signed
/usr/local/llvm15/lib/clang/15.0.7/include/altivec.h:3483:1: note: 'vec_signed' declared here
vec_signed(vector float __a) {
^
In file included from /wrkdirs/usr/ports/www/librewolf/work/librewolf-117.0-1/third_party/highway/hwy/contrib/image/image.cc:23:
In file included from /wrkdirs/usr/ports/www/librewolf/work/librewolf-117.0-1/third_party/highway/hwy/foreach_target.h:233:
In file included from /wrkdirs/usr/ports/www/librewolf/work/librewolf-117.0-1/third_party/highway/hwy/contrib/image/image.cc:24:
In file included from /wrkdirs/usr/ports/www/librewolf/work/librewolf-117.0-1/third_party/highway/hwy/highway.h:407:
/wrkdirs/usr/ports/www/librewolf/work/librewolf-117.0-1/third_party/highway/hwy/ops/ppc_vsx-inl.h:3015:37: warning: Implicit conversion between vector types (''hwy::N_PPC8::Vec128<double, 1>::Raw' (aka 'hwy::N_PPC8::detail::Raw128<double>::type')' and ''__vector float' (vector of 4 'float' values)') is deprecated. In the future, the behavior implied by '-fno-lax-vector-conversions' will be the default. [-Wdeprecate-lax-vec-conv-all]
return Vec32<int32_t>{vec_signede(v.raw)};
^
/wrkdirs/usr/ports/www/librewolf/work/librewolf-117.0-1/third_party/highway/hwy/ops/ppc_vsx-inl.h:3023:36: error: use of undeclared identifier 'vec_signedo'; did you mean 'vec_signed'?
const Vec128<int32_t> f64_to_i32{vec_signedo(v.raw)};
^~~~~~~~~~~
vec_signed
/usr/local/llvm15/lib/clang/15.0.7/include/altivec.h:3483:1: note: 'vec_signed' declared here
vec_signed(vector float __a) {
^
In file included from /wrkdirs/usr/ports/www/librewolf/work/librewolf-117.0-1/third_party/highway/hwy/contrib/image/image.cc:23:
In file included from /wrkdirs/usr/ports/www/librewolf/work/librewolf-117.0-1/third_party/highway/hwy/foreach_target.h:233:
In file included from /wrkdirs/usr/ports/www/librewolf/work/librewolf-117.0-1/third_party/highway/hwy/contrib/image/image.cc:24:
In file included from /wrkdirs/usr/ports/www/librewolf/work/librewolf-117.0-1/third_party/highway/hwy/highway.h:407:
/wrkdirs/usr/ports/www/librewolf/work/librewolf-117.0-1/third_party/highway/hwy/ops/ppc_vsx-inl.h:3023:48: warning: Implicit conversion between vector types (''hwy::N_PPC8::Vec128<double, 2>::Raw' (aka 'hwy::N_PPC8::detail::Raw128<double>::type')' and ''__vector float' (vector of 4 'float' values)') is deprecated. In the future, the behavior implied by '-fno-lax-vector-conversions' will be the default. [-Wdeprecate-lax-vec-conv-all]
const Vec128<int32_t> f64_to_i32{vec_signedo(v.raw)};
^
/wrkdirs/usr/ports/www/librewolf/work/librewolf-117.0-1/third_party/highway/hwy/ops/ppc_vsx-inl.h:3028:25: error: call to 'vec_pack' is ambiguous
return Vec64<int32_t>{vec_pack(vi64.raw, vi64.raw)};
^~~~~~~~
/usr/local/llvm15/lib/clang/15.0.7/include/altivec.h:7377:1: note: candidate function
vec_pack(vector signed short __a, vector signed short __b) {
^
/usr/local/llvm15/lib/clang/15.0.7/include/altivec.h:7392:1: note: candidate function
vec_pack(vector unsigned short __a, vector unsigned short __b) {
^
/usr/local/llvm15/lib/clang/15.0.7/include/altivec.h:7407:1: note: candidate function
vec_pack(vector bool short __a, vector bool short __b) {
^
/usr/local/llvm15/lib/clang/15.0.7/include/altivec.h:7421:45: note: candidate function
static __inline__ vector short __ATTRS_o_ai vec_pack(vector int __a,
^
/usr/local/llvm15/lib/clang/15.0.7/include/altivec.h:7437:1: note: candidate function
vec_pack(vector unsigned int __a, vector unsigned int __b) {
^
/usr/local/llvm15/lib/clang/15.0.7/include/altivec.h:7451:50: note: candidate function
static __inline__ vector bool short __ATTRS_o_ai vec_pack(vector bool int __a,
^
In file included from /wrkdirs/usr/ports/www/librewolf/work/librewolf-117.0-1/third_party/highway/hwy/contrib/image/image.cc:23:
In file included from /wrkdirs/usr/ports/www/librewolf/work/librewolf-117.0-1/third_party/highway/hwy/foreach_target.h:233:
In file included from /wrkdirs/usr/ports/www/librewolf/work/librewolf-117.0-1/third_party/highway/hwy/contrib/image/image.cc:24:
In file included from /wrkdirs/usr/ports/www/librewolf/work/librewolf-117.0-1/third_party/highway/hwy/highway.h:407:
/wrkdirs/usr/ports/www/librewolf/work/librewolf-117.0-1/third_party/highway/hwy/ops/ppc_vsx-inl.h:3193:41: error: use of undeclared identifier 'vec_cipher_be'
return BitCast(du8, detail::CipherVec{vec_cipher_be(
^
/wrkdirs/usr/ports/www/librewolf/work/librewolf-117.0-1/third_party/highway/hwy/ops/ppc_vsx-inl.h:3208:41: error: use of undeclared identifier 'vec_cipherlast_be'
return BitCast(du8, detail::CipherVec{vec_cipherlast_be(
^
fatal error: too many errors emitted, stopping now [-ferror-limit=]
4 warnings and 20 errors generated.
gmake[4]: *** [/wrkdirs/usr/ports/www/librewolf/work/librewolf-117.0-1/config/rules.mk:661: image.o] Error 1
gmake[4]: Leaving directory '/wrkdirs/usr/ports/www/librewolf/work/.build/media/highway'
gmake[3]: *** [/wrkdirs/usr/ports/www/librewolf/work/librewolf-117.0-1/config/recurse.mk:72: media/highway/target-objects] Error 2
gmake[3]: *** Waiting for unfinished jobs....
In file included from Unified_cpp_layout_xul_tree0.cpp:2:
In file included from /wrkdirs/usr/ports/www/librewolf/work/librewolf-117.0-1/layout/xul/tree/nsTreeBodyFrame.cpp:7:
In file included from /wrkdirs/usr/ports/www/librewolf/work/librewolf-117.0-1/layout/xul/SimpleXULLeafFrame.h:16:
In file included from /wrkdirs/usr/ports/www/librewolf/work/librewolf-117.0-1/layout/generic/nsLeafFrame.h:14:
In file included from /wrkdirs/usr/ports/www/librewolf/work/librewolf-117.0-1/layout/painting/nsDisplayList.h:50:
In file included from /wrkdirs/usr/ports/www/librewolf/work/librewolf-117.0-1/layout/painting/nsDisplayListInvalidation.h:11:
In file included from /wrkdirs/usr/ports/www/librewolf/work/.build/dist/include/mozilla/layers/WebRenderUserData.h:11:
In file included from /wrkdirs/usr/ports/www/librewolf/work/.build/dist/include/mozilla/webrender/WebRenderAPI.h:18:
In file included from /wrkdirs/usr/ports/www/librewolf/work/.build/dist/include/mozilla/layers/IpcResourceUpdateQueue.h:12:
In file included from /wrkdirs/usr/ports/www/librewolf/work/.build/dist/include/mozilla/layers/TextureClient.h:22:
/wrkdirs/usr/ports/www/librewolf/work/.build/dist/include/mozilla/gfx/CriticalSection.h:55:3: warning: mutex 'mMutex' is still held at the end of function [-Wthread-safety-analysis]
}
^
/wrkdirs/usr/ports/www/librewolf/work/.build/dist/include/mozilla/gfx/CriticalSection.h:53:26: note: mutex acquired here
DebugOnly<int> err = pthread_mutex_lock(&mMutex);
^
/wrkdirs/usr/ports/www/librewolf/work/.build/dist/include/mozilla/gfx/CriticalSection.h:58:26: warning: releasing mutex 'mMutex' that was not held [-Wthread-safety-analysis]
DebugOnly<int> err = pthread_mutex_unlock(&mMutex);
^
2 warnings generated.
gmake[4]: Leaving directory '/wrkdirs/usr/ports/www/librewolf/work/.build/layout/xul'
2 warnings generated.
gmake[4]: Leaving directory '/wrkdirs/usr/ports/www/librewolf/work/.build/layout/xul/tree'
gmake[3]: Leaving directory '/wrkdirs/usr/ports/www/librewolf/work/.build'
gmake[2]: *** [/wrkdirs/usr/ports/www/librewolf/work/librewolf-117.0-1/config/recurse.mk:34: compile] Error 2
gmake[2]: Leaving directory '/wrkdirs/usr/ports/www/librewolf/work/.build'
gmake[1]: *** [/wrkdirs/usr/ports/www/librewolf/work/librewolf-117.0-1/config/rules.mk:361: all] Error 2
gmake[1]: Leaving directory '/wrkdirs/usr/ports/www/librewolf/work/.build'
===> Compilation failed unexpectedly.
Try to set MAKE_JOBS_UNSAFE=yes and rebuild before reporting the failure to
the maintainer.
*** Error code 1
Stop.
make: stopped in /usr/ports/www/librewolf