[package - main-arm64-default][www/dooble] Failed for dooble-2024.11.17 in build
- Go to: [ bottom of page ] [ top of archives ] [ this month ]
Date: Thu, 05 Dec 2024 12:45:04 UTC
You are receiving this mail as a port that you maintain
is failing to build on the FreeBSD package build server.
Please investigate the failure and submit a PR to fix
build.
Maintainer: eric@camachat.org
Log URL: https://pkg-status.freebsd.org/ampere2/data/main-arm64-default/p34de869e4274_se8d027be6b8/logs/dooble-2024.11.17.log
Build URL: https://pkg-status.freebsd.org/ampere2/build.html?mastername=main-arm64-default&build=p34de869e4274_se8d027be6b8
Log:
=>> Building www/dooble
build started at Thu Dec 5 12:43:43 UTC 2024
port directory: /usr/ports/www/dooble
package name: dooble-2024.11.17
building for: FreeBSD main-arm64-default-job-03 15.0-CURRENT FreeBSD 15.0-CURRENT 1500028 arm64
maintained by: eric@camachat.org
Makefile datestamp: -rw-r--r-- 1 root wheel 1650 Nov 30 01:02 /usr/ports/www/dooble/Makefile
Ports top last git commit: 34de869e427
Ports top unclean checkout: no
Port dir last git commit: 5483701a17f
Port dir unclean checkout: no
Poudriere version: poudriere-git-3.4.2
Host OSVERSION: 1500023
Jail OSVERSION: 1500028
Job Id: 03
!!! Jail is newer than host. (Jail: 1500028, Host: 1500023) !!!
!!! This is not supported. !!!
!!! Host kernel must be same or newer than jail. !!!
!!! Expect build failures. !!!
---Begin Environment---
SHELL=/bin/sh
OSVERSION=1500028
UNAME_v=FreeBSD 15.0-CURRENT 1500028
UNAME_r=15.0-CURRENT
BLOCKSIZE=K
MAIL=/var/mail/root
MM_CHARSET=UTF-8
LANG=C.UTF-8
STATUS=1
HOME=/root
PATH=/sbin:/bin:/usr/sbin:/usr/bin:/usr/local/sbin:/usr/local/bin:/root/bin
MAKE_OBJDIR_CHECK_WRITABLE=0
LOCALBASE=/usr/local
USER=root
POUDRIERE_NAME=poudriere-git
LIBEXECPREFIX=/usr/local/libexec/poudriere
POUDRIERE_VERSION=3.4.2
MASTERMNT=/usr/local/poudriere/data/.m/main-arm64-default/ref
LC_COLLATE=C
POUDRIERE_BUILD_TYPE=bulk
PACKAGE_BUILDING=yes
SAVED_TERM=
OUTPUT_REDIRECTED_STDERR=4
OUTPUT_REDIRECTED=1
PWD=/usr/local/poudriere/data/.m/main-arm64-default/03/.p
OUTPUT_REDIRECTED_STDOUT=3
P_PORTS_FEATURES=FLAVORS SUBPACKAGES SELECTED_OPTIONS
MASTERNAME=main-arm64-default
SCRIPTPREFIX=/usr/local/share/poudriere
SCRIPTNAME=bulk.sh
OLDPWD=/usr/local/poudriere/data/.m/main-arm64-default/ref/.p/pool
POUDRIERE_PKGNAME=poudriere-git-3.4.2
SCRIPTPATH=/usr/local/share/poudriere/bulk.sh
POUDRIEREPATH=/usr/local/bin/poudriere
---End Environment---
---Begin Poudriere Port Flags/Env---
PORT_FLAGS=
PKGENV=
FLAVOR=
MAKE_ARGS=
---End Poudriere Port Flags/Env---
---Begin OPTIONS List---
---End OPTIONS List---
--MAINTAINER--
eric@camachat.org
--End MAINTAINER--
--CONFIGURE_ARGS--
--with-qt-includes=/usr/local/include/qt6 --with-qt-libraries=/usr/local/lib/qt6 --with-extra-includes=/usr/local/include --with-extra-libs=/usr/local/lib
--End CONFIGURE_ARGS--
--CONFIGURE_ENV--
MAKE=gmake QT_SELECT=qt6 QMAKEMODULES="/wrkdirs/usr/ports/www/dooble/work/dooble-2024.11.17/mkspecs/modules:/usr/local/lib/qt6/mkspecs/modules" QTDIR="/usr/local/lib/qt6" QMAKE="/usr/local/lib/qt6/bin/qmake" MOC="/usr/local/libexec/qt6/moc" RCC="/usr/local/libexec/qt6/rcc" UIC="/usr/local/libexec/qt6/uic" QMAKESPEC="/usr/local/lib/qt6/mkspecs/freebsd-$(ccver="$(c++ --version)"; case "$ccver" in *clang*) echo clang ;; *) echo g++ ;; esac)" XDG_DATA_HOME=/wrkdirs/usr/ports/www/dooble/work XDG_CONFIG_HOME=/wrkdirs/usr/ports/www/dooble/work XDG_CACHE_HOME=/wrkdirs/usr/ports/www/dooble/work/.cache HOME=/wrkdirs/usr/ports/www/dooble/work TMPDIR="/tmp" PATH=/wrkdirs/usr/ports/www/dooble/work/.bin:/sbin:/bin:/usr/sbin:/usr/bin:/usr/local/sbin:/usr/local/bin:/root/bin PKG_CONFIG_LIBDIR=/wrkdirs/usr/ports/www/dooble/work/.pkgconfig:/usr/local/libdata/pkgconfig:/usr/local/share/pkgconfig:/usr/libdata/pkgconfig SHELL=/bin/sh CONFIG_SHELL=/bin/sh
--End CONFIGURE_ENV--
--MAKE_ENV--
QT_SELECT=qt6 QMAKEMODULES="/wrkdirs/usr/ports/www/dooble/work/dooble-2024.11.17/mkspecs/modules:/usr/local/lib/qt6/mkspecs/modules" OPENSSLBASE=/usr OPENSSLDIR=/etc/ssl OPENSSLINC=/usr/include OPENSSLLIB=/usr/lib XDG_DATA_HOME=/wrkdirs/usr/ports/www/dooble/work XDG_CONFIG_HOME=/wrkdirs/usr/ports/www/dooble/work XDG_CACHE_HOME=/wrkdirs/usr/ports/www/dooble/work/.cache HOME=/wrkdirs/usr/ports/www/dooble/work TMPDIR="/tmp" PATH=/wrkdirs/usr/ports/www/dooble/work/.bin:/sbin:/bin:/usr/sbin:/usr/bin:/usr/local/sbin:/usr/local/bin:/root/bin PKG_CONFIG_LIBDIR=/wrkdirs/usr/ports/www/dooble/work/.pkgconfig:/usr/local/libdata/pkgconfig:/usr/local/share/pkgconfig:/usr/libdata/pkgconfig MK_DEBUG_FILES=no MK_KERNEL_SYMBOLS=no SHELL=/bin/sh NO_LINT=YES PREFIX=/usr/local LOCALBASE=/usr/local CC="cc" CFLAGS="-O2 -pipe -fstack-protector-strong -fno-strict-aliasing " CPP="cpp" CPPFLAGS="" LDFLAGS=" -Wl,--undefined-version -fstack-protector-strong " LIBS="" CXX="c++" CXXFLAGS="-O2 -p
ipe -fstack-protector-strong -fno-strict-aliasing " BSD_INSTALL_PROGRAM="install -s -m 555" BSD_INSTALL_LIB="install -s -m 0644" BSD_INSTALL_SCRIPT="install -m 555" BSD_INSTALL_DATA="install -m 0644" BSD_INSTALL_MAN="install -m 444"
--End MAKE_ENV--
--PLIST_SUB--
QTWEBENGINE_DICTIONARIES=/usr/local/share/qt6/qtwebengine_dictionaries QT_BINDIR="lib/qt6/bin" QT_INCDIR="include/qt6" QT_LIBDIR="lib/qt6" QT_ARCHDIR="lib/qt6" QT_PLUGINDIR="lib/qt6/plugins" QT_LIBEXECDIR="libexec/qt6" QT_IMPORTDIR="lib/qt6/imports" QT_QMLDIR="lib/qt6/qml" QT_DATADIR="share/qt6" QT_DOCDIR="share/doc/qt6" QT_L10NDIR="share/qt6/translations" QT_EXAMPLEDIR="share/examples/qt6" QT_TESTDIR="share/qt6/tests" QT_MKSPECDIR="lib/qt6/mkspecs" QT_TOOLDIR="libexec/qt6" DEBUG="@comment " OSREL=15.0 PREFIX=%D LOCALBASE=/usr/local RESETPREFIX=/usr/local LIB32DIR=lib DOCSDIR="share/doc/dooble" EXAMPLESDIR="share/examples/dooble" DATADIR="share/dooble" WWWDIR="www/dooble" ETCDIR="etc/dooble"
--End PLIST_SUB--
--SUB_LIST--
PREFIX=/usr/local LOCALBASE=/usr/local DATADIR=/usr/local/share/dooble DOCSDIR=/usr/local/share/doc/dooble EXAMPLESDIR=/usr/local/share/examples/dooble WWWDIR=/usr/local/www/dooble ETCDIR=/usr/local/etc/dooble
--End SUB_LIST--
---Begin make.conf---
# XXX: We really need this but cannot use it while 'make checksum' does not
# try the next mirror on checksum failure. It currently retries the same
# failed mirror and then fails rather then trying another. It *does*
# try the next if the size is mismatched though.
#MASTER_SITE_FREEBSD=yes
# Build ALLOW_MAKE_JOBS_PACKAGES with 3 jobs
MAKE_JOBS_NUMBER=3
USE_PACKAGE_DEPENDS=yes
BATCH=yes
WRKDIRPREFIX=/wrkdirs
PORTSDIR=/usr/ports
PACKAGES=/packages
DISTDIR=/distfiles
PACKAGE_BUILDING=yes
PACKAGE_BUILDING_FLAVORS=yes
#### ####
# XXX: We really need this but cannot use it while 'make checksum' does not
# try the next mirror on checksum failure. It currently retries the same
# failed mirror and then fails rather then trying another. It *does*
# try the next if the size is mismatched though.
#MASTER_SITE_FREEBSD=yes
# Build ALLOW_MAKE_JOBS_PACKAGES with 3 jobs
MAKE_JOBS_NUMBER=3
#### Misc Poudriere ####
.include "/etc/make.conf.ports_env"
GID=0
UID=0
---End make.conf---
--Resource limits--
ulimit: can't get limit: Invalid argument
cpu time (seconds, -t) unlimited
file size (512-blocks, -f) unlimited
data seg size (kbytes, -d) 1048576
stack size (kbytes, -s) 1048576
core file size (512-blocks, -c) unlimited
max memory size (kbytes, -m) unlimited
locked memory (kbytes, -l) unlimited
max user processes (-u) 89999
open files (-n) 8192
virtual mem size (kbytes, -v) unlimited
swap limit (kbytes, -w) unlimited
socket buffer size (bytes, -b) unlimited
pseudo-terminals (-p) unlimited
kqueues (-k) unlimited
umtx shared locks (-o) unlimited
--End resource limits--
=======================<phase: check-sanity >============================
===== env: NO_DEPENDS=yes USER=root UID=0 GID=0
===> License BSD3CLAUSE accepted by the user
===========================================================================
=======================<phase: pkg-depends >============================
===== env: USE_PACKAGE_DEPENDS_ONLY=1 USER=root UID=0 GID=0
===> dooble-2024.11.17 depends on file: /usr/local/sbin/pkg - not found
===> Installing existing package /packages/All/pkg-1.21.3.pkg
[main-arm64-default-job-03] Installing pkg-1.21.3...
[main-arm64-default-job-03] Extracting pkg-1.21.3: .......... done
===> dooble-2024.11.17 depends on file: /usr/local/sbin/pkg - found
===> Returning to build of dooble-2024.11.17
===========================================================================
=======================<phase: fetch-depends >============================
===== env: USE_PACKAGE_DEPENDS_ONLY=1 USER=root UID=0 GID=0
===========================================================================
=======================<phase: fetch >============================
===== env: NO_DEPENDS=yes USER=root UID=0 GID=0
===> License BSD3CLAUSE accepted by the user
=> textbrowser-dooble-2024.11.17_GH0.tar.gz doesn't seem to exist in /portdistfiles/.
=> Attempting to fetch https://codeload.github.com/textbrowser/dooble/tar.gz/2024.11.17?dummy=/textbrowser-dooble-2024.11.17_GH0.tar.gz
fetch: https://codeload.github.com/textbrowser/dooble/tar.gz/2024.11.17?dummy=/textbrowser-dooble-2024.11.17_GH0.tar.gz: size unknown
fetch: https://codeload.github.com/textbrowser/dooble/tar.gz/2024.11.17?dummy=/textbrowser-dooble-2024.11.17_GH0.tar.gz: size of remote file is not known
textbrowser-dooble-2024.11.17_GH0.tar.gz 6727 kB 11 MBps 01s
=> textbrowser-dooble-dictionaries-0f1e715_GH0.tar.gz doesn't seem to exist in /portdistfiles/.
=> Attempting to fetch https://codeload.github.com/textbrowser/dooble-dictionaries/tar.gz/0f1e715?dummy=/textbrowser-dooble-dictionaries-0f1e715_GH0.tar.gz
fetch: https://codeload.github.com/textbrowser/dooble-dictionaries/tar.gz/0f1e715?dummy=/textbrowser-dooble-dictionaries-0f1e715_GH0.tar.gz: size unknown
fetch: https://codeload.github.com/textbrowser/dooble-dictionaries/tar.gz/0f1e715?dummy=/textbrowser-dooble-dictionaries-0f1e715_GH0.tar.gz: size of remote file is not known
textbrowser-dooble-dictionaries-0f1e715_GH0.tar.gz 33 MB 5097 kBps 07s
===> Fetching all distfiles required by dooble-2024.11.17 for building
===========================================================================
=======================<phase: checksum >============================
===== env: NO_DEPENDS=yes USER=root UID=0 GID=0
===> License BSD3CLAUSE accepted by the user
===> Fetching all distfiles required by dooble-2024.11.17 for building
=> SHA256 Checksum OK for textbrowser-dooble-2024.11.17_GH0.tar.gz.
=> SHA256 Checksum OK for textbrowser-dooble-dictionaries-0f1e715_GH0.tar.gz.
===========================================================================
=======================<phase: extract-depends>============================
===== env: USE_PACKAGE_DEPENDS_ONLY=1 USER=root UID=0 GID=0
===========================================================================
=======================<phase: extract >============================
===== env: NO_DEPENDS=yes USER=root UID=0 GID=0
===> License BSD3CLAUSE accepted by the user
===> Fetching all distfiles required by dooble-2024.11.17 for building
===> Extracting for dooble-2024.11.17
=> SHA256 Checksum OK for textbrowser-dooble-2024.11.17_GH0.tar.gz.
=> SHA256 Checksum OK for textbrowser-dooble-dictionaries-0f1e715_GH0.tar.gz.
===========================================================================
=======================<phase: patch-depends >============================
===== env: USE_PACKAGE_DEPENDS_ONLY=1 USER=root UID=0 GID=0
===========================================================================
=======================<phase: patch >============================
===== env: NO_DEPENDS=yes USER=root UID=0 GID=0
===> Patching for dooble-2024.11.17
<snip>
In file included from /usr/local/include/qt6/QtCore/qfile.h:8:
In file included from /usr/local/include/qt6/QtCore/qfiledevice.h:7:
In file included from /usr/local/include/qt6/QtCore/qiodevice.h:10:
In file included from /usr/local/include/qt6/QtCore/qobject.h:18:
In file included from /usr/local/include/qt6/QtCore/qmetatype.h:14:
/usr/local/include/qt6/QtCore/qfloat16.h:235:5: error: zero as null pointer constant [-Werror,-Wzero-as-null-pointer-constant]
/usr/local/include/qt6/QtCore/qfloat16.h:232:5: note: expanded from macro 'QF16_MAKE_ORDER_OP_FP'
232 | QF16_PARTIALLY_ORDERED(qfloat16, FIn file included from PSource/dooble_aes256.cc):
34 :
| In file included from ^/usr/local/include/qt6/QtCore/QIODevice
:/usr/local/include/qt6/QtCore/qfloat16.h1::
216In file included from :/usr/local/include/qt6/QtCore/qiodevice.h34::10 :
note: In file included from expanded from macro 'QF16_PARTIALLY_ORDERED'/usr/local/include/qt6/QtCore/qobject.h
: 18216:
| In file included from #/usr/local/include/qt6/QtCore/qmetatype.h : 14d:
e/usr/local/include/qt6/QtCore/qfloat16.hf:i235n:e5 :Q Ferror: 1zero as null pointer constant [-Werror,-Wzero-as-null-pointer-constant]6
_P/usr/local/include/qt6/QtCore/qfloat16.hA:R232T:I5A:L Lnote: Yexpanded from macro 'QF16_MAKE_ORDER_OP_FP'_
O R232D | E R E D QQF_1D6E_CPLAARRTEI_APLALYR_TOIRADLELRYE_DO(RqDfElRoEaDt
1 6| , ^
F/usr/local/include/qt6/QtCore/qcomparehelpers.hP:)295
: 5| : ^
note: /usr/local/include/qt6/QtCore/qfloat16.hexpanded from macro 'Q_DECLARE_PARTIALLY_ORDERED':
216 :29534 | : note: expanded from macro 'QF16_PARTIALLY_ORDERED'
Q T216_ | O#V E RdLeOfAiDnEeD _QMFA1C6R_OP(AQRTT_IDAELCLLYA_ROER_DPEARRETDI AQL_LDYE_COLRADREER_EPDA,R T_I_AVLAL_YA_ROGRSD_E_R)E
D
| ^|
^note:
(skipping 6 expansions in backtrace; use -fmacro-backtrace-limit=0 to see all)/usr/local/include/qt6/QtCore/qcomparehelpers.h
:<scratch space>295::1245::1 :note: expanded from macro 'Q_DECLARE_PARTIALLY_ORDERED'note:
expanded from here
295124 | | Q T _ DQETC_LOAVREER_LOORADDEERDI_NMGA_CHREOL(PQETR__DPEACRLTAIRAEL_
P A| R^T
I/usr/local/include/qt6/QtCore/qcomparehelpers.hA:L217L:Y5_:O Rnote: Dexpanded from macro 'QT_DECLARE_ORDERING_HELPER_PARTIAL'E
RE D217, | _ _ V AQ_TA_RDGESC_L_A)R
E _| O ^R
Dnote: E(skipping 6 expansions in backtrace; use -fmacro-backtrace-limit=0 to see all)R
I<scratch space>N:G38_:H1E:L Pnote: Eexpanded from hereR
_ T38E | MQPTL_ADTEEC(LQAtR:E:_pRaErVtEiRaSlE_Do_rOdReDrEiRnIgN,G _LHeEfLtPTEyRp_eP,A RRTiIgAhLt
T y| p^e
,/usr/local/include/qt6/QtCore/qcomparehelpers.h :C248o:n5s:t enote: xexpanded from macro 'QT_DECLARE_REVERSED_ORDERING_HELPER_PARTIAL'p
r)
248 | | ^
/usr/local/include/qt6/QtCore/qcomparehelpers.h: 213Q:T43_:D Enote: Cexpanded from macro 'QT_DECLARE_ORDERING_HELPER_TEMPLATE'L
A R213E | _ R E V E{R SrEeDt_uOrRnD EcRoImNpGa_rHeETLhPrEeRe_WTaEyM(PlLhAsT,E (rQhts:): p>a=r t0i;a l}_ o\r
d e| r ^i
ng, LeftType, RightType, Constexpr)
| ^
/usr/local/include/qt6/QtCore/qcomparehelpers.h:235:42: note: expanded from macro 'QT_DECLARE_REVERSED_ORDERING_HELPER_TEMPLATE'
235 | { return compareThreeWay(rhs, lhs) > 0; } \
| ^
In file included from Source/dooble_aes256.cc:34In file included from :
Source/dooble_application.ccIn file included from :/usr/local/include/qt6/QtCore/QIODevice28::
1In file included from :
/usr/local/include/qt6/QtCore/QDirIn file included from :/usr/local/include/qt6/QtCore/qiodevice.h1::
10In file included from :
/usr/local/include/qt6/QtCore/qdir.hIn file included from :/usr/local/include/qt6/QtCore/qobject.h8::
18In file included from :
/usr/local/include/qt6/QtCore/qfile.hIn file included from :/usr/local/include/qt6/QtCore/qmetatype.h8::
14In file included from :
/usr/local/include/qt6/QtCore/qfiledevice.h/usr/local/include/qt6/QtCore/qfloat16.h::7235:
:In file included from 5/usr/local/include/qt6/QtCore/qiodevice.h:: 10error: :
zero as null pointer constant [-Werror,-Wzero-as-null-pointer-constant]In file included from
/usr/local/include/qt6/QtCore/qobject.h:/usr/local/include/qt6/QtCore/qfloat16.h18::
232In file included from :/usr/local/include/qt6/QtCore/qmetatype.h5::14 :
note: /usr/local/include/qt6/QtCore/qfloat16.hexpanded from macro 'QF16_MAKE_ORDER_OP_FP':
235: 5232: | error: zero as null pointer constant [-Werror,-Wzero-as-null-pointer-constant]
Q/usr/local/include/qt6/QtCore/qfloat16.hF:12326:_5P:A Rnote: Texpanded from macro 'QF16_MAKE_ORDER_OP_FP'I
A L232L | Y _ O R DQEFR1E6D_(PqAfRlToIaAtL1L6Y,_ OFRPD)E
R E| D ^(
q/usr/local/include/qt6/QtCore/qfloat16.hf:l216o:a34t:1 6note: ,expanded from macro 'QF16_PARTIALLY_ORDERED'
FP )216
| #| ^
d/usr/local/include/qt6/QtCore/qfloat16.he:f216i:n34e: Qnote: Fexpanded from macro 'QF16_PARTIALLY_ORDERED'1
6 _216P | A#R T IdAeLfLiYn_eO RQDFE1R6E_DP AQR_TDIEACLLLAYR_EO_RPDAERRTEIDA LQL_YD_EOCRLDAERREE_DP
A R| T ^I
A/usr/local/include/qt6/QtCore/qcomparehelpers.hL:L295Y:_5O:R Dnote: Eexpanded from macro 'Q_DECLARE_PARTIALLY_ORDERED'R
ED
295 | | ^
/usr/local/include/qt6/QtCore/qcomparehelpers.h :Q295T:_5O:V Enote: Rexpanded from macro 'Q_DECLARE_PARTIALLY_ORDERED'L
O A295D | E D _ M AQCTR_OO(VQETR_LDOEACDLEADR_EM_APCARROT(IQATL_LDYE_COLRADREER_EPDA,R T_I_AVLAL_YA_ROGRSD_E_R)E
D ,| ^_
_note: V(skipping 6 expansions in backtrace; use -fmacro-backtrace-limit=0 to see all)A
_<scratch space>A:R38G:S1_:_ )note:
expanded from here
| ^38
| note: Q(skipping 6 expansions in backtrace; use -fmacro-backtrace-limit=0 to see all)T
_<scratch space>D:E128C:L1A:R Enote: _expanded from hereR
E V128E | RQSTE_DD_EOCRLDAERREI_NRGE_VHEERLSPEEDR__OPRADRETRIIANLG
_ H| E^L
P/usr/local/include/qt6/QtCore/qcomparehelpers.hE:R248_:P5A:R Tnote: Iexpanded from macro 'QT_DECLARE_REVERSED_ORDERING_HELPER_PARTIAL'A
L
248| | ^
/usr/local/include/qt6/QtCore/qcomparehelpers.h : 248Q:T5_:D Enote: Cexpanded from macro 'QT_DECLARE_REVERSED_ORDERING_HELPER_PARTIAL'L
AR E248_ | R E V E RQSTE_DD_EOCRLDAERREI_NRGE_VHEERLSPEEDR__OTREDMEPRLIANTGE_(HQEtL:P:EpRa_rTtEiMaPlL_AoTrEd(eQrti:n:gp,a rLteifatlT_yopred,e rRiinggh,t TLyepfet,T yCpoen,s tReixgphrt)T
y p| e ^,
C/usr/local/include/qt6/QtCore/qcomparehelpers.ho:n238s:t42e:x pnote: rexpanded from macro 'QT_DECLARE_REVERSED_ORDERING_HELPER_TEMPLATE')
| 238 ^ |
/usr/local/include/qt6/QtCore/qcomparehelpers.h : 235 :{42 :r enote: texpanded from macro 'QT_DECLARE_REVERSED_ORDERING_HELPER_TEMPLATE'u
r n235 | c o m p a{r erTehtruerenW acyo(mrphasr,e Tlhhrse)e W<a y0(;r h}s ,\
l h| s ^)
> 0; } \
| ^
In file included from In file included from Source/dooble_application.ccSource/dooble_aes256.cc::2834:
:
In file included from In file included from /usr/local/include/qt6/QtCore/QDir/usr/local/include/qt6/QtCore/QIODevice::11:
:
In file included from In file included from /usr/local/include/qt6/QtCore/qdir.h/usr/local/include/qt6/QtCore/qiodevice.h::810:
:
In file included from In file included from /usr/local/include/qt6/QtCore/qfile.h/usr/local/include/qt6/QtCore/qobject.h::818:
:
In file included from In file included from /usr/local/include/qt6/QtCore/qfiledevice.h/usr/local/include/qt6/QtCore/qmetatype.h::714:
:
In file included from /usr/local/include/qt6/QtCore/qfloat16.h/usr/local/include/qt6/QtCore/qiodevice.h::23510::
5In file included from :/usr/local/include/qt6/QtCore/qobject.h :error: 18zero as null pointer constant [-Werror,-Wzero-as-null-pointer-constant]:
In file included from /usr/local/include/qt6/QtCore/qmetatype.h/usr/local/include/qt6/QtCore/qfloat16.h::14232:
:/usr/local/include/qt6/QtCore/qfloat16.h5::235 :note: 5expanded from macro 'QF16_MAKE_ORDER_OP_FP':
error: zero as null pointer constant [-Werror,-Wzero-as-null-pointer-constant]232
| /usr/local/include/qt6/QtCore/qfloat16.h : 232 :Q5F:1 6note: _expanded from macro 'QF16_MAKE_ORDER_OP_FP'P
A R232T | I A L L YQ_FO1R6D_EPRAERDT(IqAfLlLoYa_tO1R6D,E RFEPD)(
q f| l ^o
a/usr/local/include/qt6/QtCore/qfloat16.ht:12166:,34 :F Pnote: )expanded from macro 'QF16_PARTIALLY_ORDERED'
| ^216
| /usr/local/include/qt6/QtCore/qfloat16.h#: 216 :d34e:f inote: nexpanded from macro 'QF16_PARTIALLY_ORDERED'e
Q216F | 1#6 _ PdAeRfTiInAeL LQYF_1O6R_DPEARRETDI AQL_LDYE_COLRADREER_EPDA RQT_IDAELCLLYA_ROER_DPEARRETDI
A L| L ^Y
_O/usr/local/include/qt6/QtCore/qcomparehelpers.hR:D295E:R5E:D
note: expanded from macro 'Q_DECLARE_PARTIALLY_ORDERED'|
^
/usr/local/include/qt6/QtCore/qcomparehelpers.h295: | 295 : 5 : Qnote: Texpanded from macro 'Q_DECLARE_PARTIALLY_ORDERED'_
O V295E | R L O A DQETD__OMVAECRRLOO(AQDTE_DD_EMCALCARROE(_QPTA_RDTEICALLALRYE__OPRADRETRIEADL,L Y___OVRAD_EARREGDS,_ __)_
V A| _ ^A
Rnote: G(skipping 6 expansions in backtrace; use -fmacro-backtrace-limit=0 to see all)S
_<scratch space>_:)38
: 1| : ^
note: note: expanded from here(skipping 6 expansions in backtrace; use -fmacro-backtrace-limit=0 to see all)
<scratch space>38: | 128Q:T1_:D Enote: Cexpanded from hereL
A R128E | _QRTE_VDEERCSLEADR_EO_RRDEEVREIRNSGE_DH_EOLRPDEERR_IPNAGR_THIEALLP
E R| _^P
AR/usr/local/include/qt6/QtCore/qcomparehelpers.hT:I248A:L5
: | note: ^expanded from macro 'QT_DECLARE_REVERSED_ORDERING_HELPER_PARTIAL'
/usr/local/include/qt6/QtCore/qcomparehelpers.h: 248248: | 5 : note: expanded from macro 'QT_DECLARE_REVERSED_ORDERING_HELPER_PARTIAL'Q
T_ D248E | C L A R EQ_TR_EDVEECRLSAERDE__ORREDVEERRISNEGD__HOERLDPEERRI_NTGE_MHPELLAPTEER(_QTtE:M:PpLaArTtEi(aQlt_:o:rpdaerrtiinagl,_ oLredfetrTiynpge,, LReifgthTtyTpyep,e ,R iCgohntsTtyepxep,r )C
o n| s ^t
ex/usr/local/include/qt6/QtCore/qcomparehelpers.hp:r241):
43 :| ^note:
expanded from macro 'QT_DECLARE_REVERSED_ORDERING_HELPER_TEMPLATE'/usr/local/include/qt6/QtCore/qcomparehelpers.h
:238 :24142 | : note: expanded from macro 'QT_DECLARE_REVERSED_ORDERING_HELPER_TEMPLATE'
{ 238r | e t u r n{ croemtpuarrne TchormepeaWraeyT(hrrhese,W alyh(sr)h s>,= l0h;s )} <\
0 ;| ^}
\
| ^
fatal error: too many errors emitted, stopping now [-ferror-limit=]
In file included from Source/dooble_application.cc:28:
In file included from /usr/local/include/qt6/QtCore/QDir:1:
In file included from /usr/local/include/qt6/QtCore/qdir.h:8:
In file included from /usr/local/include/qt6/QtCore/qfile.h:8:
In file included from /usr/local/include/qt6/QtCore/qfiledevice.h:7:
In file included from /usr/local/include/qt6/QtCore/qiodevice.h:10:
In file included from /usr/local/include/qt6/QtCore/qobject.h:18:
In file included from /usr/local/include/qt6/QtCore/qmetatype.h:14:
/usr/local/include/qt6/QtCore/qfloat16.h:235:5: error: zero as null pointer constant [-Werror,-Wzero-as-null-pointer-constant]
/usr/local/include/qt6/QtCore/qfloat16.h:232:5: note: expanded from macro 'QF16_MAKE_ORDER_OP_FP'
232 | QF16_PARTIALLY_ORDERED(qfloat16, FP)
| ^
/usr/local/include/qt6/QtCore/qfloat16.h:216:34: note: expanded from macro 'QF16_PARTIALLY_ORDERED'
216 | # define QF16_PARTIALLY_ORDERED Q_DECLARE_PARTIALLY_ORDERED
| ^
/usr/local/include/qt6/QtCore/qcomparehelpers.h:295:5: note: expanded from macro 'Q_DECLARE_PARTIALLY_ORDERED'
295 | QT_OVERLOADED_MACRO(QT_DECLARE_PARTIALLY_ORDERED, __VA_ARGS__)
| ^
note: (skipping 6 expansions in backtrace; use -fmacro-backtrace-limit=0 to see all)
<scratch space>:128:1: note: expanded from here
128 | QT_DECLARE_REVERSED_ORDERING_HELPER_PARTIAL
| ^
/usr/local/include/qt6/QtCore/qcomparehelpers.h:248:5: note: expanded from macro 'QT_DECLARE_REVERSED_ORDERING_HELPER_PARTIAL'
248 | QT_DECLARE_REVERSED_ORDERING_HELPER_TEMPLATE(Qt::partial_ordering, LeftType, RightType, Constexpr)
| ^
/usr/local/include/qt6/QtCore/qcomparehelpers.h:241:43: note: expanded from macro 'QT_DECLARE_REVERSED_ORDERING_HELPER_TEMPLATE'
241 | { return compareThreeWay(rhs, lhs) >= 0; } \
| ^
fatal error: too many errors emitted, stopping now [-ferror-limit=]
20 errors generated.
gmake: *** [Makefile:15891: temp/obj/dooble_aes256.o] Error 1
gmake: *** Waiting for unfinished jobs....
20 errors generated.
gmake: *** [Makefile:15762: temp/obj/dooble_address_widget_completer_popup.o] Error 1
20 errors generated.
gmake: *** [Makefile:16155: temp/obj/dooble_application.o] Error 1
===> Compilation failed unexpectedly.
Try to set MAKE_JOBS_UNSAFE=yes and rebuild before reporting the failure to
the maintainer.
*** Error code 1
Stop.
make: stopped making "build" in /usr/ports/www/dooble