[package - main-i386-default][security/veracrypt] Failed for veracrypt-1.26.7_1 in build

From: <pkg-fallout_at_FreeBSD.org>
Date: Thu, 12 Oct 2023 17:38:17 UTC
You are receiving this mail as a port that you maintain
is failing to build on the FreeBSD package build server.
Please investigate the failure and submit a PR to fix
build.

Maintainer:     acm@FreeBSD.org
Log URL:        https://pkg-status.freebsd.org/beefy17/data/main-i386-default/pf36f3675dc48_sbb679b0c49/logs/veracrypt-1.26.7_1.log
Build URL:      https://pkg-status.freebsd.org/beefy17/build.html?mastername=main-i386-default&build=pf36f3675dc48_sbb679b0c49
Log:

=>> Building security/veracrypt
build started at Thu Oct 12 17:36:57 UTC 2023
port directory: /usr/ports/security/veracrypt
package name: veracrypt-1.26.7_1
building for: FreeBSD main-i386-default-job-06 15.0-CURRENT FreeBSD 15.0-CURRENT 1500001 i386
maintained by: acm@FreeBSD.org
Makefile ident: 
Poudriere version: 3.2.8-23-ga7f8d188
Host OSVERSION: 1500000
Jail OSVERSION: 1500001
Job Id: 06




!!! Jail is newer than host. (Jail: 1500001, Host: 1500000) !!!
!!! This is not supported. !!!
!!! Host kernel must be same or newer than jail. !!!
!!! Expect build failures. !!!



---Begin Environment---
SHELL=/bin/sh
UNAME_p=i386
UNAME_m=i386
OSVERSION=1500001
UNAME_v=FreeBSD 15.0-CURRENT 1500001
UNAME_r=15.0-CURRENT
BLOCKSIZE=K
MAIL=/var/mail/root
MM_CHARSET=UTF-8
LANG=C.UTF-8
STATUS=1
HOME=/root
PATH=/sbin:/bin:/usr/sbin:/usr/bin:/usr/local/sbin:/usr/local/bin:/root/bin
LOCALBASE=/usr/local
USER=root
LIBEXECPREFIX=/usr/local/libexec/poudriere
POUDRIERE_VERSION=3.2.8-23-ga7f8d188
MASTERMNT=/usr/local/poudriere/data/.m/main-i386-default/ref
POUDRIERE_BUILD_TYPE=bulk
PACKAGE_BUILDING=yes
SAVED_TERM=
PWD=/usr/local/poudriere/data/.m/main-i386-default/ref/.p/pool
P_PORTS_FEATURES=FLAVORS SELECTED_OPTIONS
MASTERNAME=main-i386-default
SCRIPTPREFIX=/usr/local/share/poudriere
OLDPWD=/usr/local/poudriere/data/.m/main-i386-default/ref/.p
SCRIPTPATH=/usr/local/share/poudriere/bulk.sh
POUDRIEREPATH=/usr/local/bin/poudriere
---End Environment---

---Begin Poudriere Port Flags/Env---
PORT_FLAGS=
PKGENV=
FLAVOR=
DEPENDS_ARGS=
MAKE_ARGS=
---End Poudriere Port Flags/Env---

---Begin OPTIONS List---
===> The following configuration options are available for veracrypt-1.26.7_1:
     DOCS=on: Build and/or install documentation
===> Use 'make config' to modify these settings
---End OPTIONS List---

--MAINTAINER--
acm@FreeBSD.org
--End MAINTAINER--

--CONFIGURE_ARGS--

--End CONFIGURE_ARGS--

--CONFIGURE_ENV--
MAKE=gmake PKG_CONFIG=pkgconf XDG_DATA_HOME=/wrkdirs/usr/ports/security/veracrypt/work  XDG_CONFIG_HOME=/wrkdirs/usr/ports/security/veracrypt/work  XDG_CACHE_HOME=/wrkdirs/usr/ports/security/veracrypt/work/.cache  HOME=/wrkdirs/usr/ports/security/veracrypt/work TMPDIR="/tmp" PATH=/wrkdirs/usr/ports/security/veracrypt/work/.bin:/sbin:/bin:/usr/sbin:/usr/bin:/usr/local/sbin:/usr/local/bin:/root/bin PKG_CONFIG_LIBDIR=/wrkdirs/usr/ports/security/veracrypt/work/.pkgconfig:/usr/local/libdata/pkgconfig:/usr/local/share/pkgconfig:/usr/libdata/pkgconfig SHELL=/bin/sh CONFIG_SHELL=/bin/sh WX_CONFIG=/usr/local/bin/wxgtk3u-3.0-config
--End CONFIGURE_ENV--

--MAKE_ENV--
LFLAGS=-Wl,-z,notext XDG_DATA_HOME=/wrkdirs/usr/ports/security/veracrypt/work  XDG_CONFIG_HOME=/wrkdirs/usr/ports/security/veracrypt/work  XDG_CACHE_HOME=/wrkdirs/usr/ports/security/veracrypt/work/.cache  HOME=/wrkdirs/usr/ports/security/veracrypt/work TMPDIR="/tmp" PATH=/wrkdirs/usr/ports/security/veracrypt/work/.bin:/sbin:/bin:/usr/sbin:/usr/bin:/usr/local/sbin:/usr/local/bin:/root/bin PKG_CONFIG_LIBDIR=/wrkdirs/usr/ports/security/veracrypt/work/.pkgconfig:/usr/local/libdata/pkgconfig:/usr/local/share/pkgconfig:/usr/libdata/pkgconfig MK_DEBUG_FILES=no MK_KERNEL_SYMBOLS=no SHELL=/bin/sh NO_LINT=YES WX_CONFIG=/usr/local/bin/wxgtk3u-3.0-config PREFIX=/usr/local  LOCALBASE=/usr/local  CC="cc" CFLAGS="-O2 -pipe  -DLIBICONV_PLUG -fstack-protector-strong -fno-strict-aliasing "  CPP="cpp" CPPFLAGS="-DLIBICONV_PLUG"  LDFLAGS=" -fstack-protector-strong " LIBS=""  CXX="c++" CXXFLAGS="-O2 -pipe  -DLIBICONV_PLUG -fstack-protector-strong -fno-strict-aliasing   -DLIBICONV_PLUG -std=c++11
 "  MANPREFIX="/usr/local" BSD_INSTALL_PROGRAM="install  -s -m 555"  BSD_INSTALL_LIB="install  -s -m 0644"  BSD_INSTALL_SCRIPT="install  -m 555"  BSD_INSTALL_DATA="install  -m 0644"  BSD_INSTALL_MAN="install  -m 444"
--End MAKE_ENV--

--PLIST_SUB--
PORTDOCS="" OSREL=15.0 PREFIX=%D LOCALBASE=/usr/local  RESETPREFIX=/usr/local LIB32DIR=lib DOCSDIR="share/doc/veracrypt"  EXAMPLESDIR="share/examples/veracrypt"  DATADIR="share/veracrypt"  WWWDIR="www/veracrypt"  ETCDIR="etc/veracrypt"
--End PLIST_SUB--

--SUB_LIST--
PREFIX=/usr/local LOCALBASE=/usr/local  DATADIR=/usr/local/share/veracrypt DOCSDIR=/usr/local/share/doc/veracrypt EXAMPLESDIR=/usr/local/share/examples/veracrypt  WWWDIR=/usr/local/www/veracrypt ETCDIR=/usr/local/etc/veracrypt
--End SUB_LIST--

---Begin make.conf---
USE_PACKAGE_DEPENDS=yes
BATCH=yes
WRKDIRPREFIX=/wrkdirs
PORTSDIR=/usr/ports
PACKAGES=/packages
DISTDIR=/distfiles
PACKAGE_BUILDING=yes
PACKAGE_BUILDING_FLAVORS=yes
MACHINE=i386
MACHINE_ARCH=i386
ARCH=${MACHINE_ARCH}
#### /usr/local/etc/poudriere.d/make.conf ####
# XXX: We really need this but cannot use it while 'make checksum' does not
# try the next mirror on checksum failure.  It currently retries the same
# failed mirror and then fails rather then trying another.  It *does*
# try the next if the size is mismatched though.
#MASTER_SITE_FREEBSD=yes
# Build ALLOW_MAKE_JOBS_PACKAGES with 2 jobs
MAKE_JOBS_NUMBER=3
#### /usr/ports/Mk/Scripts/ports_env.sh ####
_CCVERSION_921dbbb2=FreeBSD clang version 16.0.6 (https://github.com/llvm/llvm-project.git llvmorg-16.0.6-0-g7cbf1a259152) Target: i386-unknown-freebsd15.0 Thread model: posix InstalledDir: /usr/bin
_ALTCCVERSION_921dbbb2=none
_CXXINTERNAL_acaad9ca=FreeBSD clang version 16.0.6 (https://github.com/llvm/llvm-project.git llvmorg-16.0.6-0-g7cbf1a259152) Target: i386-unknown-freebsd15.0 Thread model: posix InstalledDir: /usr/bin "/usr/bin/ld" "--eh-frame-hdr" "-dynamic-linker" "/libexec/ld-elf.so.1" "--hash-style=both" "--enable-new-dtags" "-m" "elf_i386_fbsd" "-o" "a.out" "/usr/lib/crt1.o" "/usr/lib/crti.o" "/usr/lib/crtbegin.o" "-L/usr/lib" "/dev/null" "-lc++" "-lm" "-lgcc" "--as-needed" "-lgcc_s" "--no-as-needed" "-lc" "-lgcc" "--as-needed" "-lgcc_s" "--no-as-needed" "/usr/lib/crtend.o" "/usr/lib/crtn.o"
CC_OUTPUT_921dbbb2_58173849=yes
CC_OUTPUT_921dbbb2_9bdba57c=yes
CC_OUTPUT_921dbbb2_6a4fe7f5=yes
CC_OUTPUT_921dbbb2_6bcac02b=yes
CC_OUTPUT_921dbbb2_67d20829=yes
CC_OUTPUT_921dbbb2_bfa62e83=yes
CC_OUTPUT_921dbbb2_f0b4d593=yes
CC_OUTPUT_921dbbb2_308abb44=yes
CC_OUTPUT_921dbbb2_f00456e5=yes
CC_OUTPUT_921dbbb2_65ad290d=yes
CC_OUTPUT_921dbbb2_f2776b26=yes
CC_OUTPUT_921dbbb2_53255a77=yes
CC_OUTPUT_921dbbb2_911cfe02=yes
CC_OUTPUT_921dbbb2_b2657cc3=yes
CC_OUTPUT_921dbbb2_380987f7=yes
CC_OUTPUT_921dbbb2_160933ec=yes
CC_OUTPUT_921dbbb2_fb62803b=yes
CC_OUTPUT_921dbbb2_af59ad06=yes
CC_OUTPUT_921dbbb2_a15f3fcf=yes
_OBJC_CCVERSION_921dbbb2=FreeBSD clang version 16.0.6 (https://github.com/llvm/llvm-project.git llvmorg-16.0.6-0-g7cbf1a259152) Target: i386-unknown-freebsd15.0 Thread model: posix InstalledDir: /usr/bin
_OBJC_ALTCCVERSION_921dbbb2=none
ARCH=i386
OPSYS=FreeBSD
_OSRELEASE=15.0-CURRENT
OSREL=15.0
OSVERSION=1500001
PYTHONBASE=/usr/local
CONFIGURE_MAX_CMD_LEN=524288
HAVE_PORTS_ENV=1
#### Misc Poudriere ####
GID=0
UID=0
---End make.conf---
--Resource limits--
cpu time               (seconds, -t)  unlimited
file size           (512-blocks, -f)  unlimited
data seg size           (kbytes, -d)  524288
stack size              (kbytes, -s)  65536
core file size      (512-blocks, -c)  unlimited
max memory size         (kbytes, -m)  unlimited
locked memory           (kbytes, -l)  unlimited
max user processes              (-u)  89999
open files                      (-n)  1024
virtual mem size        (kbytes, -v)  unlimited
swap limit              (kbytes, -w)  unlimited
socket buffer size       (bytes, -b)  unlimited
pseudo-terminals                (-p)  unlimited
kqueues                         (-k)  unlimited
umtx shared locks               (-o)  unlimited
--End resource limits--
=======================<phase: check-sanity   >============================
===========================================================================
=======================<phase: pkg-depends    >============================
===>   veracrypt-1.26.7_1 depends on file: /usr/local/sbin/pkg - not found
===>   Installing existing package /packages/All/pkg-1.20.8.pkg
[main-i386-default-job-06] Installing pkg-1.20.8...
[main-i386-default-job-06] Extracting pkg-1.20.8: .......... done
===>   veracrypt-1.26.7_1 depends on file: /usr/local/sbin/pkg - found
===>   Returning to build of veracrypt-1.26.7_1
===========================================================================
=======================<phase: fetch-depends  >============================
===========================================================================
=======================<phase: fetch          >============================
===> Fetching all distfiles required by veracrypt-1.26.7_1 for building
===========================================================================
=======================<phase: checksum       >============================
===> Fetching all distfiles required by veracrypt-1.26.7_1 for building
=> SHA256 Checksum OK for VeraCrypt_1.26.7_Source.tar.bz2.
===========================================================================
=======================<phase: extract-depends>============================
===========================================================================
=======================<phase: extract        >============================
===> Fetching all distfiles required by veracrypt-1.26.7_1 for building
===>  Extracting for veracrypt-1.26.7_1
=> SHA256 Checksum OK for VeraCrypt_1.26.7_Source.tar.bz2.
===========================================================================
=======================<phase: patch-depends  >============================
===========================================================================
=======================<phase: patch          >============================
===>  Patching for veracrypt-1.26.7_1
===>  Applying FreeBSD patches for veracrypt-1.26.7_1 from /usr/ports/security/veracrypt/files
/usr/bin/sed -i.bak -e 's|wx-config|/usr/local/bin/wxgtk3u-3.0-config|g' /wrkdirs/usr/ports/security/veracrypt/work/veracrypt-1.26.7_1/src/Makefile
/usr/bin/sed -i.bak -e 's|/usr/bin|/usr/local/bin|g' -e  's|Icon=veracrypt|Icon=VeraCrypt-16x16|g' /wrkdirs/usr/ports/security/veracrypt/work/veracrypt-1.26.7_1/src/Setup/FreeBSD/veracrypt.desktop
===========================================================================
<snip>

--
Wayland requires XDG_RUNTIME_DIR to be defined to a path that will
contain "wayland-%d" unix(4) sockets. This is usually handled by
consolekit2 (via ck-launch-session) or pam_xdg (via login).
=====
Message from libxkbcommon-1.5.0:

--
If arrow keys don't work under X11 switch to legacy rules e.g.,

For sh/bash/ksh/zsh run and (optionally) add into ~/.profile:
  export XKB_DEFAULT_RULES=xorg

For csh/tcsh run and (optionally) add into ~/.login:
  setenv XKB_DEFAULT_RULES xorg
=====
Message from libsoup-2.74.3:

--
libsoup can use NTLM authentication if it is compiled
with the SMB option. To use it, you must install a
port that provides NTLM, like net/samba412 or net/samba413.
===>   veracrypt-1.26.7_1 depends on shared library: libwx_baseu-3.0.so - found (/usr/local/lib/libwx_baseu-3.0.so)
===>   Returning to build of veracrypt-1.26.7_1
===========================================================================
=======================<phase: configure      >============================
===>  Configuring for veracrypt-1.26.7_1
===========================================================================
=======================<phase: build          >============================
===>  Building for veracrypt-1.26.7_1
gmake[1]: Entering directory '/wrkdirs/usr/ports/security/veracrypt/work/veracrypt-1.26.7_1/src'
gmake[2]: Entering directory '/wrkdirs/usr/ports/security/veracrypt/work/veracrypt-1.26.7_1/src/Platform'
Compiling Buffer.cpp
Compiling Exception.cpp
Compiling Event.cpp
Compiling FileCommon.cpp
Compiling MemoryStream.cpp
Compiling Memory.cpp
Compiling PlatformTest.cpp
Compiling Serializable.cpp
PlatformTest.cpp:283:4: warning: expression result unused [-Wunused-value]
                        dynamic_cast <RttiTest &> (rttiBaseRef);
                        ^~~~~~~~~~~~~~~~~~~~~~~~~~~~~~~~~~~~~~~
Compiling Serializer.cpp
Compiling SerializerFactory.cpp
Compiling StringConverter.cpp
Compiling TextReader.cpp
1 warning generated.
Compiling Directory.cpp
Compiling File.cpp
Compiling FilesystemPath.cpp
Compiling Mutex.cpp
Compiling Pipe.cpp
Compiling Poller.cpp
Compiling Process.cpp
Compiling SyncEvent.cpp
Compiling SystemException.cpp
Compiling SystemInfo.cpp
Compiling SystemLog.cpp
Compiling Thread.cpp
Compiling Time.cpp
Updating library Platform.a
gmake[2]: Leaving directory '/wrkdirs/usr/ports/security/veracrypt/work/veracrypt-1.26.7_1/src/Platform'
gmake[2]: Entering directory '/wrkdirs/usr/ports/security/veracrypt/work/veracrypt-1.26.7_1/src/Volume'
Compiling Cipher.cpp
Compiling EncryptionAlgorithm.cpp
Compiling EncryptionMode.cpp
Compiling EncryptionModeXTS.cpp
Compiling EncryptionTest.cpp
Compiling EncryptionThreadPool.cpp
Compiling Hash.cpp
Compiling Keyfile.cpp
Compiling Pkcs5Kdf.cpp
Compiling Volume.cpp
Pkcs5Kdf.cpp:46:16: warning: expression with side effects will be evaluated despite being used as an operand to 'typeid' [-Wpotentially-evaluated-expression]
                        if (typeid (*kdf->GetHash()) == typeid (hash))
                                    ^
Volume.cpp:126:39: warning: expression with side effects will be evaluated despite being used as an operand to 'typeid' [-Wpotentially-evaluated-expression]
                                if (skipLayoutV1Normal && typeid (*layout) == typeid (VolumeLayoutV1Normal))
                                                                  ^
Volume.cpp:177:17: warning: expression with side effects will be evaluated despite being used as an operand to 'typeid' [-Wpotentially-evaluated-expression]
                                if (typeid (*layout) == typeid (VolumeLayoutV2Normal))
                                            ^
Volume.cpp:192:18: warning: expression with side effects will be evaluated despite being used as an operand to 'typeid' [-Wpotentially-evaluated-expression]
                                        if (typeid (*layout) == typeid (VolumeLayoutV2Normal) && header->GetRequiredMinProgramVersion() < 0x10b)
                                                    ^
Compiling VolumeException.cpp
1 warning generated.
Compiling VolumeHeader.cpp
3 warnings generated.
Compiling VolumeInfo.cpp
VolumeHeader.cpp:103:17: warning: expression with side effects will be evaluated despite being used as an operand to 'typeid' [-Wpotentially-evaluated-expression]
                                if (typeid (*mode) != typeid (EncryptionModeXTS))
                                            ^
VolumeHeader.cpp:111:18: warning: expression with side effects will be evaluated despite being used as an operand to 'typeid' [-Wpotentially-evaluated-expression]
                                        if (typeid (*mode) == typeid (EncryptionModeXTS))
                                                    ^
VolumeHeader.cpp:209:15: warning: expression with side effects will be evaluated despite being used as an operand to 'typeid' [-Wpotentially-evaluated-expression]
                if (typeid (*mode) == typeid (EncryptionModeXTS))
                            ^
VolumeHeader.cpp:253:15: warning: expression with side effects will be evaluated despite being used as an operand to 'typeid' [-Wpotentially-evaluated-expression]
                if (typeid (*mode) == typeid (EncryptionModeXTS))
                            ^
Compiling VolumeLayout.cpp
4 warnings generated.
Compiling VolumePassword.cpp
Compiling VolumePasswordCache.cpp
Assembling Aes_x86.asm
Assembling Aes_hw_cpu.asm
Compiling sha256-x86-nayuki.S
Compiling sha512-x86-nayuki.S
Compiling Aeskey.c
Compiling Aestab.c
Compiling cpu.c
Compiling blake2s.c
Compiling blake2s_SSE2.c
Compiling SerpentFast.c
Compiling SerpentFast_simd.cpp
Compiling Sha2.c
Compiling Twofish.c
Compiling Whirlpool.c
Compiling Camellia.c
Compiling Streebog.c
../Crypto/Streebog.c:1895:19: warning: unused function '_mm_set_epi64x_a' [-Wunused-function]
VC_INLINE __m128i _mm_set_epi64x_a(uint64 i0, uint64 i1) {
                  ^
Compiling kuznyechik.c
Compiling kuznyechik_simd.c
Compiling CommandAPDU.cpp
1 warning generated.
Compiling PCSCException.cpp
Compiling ResponseAPDU.cpp
../Common/PCSCException.cpp:143:6: error: no matching member function for call to 'Deserialize'
                sr.Deserialize("ErrorCode", ErrorCode);
                ~~~^~~~~~~~~~~
/wrkdirs/usr/ports/security/veracrypt/work/veracrypt-1.26.7_1/src/Platform/Serializer.h:29:8: note: candidate function not viable: no known conversion from 'LONG' (aka 'long') to 'bool &' for 2nd argument
                void Deserialize (const string &name, bool &data);
                     ^
/wrkdirs/usr/ports/security/veracrypt/work/veracrypt-1.26.7_1/src/Platform/Serializer.h:30:8: note: candidate function not viable: no known conversion from 'LONG' (aka 'long') to 'byte &' (aka 'unsigned char &') for 2nd argument
                void Deserialize (const string &name, byte &data);
                     ^
/wrkdirs/usr/ports/security/veracrypt/work/veracrypt-1.26.7_1/src/Platform/Serializer.h:31:8: note: candidate function not viable: no known conversion from 'LONG' (aka 'long') to 'int32 &' (aka 'int &') for 2nd argument
                void Deserialize (const string &name, int32 &data);
                     ^
/wrkdirs/usr/ports/security/veracrypt/work/veracrypt-1.26.7_1/src/Platform/Serializer.h:32:8: note: candidate function not viable: no known conversion from 'LONG' (aka 'long') to 'int64 &' (aka 'long long &') for 2nd argument
                void Deserialize (const string &name, int64 &data);
                     ^
/wrkdirs/usr/ports/security/veracrypt/work/veracrypt-1.26.7_1/src/Platform/Serializer.h:33:8: note: candidate function not viable: no known conversion from 'LONG' (aka 'long') to 'uint32 &' (aka 'unsigned int &') for 2nd argument
                void Deserialize (const string &name, uint32 &data);
                     ^
/wrkdirs/usr/ports/security/veracrypt/work/veracrypt-1.26.7_1/src/Platform/Serializer.h:34:8: note: candidate function not viable: no known conversion from 'LONG' (aka 'long') to 'uint64 &' (aka 'unsigned long long &') for 2nd argument
                void Deserialize (const string &name, uint64 &data);
                     ^
/wrkdirs/usr/ports/security/veracrypt/work/veracrypt-1.26.7_1/src/Platform/Serializer.h:35:8: note: candidate function not viable: no known conversion from 'LONG' (aka 'long') to 'string &' (aka 'basic_string<char> &') for 2nd argument
                void Deserialize (const string &name, string &data);
                     ^
/wrkdirs/usr/ports/security/veracrypt/work/veracrypt-1.26.7_1/src/Platform/Serializer.h:36:8: note: candidate function not viable: no known conversion from 'LONG' (aka 'long') to 'wstring &' (aka 'basic_string<wchar_t> &') for 2nd argument
                void Deserialize (const string &name, wstring &data);
                     ^
/wrkdirs/usr/ports/security/veracrypt/work/veracrypt-1.26.7_1/src/Platform/Serializer.h:37:8: note: candidate function not viable: no known conversion from 'LONG' (aka 'long') to 'const BufferPtr' for 2nd argument
                void Deserialize (const string &name, const BufferPtr &data);
                     ^
/wrkdirs/usr/ports/security/veracrypt/work/veracrypt-1.26.7_1/src/Platform/Serializer.h:62:27: note: candidate function template not viable: requires 0 arguments, but 2 were provided
                template <typename T> T Deserialize ();
                                        ^
../Common/PCSCException.cpp:150:6: error: call to member function 'Serialize' is ambiguous
                sr.Serialize("ErrorCode", ErrorCode);
                ~~~^~~~~~~~~
/wrkdirs/usr/ports/security/veracrypt/work/veracrypt-1.26.7_1/src/Platform/Serializer.h:47:8: note: candidate function
                void Serialize (const string &name, bool data);
                     ^
/wrkdirs/usr/ports/security/veracrypt/work/veracrypt-1.26.7_1/src/Platform/Serializer.h:48:8: note: candidate function
                void Serialize (const string &name, byte data);
                     ^
/wrkdirs/usr/ports/security/veracrypt/work/veracrypt-1.26.7_1/src/Platform/Serializer.h:50:8: note: candidate function
                void Serialize (const string &name, int32 data);
                     ^
/wrkdirs/usr/ports/security/veracrypt/work/veracrypt-1.26.7_1/src/Platform/Serializer.h:51:8: note: candidate function
                void Serialize (const string &name, int64 data);
                     ^
/wrkdirs/usr/ports/security/veracrypt/work/veracrypt-1.26.7_1/src/Platform/Serializer.h:52:8: note: candidate function
                void Serialize (const string &name, uint32 data);
                     ^
/wrkdirs/usr/ports/security/veracrypt/work/veracrypt-1.26.7_1/src/Platform/Serializer.h:53:8: note: candidate function
                void Serialize (const string &name, uint64 data);
                     ^
2 errors generated.
gmake[2]: *** [/wrkdirs/usr/ports/security/veracrypt/work/veracrypt-1.26.7_1/src/Build/Include/Makefile.inc:37: ../Common/PCSCException.o] Error 1
gmake[2]: *** Waiting for unfinished jobs....
gmake[2]: Leaving directory '/wrkdirs/usr/ports/security/veracrypt/work/veracrypt-1.26.7_1/src/Volume'
gmake[1]: *** [Makefile:520: all] Error 2
gmake[1]: Leaving directory '/wrkdirs/usr/ports/security/veracrypt/work/veracrypt-1.26.7_1/src'
===> Compilation failed unexpectedly.
Try to set MAKE_JOBS_UNSAFE=yes and rebuild before reporting the failure to
the maintainer.
*** Error code 1

Stop.
make: stopped in /usr/ports/security/veracrypt