[package - 132powerpc-quarterly][astro/oskar] Failed for OSKAR-2.8.3_4 in build
- Go to: [ bottom of page ] [ top of archives ] [ this month ]
Date: Sun, 01 Oct 2023 03:49:56 UTC
You are receiving this mail as a port that you maintain
is failing to build on the FreeBSD package build server.
Please investigate the failure and submit a PR to fix
build.
Maintainer: yuri@FreeBSD.org
Log URL: https://pkg-status.freebsd.org/foul1/data/132powerpc-quarterly/2c7f524325a4/logs/OSKAR-2.8.3_4.log
Build URL: https://pkg-status.freebsd.org/foul1/build.html?mastername=132powerpc-quarterly&build=2c7f524325a4
Log:
=>> Building astro/oskar
build started at Sun Oct 1 03:48:08 UTC 2023
port directory: /usr/ports/astro/oskar
package name: OSKAR-2.8.3_4
building for: FreeBSD 132powerpc-quarterly-job-04 13.2-RELEASE FreeBSD 13.2-RELEASE powerpc
maintained by: yuri@FreeBSD.org
Makefile ident:
Poudriere version: 3.2.8-23-ga7f8d188
Host OSVERSION: 1500000
Jail OSVERSION: 1302001
Job Id: 04
---Begin Environment---
SHELL=/bin/csh
UNAME_p=powerpc
UNAME_m=powerpc
OSVERSION=1302001
UNAME_v=FreeBSD 13.2-RELEASE
UNAME_r=13.2-RELEASE
BLOCKSIZE=K
MAIL=/var/mail/root
MM_CHARSET=UTF-8
LANG=C.UTF-8
STATUS=1
HOME=/root
PATH=/sbin:/bin:/usr/sbin:/usr/bin:/usr/local/sbin:/usr/local/bin:/root/bin
LOCALBASE=/usr/local
USER=root
LIBEXECPREFIX=/usr/local/libexec/poudriere
POUDRIERE_VERSION=3.2.8-23-ga7f8d188
MASTERMNT=/usr/local/poudriere/data/.m/132powerpc-quarterly/ref
POUDRIERE_BUILD_TYPE=bulk
PACKAGE_BUILDING=yes
SAVED_TERM=
PWD=/usr/local/poudriere/data/.m/132powerpc-quarterly/ref/.p/pool
P_PORTS_FEATURES=FLAVORS SELECTED_OPTIONS
MASTERNAME=132powerpc-quarterly
SCRIPTPREFIX=/usr/local/share/poudriere
OLDPWD=/usr/local/poudriere/data/.m/132powerpc-quarterly/ref/.p
SCRIPTPATH=/usr/local/share/poudriere/bulk.sh
POUDRIEREPATH=/usr/local/bin/poudriere
---End Environment---
---Begin Poudriere Port Flags/Env---
PORT_FLAGS=
PKGENV=
FLAVOR=
DEPENDS_ARGS=
MAKE_ARGS=
---End Poudriere Port Flags/Env---
---Begin OPTIONS List---
---End OPTIONS List---
--MAINTAINER--
yuri@FreeBSD.org
--End MAINTAINER--
--CONFIGURE_ARGS--
--End CONFIGURE_ARGS--
--CONFIGURE_ENV--
PYTHON="/usr/local/bin/python3.9" QT_SELECT=qt5 QMAKEMODULES="/wrkdirs/usr/ports/astro/oskar/work/OSKAR-2.8.3/mkspecs/modules:/usr/local/lib/qt5/mkspecs/modules" XDG_DATA_HOME=/wrkdirs/usr/ports/astro/oskar/work XDG_CONFIG_HOME=/wrkdirs/usr/ports/astro/oskar/work XDG_CACHE_HOME=/wrkdirs/usr/ports/astro/oskar/work/.cache HOME=/wrkdirs/usr/ports/astro/oskar/work TMPDIR="/tmp" PATH=/wrkdirs/usr/ports/astro/oskar/work/.bin:/sbin:/bin:/usr/sbin:/usr/bin:/usr/local/sbin:/usr/local/bin:/root/bin PKG_CONFIG_LIBDIR=/wrkdirs/usr/ports/astro/oskar/work/.pkgconfig:/usr/local/libdata/pkgconfig:/usr/local/share/pkgconfig:/usr/libdata/pkgconfig SHELL=/bin/sh CONFIG_SHELL=/bin/sh CMAKE_PREFIX_PATH="/usr/local"
--End CONFIGURE_ENV--
--MAKE_ENV--
NINJA_STATUS="[%p %s/%t] " QT_SELECT=qt5 QMAKEMODULES="/wrkdirs/usr/ports/astro/oskar/work/OSKAR-2.8.3/mkspecs/modules:/usr/local/lib/qt5/mkspecs/modules" XDG_DATA_HOME=/wrkdirs/usr/ports/astro/oskar/work XDG_CONFIG_HOME=/wrkdirs/usr/ports/astro/oskar/work XDG_CACHE_HOME=/wrkdirs/usr/ports/astro/oskar/work/.cache HOME=/wrkdirs/usr/ports/astro/oskar/work TMPDIR="/tmp" PATH=/wrkdirs/usr/ports/astro/oskar/work/.bin:/sbin:/bin:/usr/sbin:/usr/bin:/usr/local/sbin:/usr/local/bin:/root/bin PKG_CONFIG_LIBDIR=/wrkdirs/usr/ports/astro/oskar/work/.pkgconfig:/usr/local/libdata/pkgconfig:/usr/local/share/pkgconfig:/usr/libdata/pkgconfig MK_DEBUG_FILES=no MK_KERNEL_SYMBOLS=no SHELL=/bin/sh NO_LINT=YES ADDR2LINE="/usr/local/bin/addr2line" AR="/usr/local/bin/ar" AS="/usr/local/bin/as" CPPFILT="/usr/local/bin/c++filt" GPROF="/usr/local/bin/gprof" LD="/usr/local/bin/ld" NM="/usr/local/bin/nm" OBJCOPY="/usr/local/bin/objcopy" OBJDUMP="/usr/local/bin/objdump" RANLIB="/usr/local/bin/ranlib" READELF="/u
sr/local/bin/readelf" SIZE="/usr/local/bin/size" STRINGS="/usr/local/bin/strings" DESTDIR=/wrkdirs/usr/ports/astro/oskar/work/stage PREFIX=/usr/local LOCALBASE=/usr/local CC="gcc12" CFLAGS="-O2 -pipe -fstack-protector-strong -Wl,-rpath=/usr/local/lib/gcc12 -isystem /usr/local/include -fno-strict-aliasing " CPP="cpp12" CPPFLAGS="-isystem /usr/local/include" LDFLAGS=" -fstack-protector-strong -Wl,-rpath=/usr/local/lib/gcc12 -L/usr/local/lib/gcc12 -L/usr/local/lib " LIBS="" CXX="g++12" CXXFLAGS="-O2 -pipe -fstack-protector-strong -Wl,-rpath=/usr/local/lib/gcc12 -stdlib=libc++ -Wl,-rpath=/usr/local/lib/gcc12 -isystem /usr/local/include " MANPREFIX="/usr/local" BSD_INSTALL_PROGRAM="install -s -m 555" BSD_INSTALL_LIB="install -s -m 0644" BSD_INSTALL_SCRIPT="install -m 555" BSD_INSTALL_DATA="install -m 0644" BSD_INSTALL_MAN="install -m 444"
--End MAKE_ENV--
--PLIST_SUB--
CMAKE_BUILD_TYPE="release" PYTHON_INCLUDEDIR=include/python3.9 PYTHON_LIBDIR=lib/python3.9 PYTHON_PLATFORM=freebsd13 PYTHON_SITELIBDIR=lib/python3.9/site-packages PYTHON_SUFFIX=39 PYTHON_EXT_SUFFIX=.cpython-39 PYTHON_VER=3.9 PYTHON_VERSION=python3.9 PYTHON2="@comment " PYTHON3="" QT_BINDIR="lib/qt5/bin" QT_INCDIR="include/qt5" QT_LIBDIR="lib/qt5" QT_ARCHDIR="lib/qt5" QT_PLUGINDIR="lib/qt5/plugins" QT_LIBEXECDIR="libexec/qt5" QT_IMPORTDIR="lib/qt5/imports" QT_QMLDIR="lib/qt5/qml" QT_DATADIR="share/qt5" QT_DOCDIR="share/doc/qt5" QT_L10NDIR="share/qt5/translations" QT_EXAMPLEDIR="share/examples/qt5" QT_TESTDIR="share/qt5/tests" QT_MKSPECDIR="lib/qt5/mkspecs" QT_TOOLDIR="lib/qt5/bin" OSREL=13.2 PREFIX=%D LOCALBASE=/usr/local RESETPREFIX=/usr/local LIB32DIR=lib DOCSDIR="share/doc/OSKAR" EXAMPLESDIR="share/examples/OSKAR" DATADIR="share/OSKAR" WWWDIR="www/OSKAR" ETCDIR="etc/OSKAR"
--End PLIST_SUB--
--SUB_LIST--
PYTHON_INCLUDEDIR=/usr/local/include/python3.9 PYTHON_LIBDIR=/usr/local/lib/python3.9 PYTHON_PLATFORM=freebsd13 PYTHON_SITELIBDIR=/usr/local/lib/python3.9/site-packages PYTHON_SUFFIX=39 PYTHON_EXT_SUFFIX=.cpython-39 PYTHON_VER=3.9 PYTHON_VERSION=python3.9 PYTHON2="@comment " PYTHON3="" PREFIX=/usr/local LOCALBASE=/usr/local DATADIR=/usr/local/share/OSKAR DOCSDIR=/usr/local/share/doc/OSKAR EXAMPLESDIR=/usr/local/share/examples/OSKAR WWWDIR=/usr/local/www/OSKAR ETCDIR=/usr/local/etc/OSKAR
--End SUB_LIST--
---Begin make.conf---
USE_PACKAGE_DEPENDS=yes
BATCH=yes
WRKDIRPREFIX=/wrkdirs
PORTSDIR=/usr/ports
PACKAGES=/packages
DISTDIR=/distfiles
PACKAGE_BUILDING=yes
PACKAGE_BUILDING_FLAVORS=yes
MACHINE=powerpc
MACHINE_ARCH=powerpc
ARCH=${MACHINE_ARCH}
#### /usr/local/etc/poudriere.d/make.conf ####
# XXX: We really need this but cannot use it while 'make checksum' does not
# try the next mirror on checksum failure. It currently retries the same
# failed mirror and then fails rather then trying another. It *does*
# try the next if the size is mismatched though.
#MASTER_SITE_FREEBSD=yes
# Build ALLOW_MAKE_JOBS_PACKAGES with 2 jobs
MAKE_JOBS_NUMBER=3
#### /usr/ports/Mk/Scripts/ports_env.sh ####
_CCVERSION_921dbbb2=FreeBSD clang version 14.0.5 (https://github.com/llvm/llvm-project.git llvmorg-14.0.5-0-gc12386ae247c) Target: powerpc-unknown-freebsd13.2 Thread model: posix InstalledDir: /usr/bin
_ALTCCVERSION_921dbbb2=none
_CXXINTERNAL_acaad9ca=FreeBSD clang version 14.0.5 (https://github.com/llvm/llvm-project.git llvmorg-14.0.5-0-gc12386ae247c) Target: powerpc-unknown-freebsd13.2 Thread model: posix InstalledDir: /usr/bin "/usr/bin/ld" "--eh-frame-hdr" "-dynamic-linker" "/libexec/ld-elf.so.1" "--enable-new-dtags" "-m" "elf32ppc_fbsd" "-o" "a.out" "/usr/lib/crt1.o" "/usr/lib/crti.o" "/usr/lib/crtbegin.o" "-L/usr/lib" "/dev/null" "-lc++" "-lm" "-lgcc" "--as-needed" "-lgcc_s" "--no-as-needed" "-lc" "-lgcc" "--as-needed" "-lgcc_s" "--no-as-needed" "/usr/lib/crtend.o" "/usr/lib/crtn.o"
CC_OUTPUT_921dbbb2_58173849=yes
CC_OUTPUT_921dbbb2_9bdba57c=yes
CC_OUTPUT_921dbbb2_6a4fe7f5=yes
CC_OUTPUT_921dbbb2_6bcac02b=yes
CC_OUTPUT_921dbbb2_67d20829=yes
CC_OUTPUT_921dbbb2_bfa62e83=yes
CC_OUTPUT_921dbbb2_f0b4d593=yes
CC_OUTPUT_921dbbb2_308abb44=yes
CC_OUTPUT_921dbbb2_f00456e5=yes
CC_OUTPUT_921dbbb2_65ad290d=yes
CC_OUTPUT_921dbbb2_f2776b26=yes
CC_OUTPUT_921dbbb2_53255a77=yes
CC_OUTPUT_921dbbb2_911cfe02=yes
CC_OUTPUT_921dbbb2_b2657cc3=yes
CC_OUTPUT_921dbbb2_380987f7=yes
CC_OUTPUT_921dbbb2_160933ec=yes
CC_OUTPUT_921dbbb2_fb62803b=yes
CC_OUTPUT_921dbbb2_af59ad06=yes
CC_OUTPUT_921dbbb2_a15f3fcf=yes
_OBJC_CCVERSION_921dbbb2=FreeBSD clang version 14.0.5 (https://github.com/llvm/llvm-project.git llvmorg-14.0.5-0-gc12386ae247c) Target: powerpc-unknown-freebsd13.2 Thread model: posix InstalledDir: /usr/bin
_OBJC_ALTCCVERSION_921dbbb2=none
ARCH=powerpc
OPSYS=FreeBSD
_OSRELEASE=13.2-RELEASE
OSREL=13.2
OSVERSION=1302001
PYTHONBASE=/usr/local
CONFIGURE_MAX_CMD_LEN=524288
HAVE_PORTS_ENV=1
#### Misc Poudriere ####
GID=0
UID=0
---End make.conf---
--Resource limits--
cpu time (seconds, -t) unlimited
file size (512-blocks, -f) unlimited
data seg size (kbytes, -d) 1048576
stack size (kbytes, -s) 65536
core file size (512-blocks, -c) unlimited
max memory size (kbytes, -m) unlimited
locked memory (kbytes, -l) unlimited
max user processes (-u) 89999
open files (-n) 1024
virtual mem size (kbytes, -v) unlimited
swap limit (kbytes, -w) unlimited
socket buffer size (bytes, -b) unlimited
pseudo-terminals (-p) unlimited
kqueues (-k) unlimited
umtx shared locks (-o) unlimited
--End resource limits--
=======================<phase: check-sanity >============================
===> License GPLv2 accepted by the user
===========================================================================
=======================<phase: pkg-depends >============================
===> OSKAR-2.8.3_4 depends on file: /usr/local/sbin/pkg - not found
===> Installing existing package /packages/All/pkg-1.19.2.pkg
[132powerpc-quarterly-job-04] Installing pkg-1.19.2...
[132powerpc-quarterly-job-04] Extracting pkg-1.19.2: .......... done
===> OSKAR-2.8.3_4 depends on file: /usr/local/sbin/pkg - found
===> Returning to build of OSKAR-2.8.3_4
===========================================================================
=======================<phase: fetch-depends >============================
===========================================================================
=======================<phase: fetch >============================
===> License GPLv2 accepted by the user
===> Fetching all distfiles required by OSKAR-2.8.3_4 for building
===========================================================================
=======================<phase: checksum >============================
===> License GPLv2 accepted by the user
===> Fetching all distfiles required by OSKAR-2.8.3_4 for building
=> SHA256 Checksum OK for OxfordSKA-OSKAR-2.8.3_GH0.tar.gz.
===========================================================================
=======================<phase: extract-depends>============================
===========================================================================
=======================<phase: extract >============================
===> License GPLv2 accepted by the user
===> Fetching all distfiles required by OSKAR-2.8.3_4 for building
===> Extracting for OSKAR-2.8.3_4
=> SHA256 Checksum OK for OxfordSKA-OSKAR-2.8.3_GH0.tar.gz.
===========================================================================
=======================<phase: patch-depends >============================
===========================================================================
=======================<phase: patch >============================
===> Patching for OSKAR-2.8.3_4
===> Applying FreeBSD patches for OSKAR-2.8.3_4 from /usr/ports/astro/oskar/files
===========================================================================
=======================<phase: build-depends >============================
===> OSKAR-2.8.3_4 depends on file: /usr/local/bin/cmake - not found
===> Installing existing package /packages/All/cmake-core-3.26.1_1.pkg
[132powerpc-quarterly-job-04] Installing cmake-core-3.26.1_1...
[132powerpc-quarterly-job-04] `-- Installing expat-2.5.0...
[132powerpc-quarterly-job-04] `-- Extracting expat-2.5.0: .......... done
[132powerpc-quarterly-job-04] `-- Installing jsoncpp-1.9.5...
[132powerpc-quarterly-job-04] `-- Extracting jsoncpp-1.9.5: .......... done
[132powerpc-quarterly-job-04] `-- Installing libuv-1.46.0...
[132powerpc-quarterly-job-04] `-- Extracting libuv-1.46.0: .......... done
[132powerpc-quarterly-job-04] `-- Installing rhash-1.4.3...
<snip>
CUDA_TOOLKIT_ROOT_DIR not found or specified
Requested CUDA version 7.0, but found unacceptable version
-- Could NOT find CUDA (missing: CUDA_TOOLKIT_ROOT_DIR CUDA_NVCC_EXECUTABLE CUDA_INCLUDE_DIRS CUDA_CUDART_LIBRARY _cuda_version_acceptable) (Required is at least version "7.0")
-- Performing Test CMAKE_HAVE_LIBC_PTHREAD
-- Performing Test CMAKE_HAVE_LIBC_PTHREAD - Failed
-- Looking for pthread_create in pthreads
-- Looking for pthread_create in pthreads - not found
-- Looking for pthread_create in pthread
-- Looking for pthread_create in pthread - found
-- Found Threads: TRUE
===============================================================================
-- INFO: OSKAR version 2.8.3 [0x020803]
-- INFO: Build type Release
-- INFO: Compiler ID GNU:GNU
===============================================================================
-- INFO: 'make install' will install OSKAR to:
-- INFO: - Libraries /usr/local/lib
-- INFO: - Headers /usr/local/include
-- INFO: - Applications /usr/local/bin
-- NOTE: These paths can be changed using: '-DCMAKE_INSTALL_PREFIX=<path>'
===============================================================================
===============================================================================
-- WARNING: CUDA toolkit not found.
===============================================================================
-- Found PythonInterp: /usr/local/bin/python3.9 (found version "3.9.18")
-- Could NOT find CASACORE (missing: CASACORE_LIBRARIES CASACORE_INCLUDE_DIR)
===============================================================================
-- WARNING: CASACORE not found: Unable to use Measurement Sets.
===============================================================================
-- Could NOT find Sphinx (missing: SPHINX_EXECUTABLE)
-- WARNING: Sphinx or Python not found - cannot build documentation
-- Configuring done (5.8s)
-- Generating done (0.4s)
CMake Warning:
Manually-specified variables were not used by the project:
BOOST_PYTHON_SUFFIX
CMAKE_COLOR_MAKEFILE
CMAKE_CXX_FLAGS_DEBUG
CMAKE_C_FLAGS_DEBUG
CMAKE_VERBOSE_MAKEFILE
FETCHCONTENT_FULLY_DISCONNECTED
-- Build files have been written to: /wrkdirs/usr/ports/astro/oskar/work/.build
===========================================================================
=======================<phase: build >============================
===> Building for OSKAR-2.8.3_4
[ 0% 3/613] /usr/local/bin/gcc12 -DH5_BUILT_AS_DYNAMIC_LIB -DOSKAR_HAVE_HDF5 -DOSKAR_NO_MS -DSOURCE_PATH_SIZE=48 -Doskar_EXPORTS -I/wrkdirs/usr/ports/astro/oskar/work/.build -I/wrkdirs/usr/ports/astro/oskar/work/.build/oskar -I/wrkdirs/usr/ports/astro/oskar/work/OSKAR-2.8.3 -I/wrkdirs/usr/ports/astro/oskar/work/OSKAR-2.8.3/oskar -I/wrkdirs/usr/ports/astro/oskar/work/OSKAR-2.8.3/extern -I/wrkdirs/usr/ports/astro/oskar/work/OSKAR-2.8.3/extern/gtest-1.7.0/include -I/wrkdirs/usr/ports/astro/oskar/work/OSKAR-2.8.3/extern/rapidxml-1.13 -I/wrkdirs/usr/ports/astro/oskar/work/OSKAR-2.8.3/extern/cfitsio -I/wrkdirs/usr/ports/astro/oskar/work/OSKAR-2.8.3/extern/Random123 -I/wrkdirs/usr/ports/astro/oskar/work/OSKAR-2.8.3/extern/Random123/features -I/usr/ports/astro/oskar/files -O2 -pipe -fstack-protector-strong -Wl,-rpath=/usr/local/lib/gcc12 -isystem /usr/local/include -fno-strict-aliasing -fopenmp -std=c99 -Wall -Wextra -pedantic -Wcast-qual -Wcast-align -Wno-long-long -Wno-variadic-macros -W
no-unused-function -Wmissing-prototypes -fvisibility=hidden -fdiagnostics-show-option -O2 -pipe -fstack-protector-strong -Wl,-rpath=/usr/local/lib/gcc12 -isystem /usr/local/include -fno-strict-aliasing -DNDEBUG -fPIC -pthread -MD -MT oskar/CMakeFiles/oskar.dir/beam_pattern/src/oskar_beam_pattern_accessors.c.o -MF oskar/CMakeFiles/oskar.dir/beam_pattern/src/oskar_beam_pattern_accessors.c.o.d -o oskar/CMakeFiles/oskar.dir/beam_pattern/src/oskar_beam_pattern_accessors.c.o -c /wrkdirs/usr/ports/astro/oskar/work/OSKAR-2.8.3/oskar/beam_pattern/src/oskar_beam_pattern_accessors.c
[ 0% 4/613] /usr/local/bin/gcc12 -DH5_BUILT_AS_DYNAMIC_LIB -DOSKAR_HAVE_HDF5 -DOSKAR_NO_MS -DSOURCE_PATH_SIZE=48 -Doskar_EXPORTS -I/wrkdirs/usr/ports/astro/oskar/work/.build -I/wrkdirs/usr/ports/astro/oskar/work/.build/oskar -I/wrkdirs/usr/ports/astro/oskar/work/OSKAR-2.8.3 -I/wrkdirs/usr/ports/astro/oskar/work/OSKAR-2.8.3/oskar -I/wrkdirs/usr/ports/astro/oskar/work/OSKAR-2.8.3/extern -I/wrkdirs/usr/ports/astro/oskar/work/OSKAR-2.8.3/extern/gtest-1.7.0/include -I/wrkdirs/usr/ports/astro/oskar/work/OSKAR-2.8.3/extern/rapidxml-1.13 -I/wrkdirs/usr/ports/astro/oskar/work/OSKAR-2.8.3/extern/cfitsio -I/wrkdirs/usr/ports/astro/oskar/work/OSKAR-2.8.3/extern/Random123 -I/wrkdirs/usr/ports/astro/oskar/work/OSKAR-2.8.3/extern/Random123/features -I/usr/ports/astro/oskar/files -O2 -pipe -fstack-protector-strong -Wl,-rpath=/usr/local/lib/gcc12 -isystem /usr/local/include -fno-strict-aliasing -fopenmp -std=c99 -Wall -Wextra -pedantic -Wcast-qual -Wcast-align -Wno-long-long -Wno-variadic-macros -W
no-unused-function -Wmissing-prototypes -fvisibility=hidden -fdiagnostics-show-option -O2 -pipe -fstack-protector-strong -Wl,-rpath=/usr/local/lib/gcc12 -isystem /usr/local/include -fno-strict-aliasing -DNDEBUG -fPIC -pthread -MD -MT oskar/CMakeFiles/oskar.dir/beam_pattern/src/oskar_beam_pattern_check_init.c.o -MF oskar/CMakeFiles/oskar.dir/beam_pattern/src/oskar_beam_pattern_check_init.c.o.d -o oskar/CMakeFiles/oskar.dir/beam_pattern/src/oskar_beam_pattern_check_init.c.o -c /wrkdirs/usr/ports/astro/oskar/work/OSKAR-2.8.3/oskar/beam_pattern/src/oskar_beam_pattern_check_init.c
[ 0% 5/613] /usr/local/bin/gcc12 -DH5_BUILT_AS_DYNAMIC_LIB -DOSKAR_HAVE_HDF5 -DOSKAR_NO_MS -DSOURCE_PATH_SIZE=48 -Doskar_EXPORTS -I/wrkdirs/usr/ports/astro/oskar/work/.build -I/wrkdirs/usr/ports/astro/oskar/work/.build/oskar -I/wrkdirs/usr/ports/astro/oskar/work/OSKAR-2.8.3 -I/wrkdirs/usr/ports/astro/oskar/work/OSKAR-2.8.3/oskar -I/wrkdirs/usr/ports/astro/oskar/work/OSKAR-2.8.3/extern -I/wrkdirs/usr/ports/astro/oskar/work/OSKAR-2.8.3/extern/gtest-1.7.0/include -I/wrkdirs/usr/ports/astro/oskar/work/OSKAR-2.8.3/extern/rapidxml-1.13 -I/wrkdirs/usr/ports/astro/oskar/work/OSKAR-2.8.3/extern/cfitsio -I/wrkdirs/usr/ports/astro/oskar/work/OSKAR-2.8.3/extern/Random123 -I/wrkdirs/usr/ports/astro/oskar/work/OSKAR-2.8.3/extern/Random123/features -I/usr/ports/astro/oskar/files -O2 -pipe -fstack-protector-strong -Wl,-rpath=/usr/local/lib/gcc12 -isystem /usr/local/include -fno-strict-aliasing -fopenmp -std=c99 -Wall -Wextra -pedantic -Wcast-qual -Wcast-align -Wno-long-long -Wno-variadic-macros -W
no-unused-function -Wmissing-prototypes -fvisibility=hidden -fdiagnostics-show-option -O2 -pipe -fstack-protector-strong -Wl,-rpath=/usr/local/lib/gcc12 -isystem /usr/local/include -fno-strict-aliasing -DNDEBUG -fPIC -pthread -MD -MT oskar/CMakeFiles/oskar.dir/beam_pattern/src/oskar_beam_pattern_create.c.o -MF oskar/CMakeFiles/oskar.dir/beam_pattern/src/oskar_beam_pattern_create.c.o.d -o oskar/CMakeFiles/oskar.dir/beam_pattern/src/oskar_beam_pattern_create.c.o -c /wrkdirs/usr/ports/astro/oskar/work/OSKAR-2.8.3/oskar/beam_pattern/src/oskar_beam_pattern_create.c
[ 0% 6/613] /usr/local/bin/gcc12 -DH5_BUILT_AS_DYNAMIC_LIB -DOSKAR_HAVE_HDF5 -DOSKAR_NO_MS -DSOURCE_PATH_SIZE=48 -Doskar_EXPORTS -I/wrkdirs/usr/ports/astro/oskar/work/.build -I/wrkdirs/usr/ports/astro/oskar/work/.build/oskar -I/wrkdirs/usr/ports/astro/oskar/work/OSKAR-2.8.3 -I/wrkdirs/usr/ports/astro/oskar/work/OSKAR-2.8.3/oskar -I/wrkdirs/usr/ports/astro/oskar/work/OSKAR-2.8.3/extern -I/wrkdirs/usr/ports/astro/oskar/work/OSKAR-2.8.3/extern/gtest-1.7.0/include -I/wrkdirs/usr/ports/astro/oskar/work/OSKAR-2.8.3/extern/rapidxml-1.13 -I/wrkdirs/usr/ports/astro/oskar/work/OSKAR-2.8.3/extern/cfitsio -I/wrkdirs/usr/ports/astro/oskar/work/OSKAR-2.8.3/extern/Random123 -I/wrkdirs/usr/ports/astro/oskar/work/OSKAR-2.8.3/extern/Random123/features -I/usr/ports/astro/oskar/files -O2 -pipe -fstack-protector-strong -Wl,-rpath=/usr/local/lib/gcc12 -isystem /usr/local/include -fno-strict-aliasing -fopenmp -std=c99 -Wall -Wextra -pedantic -Wcast-qual -Wcast-align -Wno-long-long -Wno-variadic-macros -W
no-unused-function -Wmissing-prototypes -fvisibility=hidden -fdiagnostics-show-option -O2 -pipe -fstack-protector-strong -Wl,-rpath=/usr/local/lib/gcc12 -isystem /usr/local/include -fno-strict-aliasing -DNDEBUG -fPIC -pthread -MD -MT oskar/CMakeFiles/oskar.dir/beam_pattern/src/oskar_beam_pattern_free.c.o -MF oskar/CMakeFiles/oskar.dir/beam_pattern/src/oskar_beam_pattern_free.c.o.d -o oskar/CMakeFiles/oskar.dir/beam_pattern/src/oskar_beam_pattern_free.c.o -c /wrkdirs/usr/ports/astro/oskar/work/OSKAR-2.8.3/oskar/beam_pattern/src/oskar_beam_pattern_free.c
[ 0% 7/613] /usr/local/bin/gcc12 -DH5_BUILT_AS_DYNAMIC_LIB -DOSKAR_HAVE_HDF5 -DOSKAR_NO_MS -DSOURCE_PATH_SIZE=48 -Doskar_EXPORTS -I/wrkdirs/usr/ports/astro/oskar/work/.build -I/wrkdirs/usr/ports/astro/oskar/work/.build/oskar -I/wrkdirs/usr/ports/astro/oskar/work/OSKAR-2.8.3 -I/wrkdirs/usr/ports/astro/oskar/work/OSKAR-2.8.3/oskar -I/wrkdirs/usr/ports/astro/oskar/work/OSKAR-2.8.3/extern -I/wrkdirs/usr/ports/astro/oskar/work/OSKAR-2.8.3/extern/gtest-1.7.0/include -I/wrkdirs/usr/ports/astro/oskar/work/OSKAR-2.8.3/extern/rapidxml-1.13 -I/wrkdirs/usr/ports/astro/oskar/work/OSKAR-2.8.3/extern/cfitsio -I/wrkdirs/usr/ports/astro/oskar/work/OSKAR-2.8.3/extern/Random123 -I/wrkdirs/usr/ports/astro/oskar/work/OSKAR-2.8.3/extern/Random123/features -I/usr/ports/astro/oskar/files -O2 -pipe -fstack-protector-strong -Wl,-rpath=/usr/local/lib/gcc12 -isystem /usr/local/include -fno-strict-aliasing -fopenmp -std=c99 -Wall -Wextra -pedantic -Wcast-qual -Wcast-align -Wno-long-long -Wno-variadic-macros -W
no-unused-function -Wmissing-prototypes -fvisibility=hidden -fdiagnostics-show-option -O2 -pipe -fstack-protector-strong -Wl,-rpath=/usr/local/lib/gcc12 -isystem /usr/local/include -fno-strict-aliasing -DNDEBUG -fPIC -pthread -MD -MT oskar/CMakeFiles/oskar.dir/beam_pattern/src/oskar_beam_pattern_reset_cache.c.o -MF oskar/CMakeFiles/oskar.dir/beam_pattern/src/oskar_beam_pattern_reset_cache.c.o.d -o oskar/CMakeFiles/oskar.dir/beam_pattern/src/oskar_beam_pattern_reset_cache.c.o -c /wrkdirs/usr/ports/astro/oskar/work/OSKAR-2.8.3/oskar/beam_pattern/src/oskar_beam_pattern_reset_cache.c
[ 0% 8/613] /usr/local/bin/gcc12 -DH5_BUILT_AS_DYNAMIC_LIB -DOSKAR_HAVE_HDF5 -DOSKAR_NO_MS -DSOURCE_PATH_SIZE=48 -Doskar_EXPORTS -I/wrkdirs/usr/ports/astro/oskar/work/.build -I/wrkdirs/usr/ports/astro/oskar/work/.build/oskar -I/wrkdirs/usr/ports/astro/oskar/work/OSKAR-2.8.3 -I/wrkdirs/usr/ports/astro/oskar/work/OSKAR-2.8.3/oskar -I/wrkdirs/usr/ports/astro/oskar/work/OSKAR-2.8.3/extern -I/wrkdirs/usr/ports/astro/oskar/work/OSKAR-2.8.3/extern/gtest-1.7.0/include -I/wrkdirs/usr/ports/astro/oskar/work/OSKAR-2.8.3/extern/rapidxml-1.13 -I/wrkdirs/usr/ports/astro/oskar/work/OSKAR-2.8.3/extern/cfitsio -I/wrkdirs/usr/ports/astro/oskar/work/OSKAR-2.8.3/extern/Random123 -I/wrkdirs/usr/ports/astro/oskar/work/OSKAR-2.8.3/extern/Random123/features -I/usr/ports/astro/oskar/files -O2 -pipe -fstack-protector-strong -Wl,-rpath=/usr/local/lib/gcc12 -isystem /usr/local/include -fno-strict-aliasing -fopenmp -std=c99 -Wall -Wextra -pedantic -Wcast-qual -Wcast-align -Wno-long-long -Wno-variadic-macros -W
no-unused-function -Wmissing-prototypes -fvisibility=hidden -fdiagnostics-show-option -O2 -pipe -fstack-protector-strong -Wl,-rpath=/usr/local/lib/gcc12 -isystem /usr/local/include -fno-strict-aliasing -DNDEBUG -fPIC -pthread -MD -MT oskar/CMakeFiles/oskar.dir/beam_pattern/src/oskar_beam_pattern_run.c.o -MF oskar/CMakeFiles/oskar.dir/beam_pattern/src/oskar_beam_pattern_run.c.o.d -o oskar/CMakeFiles/oskar.dir/beam_pattern/src/oskar_beam_pattern_run.c.o -c /wrkdirs/usr/ports/astro/oskar/work/OSKAR-2.8.3/oskar/beam_pattern/src/oskar_beam_pattern_run.c
[ 1% 9/613] /usr/local/bin/gcc12 -DH5_BUILT_AS_DYNAMIC_LIB -DOSKAR_HAVE_HDF5 -DOSKAR_NO_MS -DSOURCE_PATH_SIZE=48 -Doskar_EXPORTS -I/wrkdirs/usr/ports/astro/oskar/work/.build -I/wrkdirs/usr/ports/astro/oskar/work/.build/oskar -I/wrkdirs/usr/ports/astro/oskar/work/OSKAR-2.8.3 -I/wrkdirs/usr/ports/astro/oskar/work/OSKAR-2.8.3/oskar -I/wrkdirs/usr/ports/astro/oskar/work/OSKAR-2.8.3/extern -I/wrkdirs/usr/ports/astro/oskar/work/OSKAR-2.8.3/extern/gtest-1.7.0/include -I/wrkdirs/usr/ports/astro/oskar/work/OSKAR-2.8.3/extern/rapidxml-1.13 -I/wrkdirs/usr/ports/astro/oskar/work/OSKAR-2.8.3/extern/cfitsio -I/wrkdirs/usr/ports/astro/oskar/work/OSKAR-2.8.3/extern/Random123 -I/wrkdirs/usr/ports/astro/oskar/work/OSKAR-2.8.3/extern/Random123/features -I/usr/ports/astro/oskar/files -O2 -pipe -fstack-protector-strong -Wl,-rpath=/usr/local/lib/gcc12 -isystem /usr/local/include -fno-strict-aliasing -fopenmp -std=c99 -Wall -Wextra -pedantic -Wcast-qual -Wcast-align -Wno-long-long -Wno-variadic-macros -W
no-unused-function -Wmissing-prototypes -fvisibility=hidden -fdiagnostics-show-option -O2 -pipe -fstack-protector-strong -Wl,-rpath=/usr/local/lib/gcc12 -isystem /usr/local/include -fno-strict-aliasing -DNDEBUG -fPIC -pthread -MD -MT oskar/CMakeFiles/oskar.dir/beam_pattern/src/private_beam_pattern_free_device_data.c.o -MF oskar/CMakeFiles/oskar.dir/beam_pattern/src/private_beam_pattern_free_device_data.c.o.d -o oskar/CMakeFiles/oskar.dir/beam_pattern/src/private_beam_pattern_free_device_data.c.o -c /wrkdirs/usr/ports/astro/oskar/work/OSKAR-2.8.3/oskar/beam_pattern/src/private_beam_pattern_free_device_data.c
[ 1% 10/613] /usr/local/bin/g++12 -DGTEST_CREATE_SHARED_LIBRARY=1 -DOSKAR_HAVE_HDF5 -DSOURCE_PATH_SIZE=48 -I/wrkdirs/usr/ports/astro/oskar/work/.build -I/wrkdirs/usr/ports/astro/oskar/work/.build/oskar -I/wrkdirs/usr/ports/astro/oskar/work/OSKAR-2.8.3 -I/wrkdirs/usr/ports/astro/oskar/work/OSKAR-2.8.3/oskar -I/wrkdirs/usr/ports/astro/oskar/work/OSKAR-2.8.3/extern -I/wrkdirs/usr/ports/astro/oskar/work/OSKAR-2.8.3/extern/gtest-1.7.0/include -I/wrkdirs/usr/ports/astro/oskar/work/OSKAR-2.8.3/extern/rapidxml-1.13 -I/wrkdirs/usr/ports/astro/oskar/work/OSKAR-2.8.3/extern/cfitsio -I/wrkdirs/usr/ports/astro/oskar/work/OSKAR-2.8.3/extern/Random123 -I/wrkdirs/usr/ports/astro/oskar/work/OSKAR-2.8.3/extern/Random123/features -I/usr/ports/astro/oskar/files -I/wrkdirs/usr/ports/astro/oskar/work/OSKAR-2.8.3/extern/gtest-1.7.0 -O2 -pipe -fstack-protector-strong -Wl,-rpath=/usr/local/lib/gcc12 -stdlib=libc++ -Wl,-rpath=/usr/local/lib/gcc12 -isystem /usr/local/include -fopenmp -Wall -Wextra -pedantic
-Wcast-qual -Wcast-align -Wno-long-long -Wno-variadic-macros -Wno-unused-function -fvisibility=hidden -fvisibility-inlines-hidden -fdiagnostics-show-option -O2 -pipe -fstack-protector-strong -Wl,-rpath=/usr/local/lib/gcc12 -stdlib=libc++ -Wl,-rpath=/usr/local/lib/gcc12 -isystem /usr/local/include -DNDEBUG -fPIC -O2 -pipe -fstack-protector-strong -Wl,-rpath=/usr/local/lib/gcc12 -stdlib=libc++ -Wl,-rpath=/usr/local/lib/gcc12 -isystem /usr/local/include -fopenmp -Wall -Wextra -pedantic -Wcast-qual -Wcast-align -Wno-long-long -Wno-variadic-macros -Wno-unused-function -fvisibility=hidden -fvisibility-inlines-hidden -fdiagnostics-show-option -Wall -Wshadow -DGTEST_HAS_PTHREAD=1 -fexceptions -Wextra -Wno-unused-parameter -Wno-missing-field-initializers -Wno-long-long -MD -MT extern/gtest-1.7.0/CMakeFiles/gtest_main.dir/src/gtest_main.cc.o -MF extern/gtest-1.7.0/CMakeFiles/gtest_main.dir/src/gtest_main.cc.o.d -o extern/gtest-1.7.0/CMakeFiles/gtest_main.dir/src/gtest_main.cc.o -c /wrkd
irs/usr/ports/astro/oskar/work/OSKAR-2.8.3/e!
xtern/gtest-1.7.0/src/gtest_main.cc
[ 1% 11/613] /usr/local/bin/gcc12 -DH5_BUILT_AS_DYNAMIC_LIB -DOSKAR_HAVE_HDF5 -DOSKAR_NO_MS -DSOURCE_PATH_SIZE=48 -Doskar_EXPORTS -I/wrkdirs/usr/ports/astro/oskar/work/.build -I/wrkdirs/usr/ports/astro/oskar/work/.build/oskar -I/wrkdirs/usr/ports/astro/oskar/work/OSKAR-2.8.3 -I/wrkdirs/usr/ports/astro/oskar/work/OSKAR-2.8.3/oskar -I/wrkdirs/usr/ports/astro/oskar/work/OSKAR-2.8.3/extern -I/wrkdirs/usr/ports/astro/oskar/work/OSKAR-2.8.3/extern/gtest-1.7.0/include -I/wrkdirs/usr/ports/astro/oskar/work/OSKAR-2.8.3/extern/rapidxml-1.13 -I/wrkdirs/usr/ports/astro/oskar/work/OSKAR-2.8.3/extern/cfitsio -I/wrkdirs/usr/ports/astro/oskar/work/OSKAR-2.8.3/extern/Random123 -I/wrkdirs/usr/ports/astro/oskar/work/OSKAR-2.8.3/extern/Random123/features -I/usr/ports/astro/oskar/files -O2 -pipe -fstack-protector-strong -Wl,-rpath=/usr/local/lib/gcc12 -isystem /usr/local/include -fno-strict-aliasing -fopenmp -std=c99 -Wall -Wextra -pedantic -Wcast-qual -Wcast-align -Wno-long-long -Wno-variadic-macros -
Wno-unused-function -Wmissing-prototypes -fvisibility=hidden -fdiagnostics-show-option -O2 -pipe -fstack-protector-strong -Wl,-rpath=/usr/local/lib/gcc12 -isystem /usr/local/include -fno-strict-aliasing -DNDEBUG -fPIC -pthread -MD -MT oskar/CMakeFiles/oskar.dir/convert/src/oskar_convert_any_to_enu_directions.c.o -MF oskar/CMakeFiles/oskar.dir/convert/src/oskar_convert_any_to_enu_directions.c.o.d -o oskar/CMakeFiles/oskar.dir/convert/src/oskar_convert_any_to_enu_directions.c.o -c /wrkdirs/usr/ports/astro/oskar/work/OSKAR-2.8.3/oskar/convert/src/oskar_convert_any_to_enu_directions.c
[ 1% 12/613] /usr/local/bin/gcc12 -DH5_BUILT_AS_DYNAMIC_LIB -DOSKAR_HAVE_HDF5 -DOSKAR_NO_MS -DSOURCE_PATH_SIZE=48 -Doskar_EXPORTS -I/wrkdirs/usr/ports/astro/oskar/work/.build -I/wrkdirs/usr/ports/astro/oskar/work/.build/oskar -I/wrkdirs/usr/ports/astro/oskar/work/OSKAR-2.8.3 -I/wrkdirs/usr/ports/astro/oskar/work/OSKAR-2.8.3/oskar -I/wrkdirs/usr/ports/astro/oskar/work/OSKAR-2.8.3/extern -I/wrkdirs/usr/ports/astro/oskar/work/OSKAR-2.8.3/extern/gtest-1.7.0/include -I/wrkdirs/usr/ports/astro/oskar/work/OSKAR-2.8.3/extern/rapidxml-1.13 -I/wrkdirs/usr/ports/astro/oskar/work/OSKAR-2.8.3/extern/cfitsio -I/wrkdirs/usr/ports/astro/oskar/work/OSKAR-2.8.3/extern/Random123 -I/wrkdirs/usr/ports/astro/oskar/work/OSKAR-2.8.3/extern/Random123/features -I/usr/ports/astro/oskar/files -O2 -pipe -fstack-protector-strong -Wl,-rpath=/usr/local/lib/gcc12 -isystem /usr/local/include -fno-strict-aliasing -fopenmp -std=c99 -Wall -Wextra -pedantic -Wcast-qual -Wcast-align -Wno-long-long -Wno-variadic-macros -
Wno-unused-function -Wmissing-prototypes -fvisibility=hidden -fdiagnostics-show-option -O2 -pipe -fstack-protector-strong -Wl,-rpath=/usr/local/lib/gcc12 -isystem /usr/local/include -fno-strict-aliasing -DNDEBUG -fPIC -pthread -MD -MT oskar/CMakeFiles/oskar.dir/convert/src/oskar_convert_apparent_ra_dec_to_enu_directions.c.o -MF oskar/CMakeFiles/oskar.dir/convert/src/oskar_convert_apparent_ra_dec_to_enu_directions.c.o.d -o oskar/CMakeFiles/oskar.dir/convert/src/oskar_convert_apparent_ra_dec_to_enu_directions.c.o -c /wrkdirs/usr/ports/astro/oskar/work/OSKAR-2.8.3/oskar/convert/src/oskar_convert_apparent_ra_dec_to_enu_directions.c
FAILED: oskar/CMakeFiles/oskar.dir/convert/src/oskar_convert_apparent_ra_dec_to_enu_directions.c.o
/usr/local/bin/gcc12 -DH5_BUILT_AS_DYNAMIC_LIB -DOSKAR_HAVE_HDF5 -DOSKAR_NO_MS -DSOURCE_PATH_SIZE=48 -Doskar_EXPORTS -I/wrkdirs/usr/ports/astro/oskar/work/.build -I/wrkdirs/usr/ports/astro/oskar/work/.build/oskar -I/wrkdirs/usr/ports/astro/oskar/work/OSKAR-2.8.3 -I/wrkdirs/usr/ports/astro/oskar/work/OSKAR-2.8.3/oskar -I/wrkdirs/usr/ports/astro/oskar/work/OSKAR-2.8.3/extern -I/wrkdirs/usr/ports/astro/oskar/work/OSKAR-2.8.3/extern/gtest-1.7.0/include -I/wrkdirs/usr/ports/astro/oskar/work/OSKAR-2.8.3/extern/rapidxml-1.13 -I/wrkdirs/usr/ports/astro/oskar/work/OSKAR-2.8.3/extern/cfitsio -I/wrkdirs/usr/ports/astro/oskar/work/OSKAR-2.8.3/extern/Random123 -I/wrkdirs/usr/ports/astro/oskar/work/OSKAR-2.8.3/extern/Random123/features -I/usr/ports/astro/oskar/files -O2 -pipe -fstack-protector-strong -Wl,-rpath=/usr/local/lib/gcc12 -isystem /usr/local/include -fno-strict-aliasing -fopenmp -std=c99 -Wall -Wextra -pedantic -Wcast-qual -Wcast-align -Wno-long-long -Wno-variadic-macros -Wno-unused-fun
ction -Wmissing-prototypes -fvisibility=hidden -fdiagnostics-show-option -O2 -pipe -fstack-protector-strong -Wl,-rpath=/usr/local/lib/gcc12 -isystem /usr/local/include -fno-strict-aliasing -DNDEBUG -fPIC -pthread -MD -MT oskar/CMakeFiles/oskar.dir/convert/src/oskar_convert_apparent_ra_dec_to_enu_directions.c.o -MF oskar/CMakeFiles/oskar.dir/convert/src/oskar_convert_apparent_ra_dec_to_enu_directions.c.o.d -o oskar/CMakeFiles/oskar.dir/convert/src/oskar_convert_apparent_ra_dec_to_enu_directions.c.o -c /wrkdirs/usr/ports/astro/oskar/work/OSKAR-2.8.3/oskar/convert/src/oskar_convert_apparent_ra_dec_to_enu_directions.c
In file included from /wrkdirs/usr/ports/astro/oskar/work/OSKAR-2.8.3/oskar/utility/oskar_kernel_macros.h:206,
from /wrkdirs/usr/ports/astro/oskar/work/OSKAR-2.8.3/oskar/convert/src/oskar_convert_apparent_ra_dec_to_enu_directions.c:9:
/wrkdirs/usr/ports/astro/oskar/work/OSKAR-2.8.3/oskar/convert/src/oskar_convert_apparent_ra_dec_to_enu_directions.c: In function 'oskar_convert_apparent_ra_dec_to_enu_directions_float':
/wrkdirs/usr/ports/astro/oskar/work/OSKAR-2.8.3/oskar/utility/oskar_kernel_macros.h:256:29: error: 'csinl' undeclared (first use in this function); did you mean 'csinh'?
256 | #define SINCOS(X, S, C) S = sin(X); C = cos(X)
| ^~~
/wrkdirs/usr/ports/astro/oskar/work/OSKAR-2.8.3/oskar/convert/define_convert_apparent_ra_dec_to_enu_directions.h:18:5: note: in expansion of macro 'SINCOS'
18 | SINCOS(ha_rad, sin_ha, cos_ha);\
| ^~~~~~
/wrkdirs/usr/ports/astro/oskar/work/OSKAR-2.8.3/oskar/convert/src/oskar_convert_apparent_ra_dec_to_enu_directions.c:15:1: note: in expansion of macro 'OSKAR_CONVERT_RA_DEC_TO_ENU_DIR'
15 | OSKAR_CONVERT_RA_DEC_TO_ENU_DIR(oskar_convert_apparent_ra_dec_to_enu_directions_float, float)
| ^~~~~~~~~~~~~~~~~~~~~~~~~~~~~~~
/wrkdirs/usr/ports/astro/oskar/work/OSKAR-2.8.3/oskar/utility/oskar_kernel_macros.h:256:29: note: each undeclared identifier is reported only once for each function it appears in
256 | #define SINCOS(X, S, C) S = sin(X); C = cos(X)
| ^~~
/wrkdirs/usr/ports/astro/oskar/work/OSKAR-2.8.3/oskar/convert/define_convert_apparent_ra_dec_to_enu_directions.h:18:5: note: in expansion of macro 'SINCOS'
18 | SINCOS(ha_rad, sin_ha, cos_ha);\
| ^~~~~~
/wrkdirs/usr/ports/astro/oskar/work/OSKAR-2.8.3/oskar/convert/src/oskar_convert_apparent_ra_dec_to_enu_directions.c:15:1: note: in expansion of macro 'OSKAR_CONVERT_RA_DEC_TO_ENU_DIR'
15 | OSKAR_CONVERT_RA_DEC_TO_ENU_DIR(oskar_convert_apparent_ra_dec_to_enu_directions_float, float)
| ^~~~~~~~~~~~~~~~~~~~~~~~~~~~~~~
/wrkdirs/usr/ports/astro/oskar/work/OSKAR-2.8.3/oskar/utility/oskar_kernel_macros.h:256:29: error: argument 6 of '__builtin_tgmath' is not a function pointer
256 | #define SINCOS(X, S, C) S = sin(X); C = cos(X)
| ^~~
/wrkdirs/usr/ports/astro/oskar/work/OSKAR-2.8.3/oskar/convert/define_convert_apparent_ra_dec_to_enu_directions.h:18:5: note: in expansion of macro 'SINCOS'
18 | SINCOS(ha_rad, sin_ha, cos_ha);\
| ^~~~~~
/wrkdirs/usr/ports/astro/oskar/work/OSKAR-2.8.3/oskar/convert/src/oskar_convert_apparent_ra_dec_to_enu_directions.c:15:1: note: in expansion of macro 'OSKAR_CONVERT_RA_DEC_TO_ENU_DIR'
15 | OSKAR_CONVERT_RA_DEC_TO_ENU_DIR(oskar_convert_apparent_ra_dec_to_enu_directions_float, float)
| ^~~~~~~~~~~~~~~~~~~~~~~~~~~~~~~
/wrkdirs/usr/ports/astro/oskar/work/OSKAR-2.8.3/oskar/utility/oskar_kernel_macros.h:256:41: error: 'ccosl' undeclared (first use in this function); did you mean 'ccosh'?
256 | #define SINCOS(X, S, C) S = sin(X); C = cos(X)
| ^~~
/wrkdirs/usr/ports/astro/oskar/work/OSKAR-2.8.3/oskar/convert/define_convert_apparent_ra_dec_to_enu_directions.h:18:5: note: in expansion of macro 'SINCOS'
18 | SINCOS(ha_rad, sin_ha, cos_ha);\
| ^~~~~~
/wrkdirs/usr/ports/astro/oskar/work/OSKAR-2.8.3/oskar/convert/src/oskar_convert_apparent_ra_dec_to_enu_directions.c:15:1: note: in expansion of macro 'OSKAR_CONVERT_RA_DEC_TO_ENU_DIR'
15 | OSKAR_CONVERT_RA_DEC_TO_ENU_DIR(oskar_convert_apparent_ra_dec_to_enu_directions_float, float)
| ^~~~~~~~~~~~~~~~~~~~~~~~~~~~~~~
/wrkdirs/usr/ports/astro/oskar/work/OSKAR-2.8.3/oskar/utility/oskar_kernel_macros.h:256:41: error: argument 6 of '__builtin_tgmath' is not a function pointer
256 | #define SINCOS(X, S, C) S = sin(X); C = cos(X)
| ^~~
/wrkdirs/usr/ports/astro/oskar/work/OSKAR-2.8.3/oskar/convert/define_convert_apparent_ra_dec_to_enu_directions.h:18:5: note: in expansion of macro 'SINCOS'
18 | SINCOS(ha_rad, sin_ha, cos_ha);\
| ^~~~~~
/wrkdirs/usr/ports/astro/oskar/work/OSKAR-2.8.3/oskar/convert/src/oskar_convert_apparent_ra_dec_to_enu_directions.c:15:1: note: in expansion of macro 'OSKAR_CONVERT_RA_DEC_TO_ENU_DIR'
15 | OSKAR_CONVERT_RA_DEC_TO_ENU_DIR(oskar_convert_apparent_ra_dec_to_enu_directions_float, float)
| ^~~~~~~~~~~~~~~~~~~~~~~~~~~~~~~
/wrkdirs/usr/ports/astro/oskar/work/OSKAR-2.8.3/oskar/utility/oskar_kernel_macros.h:256:29: error: argument 6 of '__builtin_tgmath' is not a function pointer
256 | #define SINCOS(X, S, C) S = sin(X); C = cos(X)
| ^~~
/wrkdirs/usr/ports/astro/oskar/work/OSKAR-2.8.3/oskar/convert/define_convert_apparent_ra_dec_to_enu_directions.h:19:5: note: in expansion of macro 'SINCOS'
19 | SINCOS(dec_rad[i], sin_dec, cos_dec);\
| ^~~~~~
/wrkdirs/usr/ports/astro/oskar/work/OSKAR-2.8.3/oskar/convert/src/oskar_convert_apparent_ra_dec_to_enu_directions.c:15:1: note: in expansion of macro 'OSKAR_CONVERT_RA_DEC_TO_ENU_DIR'
15 | OSKAR_CONVERT_RA_DEC_TO_ENU_DIR(oskar_convert_apparent_ra_dec_to_enu_directions_float, float)
| ^~~~~~~~~~~~~~~~~~~~~~~~~~~~~~~
/wrkdirs/usr/ports/astro/oskar/work/OSKAR-2.8.3/oskar/utility/oskar_kernel_macros.h:256:41: error: argument 6 of '__builtin_tgmath' is not a function pointer
256 | #define SINCOS(X, S, C) S = sin(X); C = cos(X)
| ^~~
/wrkdirs/usr/ports/astro/oskar/work/OSKAR-2.8.3/oskar/convert/define_convert_apparent_ra_dec_to_enu_directions.h:19:5: note: in expansion of macro 'SINCOS'
19 | SINCOS(dec_rad[i], sin_dec, cos_dec);\
| ^~~~~~
/wrkdirs/usr/ports/astro/oskar/work/OSKAR-2.8.3/oskar/convert/src/oskar_convert_apparent_ra_dec_to_enu_directions.c:15:1: note: in expansion of macro 'OSKAR_CONVERT_RA_DEC_TO_ENU_DIR'
15 | OSKAR_CONVERT_RA_DEC_TO_ENU_DIR(oskar_convert_apparent_ra_dec_to_enu_directions_float, float)
| ^~~~~~~~~~~~~~~~~~~~~~~~~~~~~~~
/wrkdirs/usr/ports/astro/oskar/work/OSKAR-2.8.3/oskar/convert/src/oskar_convert_apparent_ra_dec_to_enu_directions.c: In function 'oskar_convert_apparent_ra_dec_to_enu_directions_double':
/wrkdirs/usr/ports/astro/oskar/work/OSKAR-2.8.3/oskar/utility/oskar_kernel_macros.h:256:29: error: 'csinl' undeclared (first use in this function); did you mean 'csinh'?
256 | #define SINCOS(X, S, C) S = sin(X); C = cos(X)
| ^~~
/wrkdirs/usr/ports/astro/oskar/work/OSKAR-2.8.3/oskar/convert/define_convert_apparent_ra_dec_to_enu_directions.h:18:5: note: in expansion of macro 'SINCOS'
18 | SINCOS(ha_rad, sin_ha, cos_ha);\
| ^~~~~~
/wrkdirs/usr/ports/astro/oskar/work/OSKAR-2.8.3/oskar/convert/src/oskar_convert_apparent_ra_dec_to_enu_directions.c:16:1: note: in expansion of macro 'OSKAR_CONVERT_RA_DEC_TO_ENU_DIR'
16 | OSKAR_CONVERT_RA_DEC_TO_ENU_DIR(oskar_convert_apparent_ra_dec_to_enu_directions_double, double)
| ^~~~~~~~~~~~~~~~~~~~~~~~~~~~~~~
/wrkdirs/usr/ports/astro/oskar/work/OSKAR-2.8.3/oskar/utility/oskar_kernel_macros.h:256:29: error: argument 6 of '__builtin_tgmath' is not a function pointer
256 | #define SINCOS(X, S, C) S = sin(X); C = cos(X)
| ^~~
/wrkdirs/usr/ports/astro/oskar/work/OSKAR-2.8.3/oskar/convert/define_convert_apparent_ra_dec_to_enu_directions.h:18:5: note: in expansion of macro 'SINCOS'
18 | SINCOS(ha_rad, sin_ha, cos_ha);\
| ^~~~~~
/wrkdirs/usr/ports/astro/oskar/work/OSKAR-2.8.3/oskar/convert/src/oskar_convert_apparent_ra_dec_to_enu_directions.c:16:1: note: in expansion of macro 'OSKAR_CONVERT_RA_DEC_TO_ENU_DIR'
16 | OSKAR_CONVERT_RA_DEC_TO_ENU_DIR(oskar_convert_apparent_ra_dec_to_enu_directions_double, double)
| ^~~~~~~~~~~~~~~~~~~~~~~~~~~~~~~
/wrkdirs/usr/ports/astro/oskar/work/OSKAR-2.8.3/oskar/utility/oskar_kernel_macros.h:256:41: error: 'ccosl' undeclared (first use in this function); did you mean 'ccosh'?
256 | #define SINCOS(X, S, C) S = sin(X); C = cos(X)
| ^~~
/wrkdirs/usr/ports/astro/oskar/work/OSKAR-2.8.3/oskar/convert/define_convert_apparent_ra_dec_to_enu_directions.h:18:5: note: in expansion of macro 'SINCOS'
18 | SINCOS(ha_rad, sin_ha, cos_ha);\
| ^~~~~~
/wrkdirs/usr/ports/astro/oskar/work/OSKAR-2.8.3/oskar/convert/src/oskar_convert_apparent_ra_dec_to_enu_directions.c:16:1: note: in expansion of macro 'OSKAR_CONVERT_RA_DEC_TO_ENU_DIR'
16 | OSKAR_CONVERT_RA_DEC_TO_ENU_DIR(oskar_convert_apparent_ra_dec_to_enu_directions_double, double)
| ^~~~~~~~~~~~~~~~~~~~~~~~~~~~~~~
/wrkdirs/usr/ports/astro/oskar/work/OSKAR-2.8.3/oskar/utility/oskar_kernel_macros.h:256:41: error: argument 6 of '__builtin_tgmath' is not a function pointer
256 | #define SINCOS(X, S, C) S = sin(X); C = cos(X)
| ^~~
/wrkdirs/usr/ports/astro/oskar/work/OSKAR-2.8.3/oskar/convert/define_convert_apparent_ra_dec_to_enu_directions.h:18:5: note: in expansion of macro 'SINCOS'
18 | SINCOS(ha_rad, sin_ha, cos_ha);\
| ^~~~~~
/wrkdirs/usr/ports/astro/oskar/work/OSKAR-2.8.3/oskar/convert/src/oskar_convert_apparent_ra_dec_to_enu_directions.c:16:1: note: in expansion of macro 'OSKAR_CONVERT_RA_DEC_TO_ENU_DIR'
16 | OSKAR_CONVERT_RA_DEC_TO_ENU_DIR(oskar_convert_apparent_ra_dec_to_enu_directions_double, double)
| ^~~~~~~~~~~~~~~~~~~~~~~~~~~~~~~
/wrkdirs/usr/ports/astro/oskar/work/OSKAR-2.8.3/oskar/utility/oskar_kernel_macros.h:256:29: error: argument 6 of '__builtin_tgmath' is not a function pointer
256 | #define SINCOS(X, S, C) S = sin(X); C = cos(X)
| ^~~
/wrkdirs/usr/ports/astro/oskar/work/OSKAR-2.8.3/oskar/convert/define_convert_apparent_ra_dec_to_enu_directions.h:19:5: note: in expansion of macro 'SINCOS'
19 | SINCOS(dec_rad[i], sin_dec, cos_dec);\
| ^~~~~~
/wrkdirs/usr/ports/astro/oskar/work/OSKAR-2.8.3/oskar/convert/src/oskar_convert_apparent_ra_dec_to_enu_directions.c:16:1: note: in expansion of macro 'OSKAR_CONVERT_RA_DEC_TO_ENU_DIR'
16 | OSKAR_CONVERT_RA_DEC_TO_ENU_DIR(oskar_convert_apparent_ra_dec_to_enu_directions_double, double)
| ^~~~~~~~~~~~~~~~~~~~~~~~~~~~~~~
/wrkdirs/usr/ports/astro/oskar/work/OSKAR-2.8.3/oskar/utility/oskar_kernel_macros.h:256:41: error: argument 6 of '__builtin_tgmath' is not a function pointer
256 | #define SINCOS(X, S, C) S = sin(X); C = cos(X)
| ^~~
/wrkdirs/usr/ports/astro/oskar/work/OSKAR-2.8.3/oskar/convert/define_convert_apparent_ra_dec_to_enu_directions.h:19:5: note: in expansion of macro 'SINCOS'
19 | SINCOS(dec_rad[i], sin_dec, cos_dec);\
| ^~~~~~
/wrkdirs/usr/ports/astro/oskar/work/OSKAR-2.8.3/oskar/convert/src/oskar_convert_apparent_ra_dec_to_enu_directions.c:16:1: note: in expansion of macro 'OSKAR_CONVERT_RA_DEC_TO_ENU_DIR'
16 | OSKAR_CONVERT_RA_DEC_TO_ENU_DIR(oskar_convert_apparent_ra_dec_to_enu_directions_double, double)
| ^~~~~~~~~~~~~~~~~~~~~~~~~~~~~~~
/wrkdirs/usr/ports/astro/oskar/work/OSKAR-2.8.3/oskar/convert/src/oskar_convert_apparent_ra_dec_to_enu_directions.c: In function 'oskar_convert_apparent_ra_dec_to_enu_directions':
/wrkdirs/usr/ports/astro/oskar/work/OSKAR-2.8.3/oskar/convert/src/oskar_convert_apparent_ra_dec_to_enu_directions.c:26:28: error: 'csinl' undeclared (first use in this function); did you mean 'csinh'?
26 | const double sin_lat = sin(latitude_rad);
| ^~~
/wrkdirs/usr/ports/astro/oskar/work/OSKAR-2.8.3/oskar/convert/src/oskar_convert_apparent_ra_dec_to_enu_directions.c:26:28: error: argument 6 of '__builtin_tgmath' is not a function pointer
/wrkdirs/usr/ports/astro/oskar/work/OSKAR-2.8.3/oskar/convert/src/oskar_convert_apparent_ra_dec_to_enu_directions.c:27:28: error: 'ccosl' undeclared (first use in this function); did you mean 'ccosh'?
27 | const double cos_lat = cos(latitude_rad);
| ^~~
/wrkdirs/usr/ports/astro/oskar/work/OSKAR-2.8.3/oskar/convert/src/oskar_convert_apparent_ra_dec_to_enu_directions.c:27:28: error: argument 6 of '__builtin_tgmath' is not a function pointer
[ 1% 12/613] /usr/local/bin/gcc12 -DH5_BUILT_AS_DYNAMIC_LIB -DOSKAR_HAVE_HDF5 -DOSKAR_NO_MS -DSOURCE_PATH_SIZE=48 -Doskar_EXPORTS -I/wrkdirs/usr/ports/astro/oskar/work/.build -I/wrkdirs/usr/ports/astro/oskar/work/.build/oskar -I/wrkdirs/usr/ports/astro/oskar/work/OSKAR-2.8.3 -I/wrkdirs/usr/ports/astro/oskar/work/OSKAR-2.8.3/oskar -I/wrkdirs/usr/ports/astro/oskar/work/OSKAR-2.8.3/extern -I/wrkdirs/usr/ports/astro/oskar/work/OSKAR-2.8.3/extern/gtest-1.7.0/include -I/wrkdirs/usr/ports/astro/oskar/work/OSKAR-2.8.3/extern/rapidxml-1.13 -I/wrkdirs/usr/ports/astro/oskar/work/OSKAR-2.8.3/extern/cfitsio -I/wrkdirs/usr/ports/astro/oskar/work/OSKAR-2.8.3/extern/Random123 -I/wrkdirs/usr/ports/astro/oskar/work/OSKAR-2.8.3/extern/Random123/features -I/usr/ports/astro/oskar/files -O2 -pipe -fstack-protector-strong -Wl,-rpath=/usr/local/lib/gcc12 -isystem /usr/local/include -fno-strict-aliasing -fopenmp -std=c99 -Wall -Wextra -pedantic -Wcast-qual -Wcast-align -Wno-long-long -Wno-variadic-macros -
Wno-unused-function -Wmissing-prototypes -fvisibility=hidden -fdiagnostics-show-option -O2 -pipe -fstack-protector-strong -Wl,-rpath=/usr/local/lib/gcc12 -isystem /usr/local/include -fno-strict-aliasing -DNDEBUG -fPIC -pthread -MD -MT oskar/CMakeFiles/oskar.dir/beam_pattern/src/private_beam_pattern_generate_coordinates.c.o -MF oskar/CMakeFiles/oskar.dir/beam_pattern/src/private_beam_pattern_generate_coordinates.c.o.d -o oskar/CMakeFiles/oskar.dir/beam_pattern/src/private_beam_pattern_generate_coordinates.c.o -c /wrkdirs/usr/ports/astro/oskar/work/OSKAR-2.8.3/oskar/beam_pattern/src/private_beam_pattern_generate_coordinates.c
[ 1% 12/613] /usr/local/bin/g++12 -DGTEST_CREATE_SHARED_LIBRARY=1 -DOSKAR_HAVE_HDF5 -DSOURCE_PATH_SIZE=48 -I/wrkdirs/usr/ports/astro/oskar/work/.build -I/wrkdirs/usr/ports/astro/oskar/work/.build/oskar -I/wrkdirs/usr/ports/astro/oskar/work/OSKAR-2.8.3 -I/wrkdirs/usr/ports/astro/oskar/work/OSKAR-2.8.3/oskar -I/wrkdirs/usr/ports/astro/oskar/work/OSKAR-2.8.3/extern -I/wrkdirs/usr/ports/astro/oskar/work/OSKAR-2.8.3/extern/gtest-1.7.0/include -I/wrkdirs/usr/ports/astro/oskar/work/OSKAR-2.8.3/extern/rapidxml-1.13 -I/wrkdirs/usr/ports/astro/oskar/work/OSKAR-2.8.3/extern/cfitsio -I/wrkdirs/usr/ports/astro/oskar/work/OSKAR-2.8.3/extern/Random123 -I/wrkdirs/usr/ports/astro/oskar/work/OSKAR-2.8.3/extern/Random123/features -I/usr/ports/astro/oskar/files -I/wrkdirs/usr/ports/astro/oskar/work/OSKAR-2.8.3/extern/gtest-1.7.0 -O2 -pipe -fstack-protector-strong -Wl,-rpath=/usr/local/lib/gcc12 -stdlib=libc++ -Wl,-rpath=/usr/local/lib/gcc12 -isystem /usr/local/include -fopenmp -Wall -Wextra -pedantic
-Wcast-qual -Wcast-align -Wno-long-long -Wno-variadic-macros -Wno-unused-function -fvisibility=hidden -fvisibility-inlines-hidden -fdiagnostics-show-option -O2 -pipe -fstack-protector-strong -Wl,-rpath=/usr/local/lib/gcc12 -stdlib=libc++ -Wl,-rpath=/usr/local/lib/gcc12 -isystem /usr/local/include -DNDEBUG -fPIC -O2 -pipe -fstack-protector-strong -Wl,-rpath=/usr/local/lib/gcc12 -stdlib=libc++ -Wl,-rpath=/usr/local/lib/gcc12 -isystem /usr/local/include -fopenmp -Wall -Wextra -pedantic -Wcast-qual -Wcast-align -Wno-long-long -Wno-variadic-macros -Wno-unused-function -fvisibility=hidden -fvisibility-inlines-hidden -fdiagnostics-show-option -Wall -Wshadow -DGTEST_HAS_PTHREAD=1 -fexceptions -Wextra -Wno-unused-parameter -Wno-missing-field-initializers -Wno-long-long -MD -MT extern/gtest-1.7.0/CMakeFiles/gtest.dir/src/gtest-all.cc.o -MF extern/gtest-1.7.0/CMakeFiles/gtest.dir/src/gtest-all.cc.o.d -o extern/gtest-1.7.0/CMakeFiles/gtest.dir/src/gtest-all.cc.o -c /wrkdirs/usr/ports/astr
o/oskar/work/OSKAR-2.8.3/extern/gtest-1.7.0/!
src/gtest-all.cc
ninja: build stopped: subcommand failed.
===> Compilation failed unexpectedly.
Try to set MAKE_JOBS_UNSAFE=yes and rebuild before reporting the failure to
the maintainer.
*** Error code 1
Stop.
make: stopped in /usr/ports/astro/oskar