[package - main-i386-default][graphics/wdune] Failed for wdune-1.956_2 in build
- Go to: [ bottom of page ] [ top of archives ] [ this month ]
Date: Mon, 26 Jun 2023 15:07:11 UTC
You are receiving this mail as a port that you maintain
is failing to build on the FreeBSD package build server.
Please investigate the failure and submit a PR to fix
build.
Maintainer: pi@FreeBSD.org
Log URL: https://pkg-status.freebsd.org/beefy17/data/main-i386-default/p4785b313b958_se8efee297c/logs/wdune-1.956_2.log
Build URL: https://pkg-status.freebsd.org/beefy17/build.html?mastername=main-i386-default&build=p4785b313b958_se8efee297c
Log:
=>> Building graphics/wdune
build started at Mon Jun 26 15:06:15 UTC 2023
port directory: /usr/ports/graphics/wdune
package name: wdune-1.956_2
building for: FreeBSD main-i386-default-job-06 14.0-CURRENT FreeBSD 14.0-CURRENT 1400091 i386
maintained by: pi@FreeBSD.org
Makefile ident:
Poudriere version: 3.2.8-23-ga7f8d188
Host OSVERSION: 1400089
Jail OSVERSION: 1400091
Job Id: 06
!!! Jail is newer than host. (Jail: 1400091, Host: 1400089) !!!
!!! This is not supported. !!!
!!! Host kernel must be same or newer than jail. !!!
!!! Expect build failures. !!!
---Begin Environment---
SHELL=/bin/sh
UNAME_p=i386
UNAME_m=i386
OSVERSION=1400091
UNAME_v=FreeBSD 14.0-CURRENT 1400091
UNAME_r=14.0-CURRENT
BLOCKSIZE=K
MAIL=/var/mail/root
MM_CHARSET=UTF-8
LANG=C.UTF-8
STATUS=1
HOME=/root
PATH=/sbin:/bin:/usr/sbin:/usr/bin:/usr/local/sbin:/usr/local/bin:/root/bin
LOCALBASE=/usr/local
USER=root
LIBEXECPREFIX=/usr/local/libexec/poudriere
POUDRIERE_VERSION=3.2.8-23-ga7f8d188
MASTERMNT=/usr/local/poudriere/data/.m/main-i386-default/ref
POUDRIERE_BUILD_TYPE=bulk
PACKAGE_BUILDING=yes
SAVED_TERM=
PWD=/usr/local/poudriere/data/.m/main-i386-default/ref/.p/pool
P_PORTS_FEATURES=FLAVORS SELECTED_OPTIONS
MASTERNAME=main-i386-default
SCRIPTPREFIX=/usr/local/share/poudriere
OLDPWD=/usr/local/poudriere/data/.m/main-i386-default/ref/.p
SCRIPTPATH=/usr/local/share/poudriere/bulk.sh
POUDRIEREPATH=/usr/local/bin/poudriere
---End Environment---
---Begin Poudriere Port Flags/Env---
PORT_FLAGS=
PKGENV=
FLAVOR=
DEPENDS_ARGS=
MAKE_ARGS=
---End Poudriere Port Flags/Env---
---Begin OPTIONS List---
===> The following configuration options are available for wdune-1.956_2:
DOCS=on: Build and/or install documentation
===> Use 'make config' to modify these settings
---End OPTIONS List---
--MAINTAINER--
pi@FreeBSD.org
--End MAINTAINER--
--CONFIGURE_ARGS--
--with-optimization --without-devil --with-cgalheaders --with-helpurl="/usr/local/share/doc/wdune/index.html" --x-libraries=/usr/local/lib --x-includes=/usr/local/include --prefix=/usr/local ${_LATE_CONFIGURE_ARGS}
--End CONFIGURE_ARGS--
--CONFIGURE_ENV--
SDL_CONFIG=/usr/local/bin/sdl-config XDG_DATA_HOME=/wrkdirs/usr/ports/graphics/wdune/work XDG_CONFIG_HOME=/wrkdirs/usr/ports/graphics/wdune/work XDG_CACHE_HOME=/wrkdirs/usr/ports/graphics/wdune/work/.cache HOME=/wrkdirs/usr/ports/graphics/wdune/work TMPDIR="/tmp" PATH=/wrkdirs/usr/ports/graphics/wdune/work/.bin:/sbin:/bin:/usr/sbin:/usr/bin:/usr/local/sbin:/usr/local/bin:/root/bin PKG_CONFIG_LIBDIR=/wrkdirs/usr/ports/graphics/wdune/work/.pkgconfig:/usr/local/libdata/pkgconfig:/usr/local/share/pkgconfig:/usr/libdata/pkgconfig SHELL=/bin/sh CONFIG_SHELL=/bin/sh CONFIG_SITE=/usr/ports/Templates/config.site lt_cv_sys_max_cmd_len=524288
--End CONFIGURE_ENV--
--MAKE_ENV--
MOTIFLIB="-L/usr/local/lib -lXm" SDL_CONFIG=/usr/local/bin/sdl-config XDG_DATA_HOME=/wrkdirs/usr/ports/graphics/wdune/work XDG_CONFIG_HOME=/wrkdirs/usr/ports/graphics/wdune/work XDG_CACHE_HOME=/wrkdirs/usr/ports/graphics/wdune/work/.cache HOME=/wrkdirs/usr/ports/graphics/wdune/work TMPDIR="/tmp" PATH=/wrkdirs/usr/ports/graphics/wdune/work/.bin:/sbin:/bin:/usr/sbin:/usr/bin:/usr/local/sbin:/usr/local/bin:/root/bin PKG_CONFIG_LIBDIR=/wrkdirs/usr/ports/graphics/wdune/work/.pkgconfig:/usr/local/libdata/pkgconfig:/usr/local/share/pkgconfig:/usr/libdata/pkgconfig MK_DEBUG_FILES=no MK_KERNEL_SYMBOLS=no SHELL=/bin/sh NO_LINT=YES PREFIX=/usr/local LOCALBASE=/usr/local CC="cc" CFLAGS="-O2 -pipe -fstack-protector-strong -fno-strict-aliasing " CPP="cpp" CPPFLAGS="-I/usr/local/ffmpeg4/include -I/usr/local/include/freetype2 -D__FREEBSD__" LDFLAGS=" -L/usr/local/ffmpeg4/lib -L/usr/local/lib -fstack-protector-strong " LIBS="" CXX="c++" CXXFLAGS="-O2 -pipe -fstack-protector-strong -
fno-strict-aliasing " MANPREFIX="/usr/local" BSD_INSTALL_PROGRAM="install -s -m 555" BSD_INSTALL_LIB="install -s -m 0644" BSD_INSTALL_SCRIPT="install -m 555" BSD_INSTALL_DATA="install -m 0644" BSD_INSTALL_MAN="install -m 444"
--End MAKE_ENV--
--PLIST_SUB--
PORTDOCS="" OSREL=14.0 PREFIX=%D LOCALBASE=/usr/local RESETPREFIX=/usr/local LIB32DIR=lib DOCSDIR="share/doc/wdune" EXAMPLESDIR="share/examples/wdune" DATADIR="share/wdune" WWWDIR="www/wdune" ETCDIR="etc/wdune"
--End PLIST_SUB--
--SUB_LIST--
PREFIX=/usr/local LOCALBASE=/usr/local DATADIR=/usr/local/share/wdune DOCSDIR=/usr/local/share/doc/wdune EXAMPLESDIR=/usr/local/share/examples/wdune WWWDIR=/usr/local/www/wdune ETCDIR=/usr/local/etc/wdune
--End SUB_LIST--
---Begin make.conf---
USE_PACKAGE_DEPENDS=yes
BATCH=yes
WRKDIRPREFIX=/wrkdirs
PORTSDIR=/usr/ports
PACKAGES=/packages
DISTDIR=/distfiles
PACKAGE_BUILDING=yes
PACKAGE_BUILDING_FLAVORS=yes
MACHINE=i386
MACHINE_ARCH=i386
ARCH=${MACHINE_ARCH}
#### /usr/local/etc/poudriere.d/make.conf ####
# XXX: We really need this but cannot use it while 'make checksum' does not
# try the next mirror on checksum failure. It currently retries the same
# failed mirror and then fails rather then trying another. It *does*
# try the next if the size is mismatched though.
#MASTER_SITE_FREEBSD=yes
# Build ALLOW_MAKE_JOBS_PACKAGES with 2 jobs
MAKE_JOBS_NUMBER=2
#### /usr/ports/Mk/Scripts/ports_env.sh ####
_CCVERSION_921dbbb2=FreeBSD clang version 16.0.6 (https://github.com/llvm/llvm-project.git llvmorg-16.0.6-0-g7cbf1a259152) Target: i386-unknown-freebsd14.0 Thread model: posix InstalledDir: /usr/bin
_ALTCCVERSION_921dbbb2=none
_CXXINTERNAL_acaad9ca=FreeBSD clang version 16.0.6 (https://github.com/llvm/llvm-project.git llvmorg-16.0.6-0-g7cbf1a259152) Target: i386-unknown-freebsd14.0 Thread model: posix InstalledDir: /usr/bin "/usr/bin/ld" "--eh-frame-hdr" "-dynamic-linker" "/libexec/ld-elf.so.1" "--hash-style=both" "--enable-new-dtags" "-m" "elf_i386_fbsd" "-o" "a.out" "/usr/lib/crt1.o" "/usr/lib/crti.o" "/usr/lib/crtbegin.o" "-L/usr/lib" "/dev/null" "-lc++" "-lm" "-lgcc" "--as-needed" "-lgcc_s" "--no-as-needed" "-lc" "-lgcc" "--as-needed" "-lgcc_s" "--no-as-needed" "/usr/lib/crtend.o" "/usr/lib/crtn.o"
CC_OUTPUT_921dbbb2_58173849=yes
CC_OUTPUT_921dbbb2_9bdba57c=yes
CC_OUTPUT_921dbbb2_6a4fe7f5=yes
CC_OUTPUT_921dbbb2_6bcac02b=yes
CC_OUTPUT_921dbbb2_67d20829=yes
CC_OUTPUT_921dbbb2_bfa62e83=yes
CC_OUTPUT_921dbbb2_f0b4d593=yes
CC_OUTPUT_921dbbb2_308abb44=yes
CC_OUTPUT_921dbbb2_f00456e5=yes
CC_OUTPUT_921dbbb2_65ad290d=yes
CC_OUTPUT_921dbbb2_f2776b26=yes
CC_OUTPUT_921dbbb2_53255a77=yes
CC_OUTPUT_921dbbb2_911cfe02=yes
CC_OUTPUT_921dbbb2_b2657cc3=yes
CC_OUTPUT_921dbbb2_380987f7=yes
CC_OUTPUT_921dbbb2_160933ec=yes
CC_OUTPUT_921dbbb2_fb62803b=yes
CC_OUTPUT_921dbbb2_af59ad06=yes
CC_OUTPUT_921dbbb2_a15f3fcf=yes
_OBJC_CCVERSION_921dbbb2=FreeBSD clang version 16.0.6 (https://github.com/llvm/llvm-project.git llvmorg-16.0.6-0-g7cbf1a259152) Target: i386-unknown-freebsd14.0 Thread model: posix InstalledDir: /usr/bin
_OBJC_ALTCCVERSION_921dbbb2=none
ARCH=i386
OPSYS=FreeBSD
_OSRELEASE=14.0-CURRENT
OSREL=14.0
OSVERSION=1400091
PYTHONBASE=/usr/local
CONFIGURE_MAX_CMD_LEN=524288
HAVE_PORTS_ENV=1
#### Misc Poudriere ####
GID=0
UID=0
---End make.conf---
--Resource limits--
cpu time (seconds, -t) unlimited
file size (512-blocks, -f) unlimited
data seg size (kbytes, -d) 524288
stack size (kbytes, -s) 65536
core file size (512-blocks, -c) unlimited
max memory size (kbytes, -m) unlimited
locked memory (kbytes, -l) unlimited
max user processes (-u) 89999
open files (-n) 1024
virtual mem size (kbytes, -v) unlimited
swap limit (kbytes, -w) unlimited
socket buffer size (bytes, -b) unlimited
pseudo-terminals (-p) unlimited
kqueues (-k) unlimited
umtx shared locks (-o) unlimited
--End resource limits--
=======================<phase: check-sanity >============================
===> License GPLv2 accepted by the user
===========================================================================
=======================<phase: pkg-depends >============================
===> wdune-1.956_2 depends on file: /usr/local/sbin/pkg - not found
===> Installing existing package /packages/All/pkg-1.19.1_1.pkg
[main-i386-default-job-06] Installing pkg-1.19.1_1...
[main-i386-default-job-06] Extracting pkg-1.19.1_1: .......... done
===> wdune-1.956_2 depends on file: /usr/local/sbin/pkg - found
===> Returning to build of wdune-1.956_2
===========================================================================
=======================<phase: fetch-depends >============================
===========================================================================
=======================<phase: fetch >============================
===> License GPLv2 accepted by the user
===> Fetching all distfiles required by wdune-1.956_2 for building
===========================================================================
=======================<phase: checksum >============================
===> License GPLv2 accepted by the user
===> Fetching all distfiles required by wdune-1.956_2 for building
=> SHA256 Checksum OK for wdune-1.956.tar.bz2.
===========================================================================
=======================<phase: extract-depends>============================
===========================================================================
=======================<phase: extract >============================
===> License GPLv2 accepted by the user
===> Fetching all distfiles required by wdune-1.956_2 for building
===> Extracting for wdune-1.956_2
=> SHA256 Checksum OK for wdune-1.956.tar.bz2.
===========================================================================
=======================<phase: patch-depends >============================
===========================================================================
=======================<phase: patch >============================
===> Patching for wdune-1.956_2
<snip>
In file included from ./GeometryNode.h:25:
In file included from ./NodeAppearance.h:26:
In file included from ./Proto.h:478:
In file included from ./DynamicFieldsNode.h:28:
In file included from ./SFMFTypes.h:51:
./SFInt32.h:51:32: warning: 'this' pointer cannot be null in well-defined C++ code; comparison may be assumed to always evaluate to false [-Wtautological-undefined-compare]
if (this == NULL)
^~~~ ~~~~
In file included from MeshSubdivide.cpp:24:
In file included from ./NodeIndexedFaceSet.h:24:
In file included from ./MeshBasedNode.h:24:
In file included from ./GeometryNode.h:25:
In file included from ./NodeAppearance.h:26:
In file included from ./Proto.h:478:
In file included from ./DynamicFieldsNode.h:28:
In file included from ./SFMFTypes.h:54:
./SFNode.h:68:46: warning: 'this' pointer cannot be null in well-defined C++ code; comparison may be assumed to always evaluate to false [-Wtautological-undefined-compare]
if (this==NULL) return NULL;
^~~~ ~~~~
In file included from MeshSubdivide.cpp:24:
In file included from ./NodeIndexedFaceSet.h:24:
In file included from ./MeshBasedNode.h:24:
In file included from ./GeometryNode.h:25:
In file included from ./NodeAppearance.h:26:
In file included from ./Proto.h:478:
In file included from ./DynamicFieldsNode.h:28:
In file included from ./SFMFTypes.h:56:
./SFString.h:41:32: warning: 'this' pointer cannot be null in well-defined C++ code; comparison may be assumed to always evaluate to false [-Wtautological-undefined-compare]
if (this == NULL)
^~~~ ~~~~
In file included from MeshSubdivide.cpp:29:
./MyMesh.h:2134:21: warning: comparison of array 'vertexInfo->normal' not equal to a null pointer is always true [-Wtautological-pointer-compare]
if (vertexInfo->normal != NULL) {
~~~~~~~~~~~~^~~~~~ ~~~~
./MyMesh.h:2144:21: warning: comparison of array 'vertexInfo->color' not equal to a null pointer is always true [-Wtautological-pointer-compare]
if (vertexInfo->color != NULL) {
~~~~~~~~~~~~^~~~~ ~~~~
./MyMesh.h:2155:21: warning: comparison of array 'vertexInfo->texCoord' not equal to a null pointer is always true [-Wtautological-pointer-compare]
if (vertexInfo->texCoord != NULL) {
~~~~~~~~~~~~^~~~~~~~ ~~~~
--- Util.o ---
In file included from Util.cpp:845:
In file included from /usr/local/include/CGAL/Exact_predicates_inexact_constructions_kernel.h:20:
In file included from /usr/local/include/CGAL/Simple_cartesian.h:20:
In file included from /usr/local/include/CGAL/Cartesian/Cartesian_base.h:21:
In file included from /usr/local/include/CGAL/basic_classes.h:23:
In file included from /usr/local/include/CGAL/Bbox_2.h:22:
In file included from /usr/local/include/CGAL/Dimension.h:20:
In file included from .//../vcglib/eigenlib/Eigen/Core:276:
.//../vcglib/eigenlib/Eigen/src/Core/Functors.h:973:28: error: no member named 'binder2nd' in namespace 'std'
struct functor_traits<std::binder2nd<T> >
~~~~~^
.//../vcglib/eigenlib/Eigen/src/Core/Functors.h:973:38: error: 'T' does not refer to a value
struct functor_traits<std::binder2nd<T> >
^
.//../vcglib/eigenlib/Eigen/src/Core/Functors.h:972:19: note: declared here
template<typename T>
^
.//../vcglib/eigenlib/Eigen/src/Core/Functors.h:973:41: error: expected unqualified-id
struct functor_traits<std::binder2nd<T> >
^
.//../vcglib/eigenlib/Eigen/src/Core/Functors.h:977:28: error: no member named 'binder1st' in namespace 'std'
struct functor_traits<std::binder1st<T> >
~~~~~^
.//../vcglib/eigenlib/Eigen/src/Core/Functors.h:977:38: error: 'T' does not refer to a value
struct functor_traits<std::binder1st<T> >
^
.//../vcglib/eigenlib/Eigen/src/Core/Functors.h:976:19: note: declared here
template<typename T>
^
.//../vcglib/eigenlib/Eigen/src/Core/Functors.h:977:41: error: expected unqualified-id
struct functor_traits<std::binder1st<T> >
^
--- MeshSubdivide.o ---
15 warnings generated.
--- Scene.o ---
c++ -O2 -g -I. -Iswt/include -I/usr/local/ffmpeg4/include -I/usr/local/include/freetype2 -D__FREEBSD__ -I/usr/local/include -I/usr/local/include/eigenlib -I/usr/include/vcglib -I.//src -I.//vcglib -I.//vcglib/eigenlib -I/wrkdirs/usr/ports/graphics/wdune/work/vcglib -I.//../vcglib -I/wrkdirs/usr/ports/graphics/wdune/work/vcglib/eigenlib -I.//../vcglib/eigenlib -I/usr/include/freetype2/ -I/opt/X11/include/freetype2/ -I/usr/include/ffmpeg/ -I/usr/local/include -I/usr/local/include -I/usr/local/include -g -O0 -fopenmp -g -O0 -O2 -pipe -fstack-protector-strong -fno-strict-aliasing -fopenmp -c -o Scene.o Scene.cpp
In file included from Scene.cpp:68:
In file included from ./Scene.h:32:
In file included from ./NodeList.h:28:
./Node.h:664:31: warning: 'this' pointer cannot be null in well-defined C++ code; comparison may be assumed to always evaluate to false [-Wtautological-undefined-compare]
if (this == NULL)
^~~~ ~~~~
./Node.h:1165:31: warning: 'this' pointer cannot be null in well-defined C++ code; comparison may be assumed to always evaluate to false [-Wtautological-undefined-compare]
if (this == NULL)
^~~~ ~~~~
In file included from Scene.cpp:68:
In file included from ./Scene.h:35:
./Proto.h:302:35: warning: 'this' pointer cannot be null in well-defined C++ code; comparison may be assumed to always evaluate to false [-Wtautological-undefined-compare]
if (this == NULL)
^~~~ ~~~~
In file included from Scene.cpp:68:
In file included from ./Scene.h:35:
In file included from ./Proto.h:478:
In file included from ./DynamicFieldsNode.h:28:
In file included from ./SFMFTypes.h:28:
In file included from ./MFBool.h:25:
./FieldValue.h:122:32: warning: 'this' pointer cannot be null in well-defined C++ code; comparison may be assumed to always evaluate to true [-Wtautological-undefined-compare]
if (this != NULL)
^~~~ ~~~~
In file included from Scene.cpp:68:
In file included from ./Scene.h:35:
In file included from ./Proto.h:478:
In file included from ./DynamicFieldsNode.h:28:
In file included from ./SFMFTypes.h:29:
In file included from ./MFColor.h:24:
In file included from ./MFFloat.h:26:
./SFFloat.h:51:32: warning: 'this' pointer cannot be null in well-defined C++ code; comparison may be assumed to always evaluate to false [-Wtautological-undefined-compare]
if (this == NULL)
^~~~ ~~~~
./SFFloat.h:65:33: warning: 'this' pointer cannot be null in well-defined C++ code; comparison may be assumed to always evaluate to false [-Wtautological-undefined-compare]
if (this == NULL)
^~~~ ~~~~
In file included from Scene.cpp:68:
In file included from ./Scene.h:35:
In file included from ./Proto.h:478:
In file included from ./DynamicFieldsNode.h:28:
In file included from ./SFMFTypes.h:36:
./MFNode.h:64:32: warning: 'this' pointer cannot be null in well-defined C++ code; comparison may be assumed to always evaluate to false [-Wtautological-undefined-compare]
if (this == NULL)
^~~~ ~~~~
./MFNode.h:74:32: warning: 'this' pointer cannot be null in well-defined C++ code; comparison may be assumed to always evaluate to false [-Wtautological-undefined-compare]
if (this == NULL)
^~~~ ~~~~
In file included from Scene.cpp:68:
In file included from ./Scene.h:35:
In file included from ./Proto.h:478:
In file included from ./DynamicFieldsNode.h:28:
In file included from ./SFMFTypes.h:45:
./SFBool.h:55:32: warning: 'this' pointer cannot be null in well-defined C++ code; comparison may be assumed to always evaluate to false [-Wtautological-undefined-compare]
if (this == NULL)
^~~~ ~~~~
In file included from Scene.cpp:68:
In file included from ./Scene.h:35:
In file included from ./Proto.h:478:
In file included from ./DynamicFieldsNode.h:28:
In file included from ./SFMFTypes.h:51:
./SFInt32.h:51:32: warning: 'this' pointer cannot be null in well-defined C++ code; comparison may be assumed to always evaluate to false [-Wtautological-undefined-compare]
if (this == NULL)
^~~~ ~~~~
In file included from Scene.cpp:68:
In file included from ./Scene.h:35:
In file included from ./Proto.h:478:
In file included from ./DynamicFieldsNode.h:28:
In file included from ./SFMFTypes.h:54:
./SFNode.h:68:46: warning: 'this' pointer cannot be null in well-defined C++ code; comparison may be assumed to always evaluate to false [-Wtautological-undefined-compare]
if (this==NULL) return NULL;
^~~~ ~~~~
In file included from Scene.cpp:68:
In file included from ./Scene.h:35:
In file included from ./Proto.h:478:
In file included from ./DynamicFieldsNode.h:28:
In file included from ./SFMFTypes.h:56:
./SFString.h:41:32: warning: 'this' pointer cannot be null in well-defined C++ code; comparison may be assumed to always evaluate to false [-Wtautological-undefined-compare]
if (this == NULL)
^~~~ ~~~~
In file included from Scene.cpp:89:
./Field.h:49:28: warning: 'this' pointer cannot be null in well-defined C++ code; comparison may be assumed to always evaluate to false [-Wtautological-undefined-compare]
if (this == NULL)
^~~~ ~~~~
In file included from Scene.cpp:117:
In file included from ./NodeIndexedTriangleSet.h:28:
./MyMesh.h:2134:21: warning: comparison of array 'vertexInfo->normal' not equal to a null pointer is always true [-Wtautological-pointer-compare]
if (vertexInfo->normal != NULL) {
~~~~~~~~~~~~^~~~~~ ~~~~
./MyMesh.h:2144:21: warning: comparison of array 'vertexInfo->color' not equal to a null pointer is always true [-Wtautological-pointer-compare]
if (vertexInfo->color != NULL) {
~~~~~~~~~~~~^~~~~ ~~~~
./MyMesh.h:2155:21: warning: comparison of array 'vertexInfo->texCoord' not equal to a null pointer is always true [-Wtautological-pointer-compare]
if (vertexInfo->texCoord != NULL) {
~~~~~~~~~~~~^~~~~~~~ ~~~~
--- Util.o ---
15 warnings and 6 errors generated.
*** [Util.o] Error code 1
make[3]: stopped in /wrkdirs/usr/ports/graphics/wdune/work/wdune-1.956/src
--- Scene.o ---
16 warnings generated.
1 error
make[3]: stopped in /wrkdirs/usr/ports/graphics/wdune/work/wdune-1.956/src
*** [target] Error code 2
make[2]: stopped in /wrkdirs/usr/ports/graphics/wdune/work/wdune-1.956/src
1 error
make[2]: stopped in /wrkdirs/usr/ports/graphics/wdune/work/wdune-1.956/src
*** [dune] Error code 2
make[1]: stopped in /wrkdirs/usr/ports/graphics/wdune/work/wdune-1.956
1 error
make[1]: stopped in /wrkdirs/usr/ports/graphics/wdune/work/wdune-1.956
===> Compilation failed unexpectedly.
Try to set MAKE_JOBS_UNSAFE=yes and rebuild before reporting the failure to
the maintainer.
*** Error code 1
Stop.
make: stopped in /usr/ports/graphics/wdune