[package - 131powerpc64-quarterly][devel/concurrencpp] Failed for concurrencpp-0.1.6 in build
- Go to: [ bottom of page ] [ top of archives ] [ this month ]
Date: Tue, 06 Jun 2023 14:16:09 UTC
You are receiving this mail as a port that you maintain
is failing to build on the FreeBSD package build server.
Please investigate the failure and submit a PR to fix
build.
Maintainer: yuri@FreeBSD.org
Log URL: https://pkg-status.freebsd.org/foul1/data/131powerpc64-quarterly/56083eef528f/logs/concurrencpp-0.1.6.log
Build URL: https://pkg-status.freebsd.org/foul1/build.html?mastername=131powerpc64-quarterly&build=56083eef528f
Log:
=>> Building devel/concurrencpp
build started at Tue Jun 6 14:15:12 UTC 2023
port directory: /usr/ports/devel/concurrencpp
package name: concurrencpp-0.1.6
building for: FreeBSD 131powerpc64-quarterly-job-08 13.1-RELEASE FreeBSD 13.1-RELEASE powerpc
maintained by: yuri@FreeBSD.org
Makefile ident:
Poudriere version: 3.2.8-23-ga7f8d188
Host OSVERSION: 1400089
Jail OSVERSION: 1301000
Job Id: 08
---Begin Environment---
SHELL=/bin/csh
OSVERSION=1301000
UNAME_v=FreeBSD 13.1-RELEASE
UNAME_r=13.1-RELEASE
BLOCKSIZE=K
MAIL=/var/mail/root
MM_CHARSET=UTF-8
LANG=C.UTF-8
STATUS=1
HOME=/root
PATH=/sbin:/bin:/usr/sbin:/usr/bin:/usr/local/sbin:/usr/local/bin:/root/bin
LOCALBASE=/usr/local
USER=root
LIBEXECPREFIX=/usr/local/libexec/poudriere
POUDRIERE_VERSION=3.2.8-23-ga7f8d188
MASTERMNT=/usr/local/poudriere/data/.m/131powerpc64-quarterly/ref
POUDRIERE_BUILD_TYPE=bulk
PACKAGE_BUILDING=yes
SAVED_TERM=
PWD=/usr/local/poudriere/data/.m/131powerpc64-quarterly/ref/.p/pool
P_PORTS_FEATURES=FLAVORS SELECTED_OPTIONS
MASTERNAME=131powerpc64-quarterly
SCRIPTPREFIX=/usr/local/share/poudriere
OLDPWD=/usr/local/poudriere/data/.m/131powerpc64-quarterly/ref/.p
SCRIPTPATH=/usr/local/share/poudriere/bulk.sh
POUDRIEREPATH=/usr/local/bin/poudriere
---End Environment---
---Begin Poudriere Port Flags/Env---
PORT_FLAGS=
PKGENV=
FLAVOR=
DEPENDS_ARGS=
MAKE_ARGS=
---End Poudriere Port Flags/Env---
---Begin OPTIONS List---
---End OPTIONS List---
--MAINTAINER--
yuri@FreeBSD.org
--End MAINTAINER--
--CONFIGURE_ARGS--
--End CONFIGURE_ARGS--
--CONFIGURE_ENV--
XDG_DATA_HOME=/wrkdirs/usr/ports/devel/concurrencpp/work XDG_CONFIG_HOME=/wrkdirs/usr/ports/devel/concurrencpp/work XDG_CACHE_HOME=/wrkdirs/usr/ports/devel/concurrencpp/work/.cache HOME=/wrkdirs/usr/ports/devel/concurrencpp/work TMPDIR="/tmp" PATH=/wrkdirs/usr/ports/devel/concurrencpp/work/.bin:/sbin:/bin:/usr/sbin:/usr/bin:/usr/local/sbin:/usr/local/bin:/root/bin PKG_CONFIG_LIBDIR=/wrkdirs/usr/ports/devel/concurrencpp/work/.pkgconfig:/usr/local/libdata/pkgconfig:/usr/local/share/pkgconfig:/usr/libdata/pkgconfig SHELL=/bin/sh CONFIG_SHELL=/bin/sh
--End CONFIGURE_ENV--
--MAKE_ENV--
NINJA_STATUS="[%p %s/%t] " XDG_DATA_HOME=/wrkdirs/usr/ports/devel/concurrencpp/work XDG_CONFIG_HOME=/wrkdirs/usr/ports/devel/concurrencpp/work XDG_CACHE_HOME=/wrkdirs/usr/ports/devel/concurrencpp/work/.cache HOME=/wrkdirs/usr/ports/devel/concurrencpp/work TMPDIR="/tmp" PATH=/wrkdirs/usr/ports/devel/concurrencpp/work/.bin:/sbin:/bin:/usr/sbin:/usr/bin:/usr/local/sbin:/usr/local/bin:/root/bin PKG_CONFIG_LIBDIR=/wrkdirs/usr/ports/devel/concurrencpp/work/.pkgconfig:/usr/local/libdata/pkgconfig:/usr/local/share/pkgconfig:/usr/libdata/pkgconfig MK_DEBUG_FILES=no MK_KERNEL_SYMBOLS=no SHELL=/bin/sh NO_LINT=YES DESTDIR=/wrkdirs/usr/ports/devel/concurrencpp/work/stage PREFIX=/usr/local LOCALBASE=/usr/local CC="cc" CFLAGS="-O2 -pipe -fstack-protector-strong -fno-strict-aliasing " CPP="cpp" CPPFLAGS="" LDFLAGS=" -fstack-protector-strong " LIBS="" CXX="c++" CXXFLAGS="-O2 -pipe -fstack-protector-strong -fno-strict-aliasing " MANPREFIX="/usr/local" BSD_INSTALL_PROGRAM="install -s -m 555
" BSD_INSTALL_LIB="install -s -m 0644" BSD_INSTALL_SCRIPT="install -m 555" BSD_INSTALL_DATA="install -m 0644" BSD_INSTALL_MAN="install -m 444"
--End MAKE_ENV--
--PLIST_SUB--
CMAKE_BUILD_TYPE="release" OSREL=13.1 PREFIX=%D LOCALBASE=/usr/local RESETPREFIX=/usr/local LIB32DIR=lib DOCSDIR="share/doc/concurrencpp" EXAMPLESDIR="share/examples/concurrencpp" DATADIR="share/concurrencpp" WWWDIR="www/concurrencpp" ETCDIR="etc/concurrencpp"
--End PLIST_SUB--
--SUB_LIST--
PREFIX=/usr/local LOCALBASE=/usr/local DATADIR=/usr/local/share/concurrencpp DOCSDIR=/usr/local/share/doc/concurrencpp EXAMPLESDIR=/usr/local/share/examples/concurrencpp WWWDIR=/usr/local/www/concurrencpp ETCDIR=/usr/local/etc/concurrencpp
--End SUB_LIST--
---Begin make.conf---
USE_PACKAGE_DEPENDS=yes
BATCH=yes
WRKDIRPREFIX=/wrkdirs
PORTSDIR=/usr/ports
PACKAGES=/packages
DISTDIR=/distfiles
PACKAGE_BUILDING=yes
PACKAGE_BUILDING_FLAVORS=yes
#### /usr/local/etc/poudriere.d/make.conf ####
# XXX: We really need this but cannot use it while 'make checksum' does not
# try the next mirror on checksum failure. It currently retries the same
# failed mirror and then fails rather then trying another. It *does*
# try the next if the size is mismatched though.
#MASTER_SITE_FREEBSD=yes
# Build ALLOW_MAKE_JOBS_PACKAGES with 2 jobs
MAKE_JOBS_NUMBER=2
#### /usr/ports/Mk/Scripts/ports_env.sh ####
_CCVERSION_921dbbb2=FreeBSD clang version 13.0.0 (git@github.com:llvm/llvm-project.git llvmorg-13.0.0-0-gd7b669b3a303) Target: powerpc64-unknown-freebsd13.1 Thread model: posix InstalledDir: /usr/bin
_ALTCCVERSION_921dbbb2=none
_CXXINTERNAL_acaad9ca=FreeBSD clang version 13.0.0 (git@github.com:llvm/llvm-project.git llvmorg-13.0.0-0-gd7b669b3a303) Target: powerpc64-unknown-freebsd13.1 Thread model: posix InstalledDir: /usr/bin "/usr/bin/ld" "--eh-frame-hdr" "-dynamic-linker" "/libexec/ld-elf.so.1" "--enable-new-dtags" "-o" "a.out" "/usr/lib/crt1.o" "/usr/lib/crti.o" "/usr/lib/crtbegin.o" "-L/usr/lib" "/dev/null" "-lc++" "-lm" "-lgcc" "--as-needed" "-lgcc_s" "--no-as-needed" "-lc" "-lgcc" "--as-needed" "-lgcc_s" "--no-as-needed" "/usr/lib/crtend.o" "/usr/lib/crtn.o"
CC_OUTPUT_921dbbb2_58173849=yes
CC_OUTPUT_921dbbb2_9bdba57c=yes
CC_OUTPUT_921dbbb2_6a4fe7f5=yes
CC_OUTPUT_921dbbb2_6bcac02b=yes
CC_OUTPUT_921dbbb2_67d20829=yes
CC_OUTPUT_921dbbb2_bfa62e83=yes
CC_OUTPUT_921dbbb2_f0b4d593=yes
CC_OUTPUT_921dbbb2_308abb44=yes
CC_OUTPUT_921dbbb2_f00456e5=yes
CC_OUTPUT_921dbbb2_65ad290d=yes
CC_OUTPUT_921dbbb2_f2776b26=yes
CC_OUTPUT_921dbbb2_53255a77=yes
CC_OUTPUT_921dbbb2_911cfe02=yes
CC_OUTPUT_921dbbb2_b2657cc3=yes
CC_OUTPUT_921dbbb2_380987f7=yes
CC_OUTPUT_921dbbb2_160933ec=yes
CC_OUTPUT_921dbbb2_fb62803b=yes
CC_OUTPUT_921dbbb2_af59ad06=yes
CC_OUTPUT_921dbbb2_a15f3fcf=yes
_OBJC_CCVERSION_921dbbb2=FreeBSD clang version 13.0.0 (git@github.com:llvm/llvm-project.git llvmorg-13.0.0-0-gd7b669b3a303) Target: powerpc64-unknown-freebsd13.1 Thread model: posix InstalledDir: /usr/bin
_OBJC_ALTCCVERSION_921dbbb2=none
ARCH=powerpc64
PPC_ABI=ELFv2
OPSYS=FreeBSD
_OSRELEASE=13.1-RELEASE
OSREL=13.1
OSVERSION=1301000
PYTHONBASE=/usr/local
CONFIGURE_MAX_CMD_LEN=524288
HAVE_PORTS_ENV=1
#### Misc Poudriere ####
GID=0
UID=0
---End make.conf---
--Resource limits--
cpu time (seconds, -t) unlimited
file size (512-blocks, -f) unlimited
data seg size (kbytes, -d) 33554432
stack size (kbytes, -s) 524288
core file size (512-blocks, -c) unlimited
max memory size (kbytes, -m) unlimited
locked memory (kbytes, -l) unlimited
max user processes (-u) 89999
open files (-n) 1024
virtual mem size (kbytes, -v) unlimited
swap limit (kbytes, -w) unlimited
socket buffer size (bytes, -b) unlimited
pseudo-terminals (-p) unlimited
kqueues (-k) unlimited
umtx shared locks (-o) unlimited
--End resource limits--
=======================<phase: check-sanity >============================
===> License MIT accepted by the user
===========================================================================
=======================<phase: pkg-depends >============================
===> concurrencpp-0.1.6 depends on file: /usr/local/sbin/pkg - not found
===> Installing existing package /packages/All/pkg-1.19.1_1.pkg
[131powerpc64-quarterly-job-08] Installing pkg-1.19.1_1...
[131powerpc64-quarterly-job-08] Extracting pkg-1.19.1_1: .......... done
===> concurrencpp-0.1.6 depends on file: /usr/local/sbin/pkg - found
===> Returning to build of concurrencpp-0.1.6
===========================================================================
=======================<phase: fetch-depends >============================
===========================================================================
=======================<phase: fetch >============================
===> License MIT accepted by the user
===> Fetching all distfiles required by concurrencpp-0.1.6 for building
===========================================================================
=======================<phase: checksum >============================
===> License MIT accepted by the user
===> Fetching all distfiles required by concurrencpp-0.1.6 for building
=> SHA256 Checksum OK for David-Haim-concurrencpp-v.0.1.6_GH0.tar.gz.
===========================================================================
=======================<phase: extract-depends>============================
===========================================================================
=======================<phase: extract >============================
===> License MIT accepted by the user
===> Fetching all distfiles required by concurrencpp-0.1.6 for building
===> Extracting for concurrencpp-0.1.6
=> SHA256 Checksum OK for David-Haim-concurrencpp-v.0.1.6_GH0.tar.gz.
===========================================================================
=======================<phase: patch-depends >============================
===========================================================================
=======================<phase: patch >============================
===> Patching for concurrencpp-0.1.6
===> Applying FreeBSD patches for concurrencpp-0.1.6 from /usr/ports/devel/concurrencpp/files
===========================================================================
=======================<phase: build-depends >============================
===> concurrencpp-0.1.6 depends on file: /usr/local/bin/cmake - not found
===> Installing existing package /packages/All/cmake-core-3.25.1_1.pkg
[131powerpc64-quarterly-job-08] Installing cmake-core-3.25.1_1...
[131powerpc64-quarterly-job-08] `-- Installing expat-2.5.0...
[131powerpc64-quarterly-job-08] `-- Extracting expat-2.5.0: .......... done
[131powerpc64-quarterly-job-08] `-- Installing jsoncpp-1.9.5...
[131powerpc64-quarterly-job-08] `-- Extracting jsoncpp-1.9.5: .......... done
[131powerpc64-quarterly-job-08] `-- Installing libuv-1.44.2...
[131powerpc64-quarterly-job-08] `-- Extracting libuv-1.44.2: .......... done
[131powerpc64-quarterly-job-08] `-- Installing rhash-1.4.3...
[131powerpc64-quarterly-job-08] | `-- Installing gettext-runtime-0.21.1...
[131powerpc64-quarterly-job-08] | | `-- Installing indexinfo-0.3.1...
[131powerpc64-quarterly-job-08] | | `-- Extracting indexinfo-0.3.1: .... done
[131powerpc64-quarterly-job-08] | `-- Extracting gettext-runtime-0.21.1: .......... done
[131powerpc64-quarterly-job-08] `-- Extracting rhash-1.4.3: .......... done
[131powerpc64-quarterly-job-08] Extracting cmake-core-3.25.1_1: .......... done
===> concurrencpp-0.1.6 depends on file: /usr/local/bin/cmake - found
===> Returning to build of concurrencpp-0.1.6
===> concurrencpp-0.1.6 depends on executable: ninja - not found
===> Installing existing package /packages/All/ninja-1.11.1,2.pkg
[131powerpc64-quarterly-job-08] Installing ninja-1.11.1,2...
[131powerpc64-quarterly-job-08] `-- Installing python39-3.9.16_2...
[131powerpc64-quarterly-job-08] | `-- Installing libffi-3.4.4...
[131powerpc64-quarterly-job-08] | `-- Extracting libffi-3.4.4: .......... done
[131powerpc64-quarterly-job-08] | `-- Installing mpdecimal-2.5.1...
[131powerpc64-quarterly-job-08] | `-- Extracting mpdecimal-2.5.1: .......... done
[131powerpc64-quarterly-job-08] | `-- Installing readline-8.2.1...
[131powerpc64-quarterly-job-08] | `-- Extracting readline-8.2.1: .......... done
[131powerpc64-quarterly-job-08] `-- Extracting python39-3.9.16_2: .......... done
[131powerpc64-quarterly-job-08] Extracting ninja-1.11.1,2: ........ done
=====
Message from python39-3.9.16_2:
--
Note that some standard Python modules are provided as separate ports
as they require additional dependencies. They are available as:
py39-gdbm databases/py-gdbm@py39
py39-sqlite3 databases/py-sqlite3@py39
py39-tkinter x11-toolkits/py-tkinter@py39
===> concurrencpp-0.1.6 depends on executable: ninja - found
===> Returning to build of concurrencpp-0.1.6
===========================================================================
=======================<phase: lib-depends >============================
===========================================================================
=======================<phase: configure >============================
===> Configuring for concurrencpp-0.1.6
===> Performing out-of-source build
/bin/mkdir -p /wrkdirs/usr/ports/devel/concurrencpp/work/.build
-- The CXX compiler identification is Clang 13.0.0
-- Detecting CXX compiler ABI info
-- Detecting CXX compiler ABI info - done
-- Check for working CXX compiler: /usr/bin/c++ - skipped
-- Detecting CXX compile features
-- Detecting CXX compile features - done
-- Performing Test CMAKE_HAVE_LIBC_PTHREAD
-- Performing Test CMAKE_HAVE_LIBC_PTHREAD - Failed
-- Looking for pthread_create in pthreads
-- Looking for pthread_create in pthreads - not found
-- Looking for pthread_create in pthread
-- Looking for pthread_create in pthread - found
-- Found Threads: TRUE
-- Configuring done
-- Generating done
CMake Warning:
Manually-specified variables were not used by the project:
CMAKE_COLOR_MAKEFILE
CMAKE_C_COMPILER
CMAKE_C_FLAGS
CMAKE_C_FLAGS_DEBUG
CMAKE_C_FLAGS_RELEASE
CMAKE_MODULE_LINKER_FLAGS
CMAKE_VERBOSE_MAKEFILE
FETCHCONTENT_FULLY_DISCONNECTED
-- Build files have been written to: /wrkdirs/usr/ports/devel/concurrencpp/work/.build
===========================================================================
=======================<phase: build >============================
===> Building for concurrencpp-0.1.6
[ 5% 2/18] /usr/bin/c++ -DCRCPP_EXPORT_API -Dconcurrencpp_EXPORTS -isystem /wrkdirs/usr/ports/devel/concurrencpp/work/concurrencpp-v.0.1.6/include -O2 -pipe -fstack-protector-strong -fno-strict-aliasing -O2 -pipe -fstack-protector-strong -fno-strict-aliasing -DNDEBUG -fPIC -fvisibility=hidden -fvisibility-inlines-hidden -pthread -std=c++20 -MD -MT CMakeFiles/concurrencpp.dir/source/task.cpp.o -MF CMakeFiles/concurrencpp.dir/source/task.cpp.o.d -o CMakeFiles/concurrencpp.dir/source/task.cpp.o -c /wrkdirs/usr/ports/devel/concurrencpp/work/concurrencpp-v.0.1.6/source/task.cpp
[ 11% 3/18] /usr/bin/c++ -DCRCPP_EXPORT_API -Dconcurrencpp_EXPORTS -isystem /wrkdirs/usr/ports/devel/concurrencpp/work/concurrencpp-v.0.1.6/include -O2 -pipe -fstack-protector-strong -fno-strict-aliasing -O2 -pipe -fstack-protector-strong -fno-strict-aliasing -DNDEBUG -fPIC -fvisibility=hidden -fvisibility-inlines-hidden -pthread -std=c++20 -MD -MT CMakeFiles/concurrencpp.dir/source/executors/executor.cpp.o -MF CMakeFiles/concurrencpp.dir/source/executors/executor.cpp.o.d -o CMakeFiles/concurrencpp.dir/source/executors/executor.cpp.o -c /wrkdirs/usr/ports/devel/concurrencpp/work/concurrencpp-v.0.1.6/source/executors/executor.cpp
[ 16% 4/18] /usr/bin/c++ -DCRCPP_EXPORT_API -Dconcurrencpp_EXPORTS -isystem /wrkdirs/usr/ports/devel/concurrencpp/work/concurrencpp-v.0.1.6/include -O2 -pipe -fstack-protector-strong -fno-strict-aliasing -O2 -pipe -fstack-protector-strong -fno-strict-aliasing -DNDEBUG -fPIC -fvisibility=hidden -fvisibility-inlines-hidden -pthread -std=c++20 -MD -MT CMakeFiles/concurrencpp.dir/source/executors/thread_executor.cpp.o -MF CMakeFiles/concurrencpp.dir/source/executors/thread_executor.cpp.o.d -o CMakeFiles/concurrencpp.dir/source/executors/thread_executor.cpp.o -c /wrkdirs/usr/ports/devel/concurrencpp/work/concurrencpp-v.0.1.6/source/executors/thread_executor.cpp
[ 22% 5/18] /usr/bin/c++ -DCRCPP_EXPORT_API -Dconcurrencpp_EXPORTS -isystem /wrkdirs/usr/ports/devel/concurrencpp/work/concurrencpp-v.0.1.6/include -O2 -pipe -fstack-protector-strong -fno-strict-aliasing -O2 -pipe -fstack-protector-strong -fno-strict-aliasing -DNDEBUG -fPIC -fvisibility=hidden -fvisibility-inlines-hidden -pthread -std=c++20 -MD -MT CMakeFiles/concurrencpp.dir/source/executors/manual_executor.cpp.o -MF CMakeFiles/concurrencpp.dir/source/executors/manual_executor.cpp.o.d -o CMakeFiles/concurrencpp.dir/source/executors/manual_executor.cpp.o -c /wrkdirs/usr/ports/devel/concurrencpp/work/concurrencpp-v.0.1.6/source/executors/manual_executor.cpp
[ 27% 6/18] /usr/bin/c++ -DCRCPP_EXPORT_API -Dconcurrencpp_EXPORTS -isystem /wrkdirs/usr/ports/devel/concurrencpp/work/concurrencpp-v.0.1.6/include -O2 -pipe -fstack-protector-strong -fno-strict-aliasing -O2 -pipe -fstack-protector-strong -fno-strict-aliasing -DNDEBUG -fPIC -fvisibility=hidden -fvisibility-inlines-hidden -pthread -std=c++20 -MD -MT CMakeFiles/concurrencpp.dir/source/executors/worker_thread_executor.cpp.o -MF CMakeFiles/concurrencpp.dir/source/executors/worker_thread_executor.cpp.o.d -o CMakeFiles/concurrencpp.dir/source/executors/worker_thread_executor.cpp.o -c /wrkdirs/usr/ports/devel/concurrencpp/work/concurrencpp-v.0.1.6/source/executors/worker_thread_executor.cpp
[ 33% 7/18] /usr/bin/c++ -DCRCPP_EXPORT_API -Dconcurrencpp_EXPORTS -isystem /wrkdirs/usr/ports/devel/concurrencpp/work/concurrencpp-v.0.1.6/include -O2 -pipe -fstack-protector-strong -fno-strict-aliasing -O2 -pipe -fstack-protector-strong -fno-strict-aliasing -DNDEBUG -fPIC -fvisibility=hidden -fvisibility-inlines-hidden -pthread -std=c++20 -MD -MT CMakeFiles/concurrencpp.dir/source/executors/thread_pool_executor.cpp.o -MF CMakeFiles/concurrencpp.dir/source/executors/thread_pool_executor.cpp.o.d -o CMakeFiles/concurrencpp.dir/source/executors/thread_pool_executor.cpp.o -c /wrkdirs/usr/ports/devel/concurrencpp/work/concurrencpp-v.0.1.6/source/executors/thread_pool_executor.cpp
[ 38% 8/18] /usr/bin/c++ -DCRCPP_EXPORT_API -Dconcurrencpp_EXPORTS -isystem /wrkdirs/usr/ports/devel/concurrencpp/work/concurrencpp-v.0.1.6/include -O2 -pipe -fstack-protector-strong -fno-strict-aliasing -O2 -pipe -fstack-protector-strong -fno-strict-aliasing -DNDEBUG -fPIC -fvisibility=hidden -fvisibility-inlines-hidden -pthread -std=c++20 -MD -MT CMakeFiles/concurrencpp.dir/source/results/impl/consumer_context.cpp.o -MF CMakeFiles/concurrencpp.dir/source/results/impl/consumer_context.cpp.o.d -o CMakeFiles/concurrencpp.dir/source/results/impl/consumer_context.cpp.o -c /wrkdirs/usr/ports/devel/concurrencpp/work/concurrencpp-v.0.1.6/source/results/impl/consumer_context.cpp
[ 44% 9/18] /usr/bin/c++ -DCRCPP_EXPORT_API -Dconcurrencpp_EXPORTS -isystem /wrkdirs/usr/ports/devel/concurrencpp/work/concurrencpp-v.0.1.6/include -O2 -pipe -fstack-protector-strong -fno-strict-aliasing -O2 -pipe -fstack-protector-strong -fno-strict-aliasing -DNDEBUG -fPIC -fvisibility=hidden -fvisibility-inlines-hidden -pthread -std=c++20 -MD -MT CMakeFiles/concurrencpp.dir/source/results/impl/result_state.cpp.o -MF CMakeFiles/concurrencpp.dir/source/results/impl/result_state.cpp.o.d -o CMakeFiles/concurrencpp.dir/source/results/impl/result_state.cpp.o -c /wrkdirs/usr/ports/devel/concurrencpp/work/concurrencpp-v.0.1.6/source/results/impl/result_state.cpp
[ 50% 10/18] /usr/bin/c++ -DCRCPP_EXPORT_API -Dconcurrencpp_EXPORTS -isystem /wrkdirs/usr/ports/devel/concurrencpp/work/concurrencpp-v.0.1.6/include -O2 -pipe -fstack-protector-strong -fno-strict-aliasing -O2 -pipe -fstack-protector-strong -fno-strict-aliasing -DNDEBUG -fPIC -fvisibility=hidden -fvisibility-inlines-hidden -pthread -std=c++20 -MD -MT CMakeFiles/concurrencpp.dir/source/results/impl/shared_result_state.cpp.o -MF CMakeFiles/concurrencpp.dir/source/results/impl/shared_result_state.cpp.o.d -o CMakeFiles/concurrencpp.dir/source/results/impl/shared_result_state.cpp.o -c /wrkdirs/usr/ports/devel/concurrencpp/work/concurrencpp-v.0.1.6/source/results/impl/shared_result_state.cpp
[ 55% 11/18] /usr/bin/c++ -DCRCPP_EXPORT_API -Dconcurrencpp_EXPORTS -isystem /wrkdirs/usr/ports/devel/concurrencpp/work/concurrencpp-v.0.1.6/include -O2 -pipe -fstack-protector-strong -fno-strict-aliasing -O2 -pipe -fstack-protector-strong -fno-strict-aliasing -DNDEBUG -fPIC -fvisibility=hidden -fvisibility-inlines-hidden -pthread -std=c++20 -MD -MT CMakeFiles/concurrencpp.dir/source/results/promises.cpp.o -MF CMakeFiles/concurrencpp.dir/source/results/promises.cpp.o.d -o CMakeFiles/concurrencpp.dir/source/results/promises.cpp.o -c /wrkdirs/usr/ports/devel/concurrencpp/work/concurrencpp-v.0.1.6/source/results/promises.cpp
[ 61% 12/18] /usr/bin/c++ -DCRCPP_EXPORT_API -Dconcurrencpp_EXPORTS -isystem /wrkdirs/usr/ports/devel/concurrencpp/work/concurrencpp-v.0.1.6/include -O2 -pipe -fstack-protector-strong -fno-strict-aliasing -O2 -pipe -fstack-protector-strong -fno-strict-aliasing -DNDEBUG -fPIC -fvisibility=hidden -fvisibility-inlines-hidden -pthread -std=c++20 -MD -MT CMakeFiles/concurrencpp.dir/source/threads/async_lock.cpp.o -MF CMakeFiles/concurrencpp.dir/source/threads/async_lock.cpp.o.d -o CMakeFiles/concurrencpp.dir/source/threads/async_lock.cpp.o -c /wrkdirs/usr/ports/devel/concurrencpp/work/concurrencpp-v.0.1.6/source/threads/async_lock.cpp
[ 66% 13/18] /usr/bin/c++ -DCRCPP_EXPORT_API -Dconcurrencpp_EXPORTS -isystem /wrkdirs/usr/ports/devel/concurrencpp/work/concurrencpp-v.0.1.6/include -O2 -pipe -fstack-protector-strong -fno-strict-aliasing -O2 -pipe -fstack-protector-strong -fno-strict-aliasing -DNDEBUG -fPIC -fvisibility=hidden -fvisibility-inlines-hidden -pthread -std=c++20 -MD -MT CMakeFiles/concurrencpp.dir/source/runtime/runtime.cpp.o -MF CMakeFiles/concurrencpp.dir/source/runtime/runtime.cpp.o.d -o CMakeFiles/concurrencpp.dir/source/runtime/runtime.cpp.o -c /wrkdirs/usr/ports/devel/concurrencpp/work/concurrencpp-v.0.1.6/source/runtime/runtime.cpp
[ 72% 14/18] /usr/bin/c++ -DCRCPP_EXPORT_API -Dconcurrencpp_EXPORTS -isystem /wrkdirs/usr/ports/devel/concurrencpp/work/concurrencpp-v.0.1.6/include -O2 -pipe -fstack-protector-strong -fno-strict-aliasing -O2 -pipe -fstack-protector-strong -fno-strict-aliasing -DNDEBUG -fPIC -fvisibility=hidden -fvisibility-inlines-hidden -pthread -std=c++20 -MD -MT CMakeFiles/concurrencpp.dir/source/threads/thread.cpp.o -MF CMakeFiles/concurrencpp.dir/source/threads/thread.cpp.o.d -o CMakeFiles/concurrencpp.dir/source/threads/thread.cpp.o -c /wrkdirs/usr/ports/devel/concurrencpp/work/concurrencpp-v.0.1.6/source/threads/thread.cpp
[ 77% 15/18] /usr/bin/c++ -DCRCPP_EXPORT_API -Dconcurrencpp_EXPORTS -isystem /wrkdirs/usr/ports/devel/concurrencpp/work/concurrencpp-v.0.1.6/include -O2 -pipe -fstack-protector-strong -fno-strict-aliasing -O2 -pipe -fstack-protector-strong -fno-strict-aliasing -DNDEBUG -fPIC -fvisibility=hidden -fvisibility-inlines-hidden -pthread -std=c++20 -MD -MT CMakeFiles/concurrencpp.dir/source/threads/async_condition_variable.cpp.o -MF CMakeFiles/concurrencpp.dir/source/threads/async_condition_variable.cpp.o.d -o CMakeFiles/concurrencpp.dir/source/threads/async_condition_variable.cpp.o -c /wrkdirs/usr/ports/devel/concurrencpp/work/concurrencpp-v.0.1.6/source/threads/async_condition_variable.cpp
FAILED: CMakeFiles/concurrencpp.dir/source/threads/async_condition_variable.cpp.o
/usr/bin/c++ -DCRCPP_EXPORT_API -Dconcurrencpp_EXPORTS -isystem /wrkdirs/usr/ports/devel/concurrencpp/work/concurrencpp-v.0.1.6/include -O2 -pipe -fstack-protector-strong -fno-strict-aliasing -O2 -pipe -fstack-protector-strong -fno-strict-aliasing -DNDEBUG -fPIC -fvisibility=hidden -fvisibility-inlines-hidden -pthread -std=c++20 -MD -MT CMakeFiles/concurrencpp.dir/source/threads/async_condition_variable.cpp.o -MF CMakeFiles/concurrencpp.dir/source/threads/async_condition_variable.cpp.o.d -o CMakeFiles/concurrencpp.dir/source/threads/async_condition_variable.cpp.o -c /wrkdirs/usr/ports/devel/concurrencpp/work/concurrencpp-v.0.1.6/source/threads/async_condition_variable.cpp
fatal error: error in backend: failed to perform tail call elimination on a call site marked musttail
PLEASE submit a bug report to https://bugs.freebsd.org/submit/ and include the crash backtrace, preprocessed source, and associated run script.
Stack dump:
0. Program arguments: /usr/bin/c++ -DCRCPP_EXPORT_API -Dconcurrencpp_EXPORTS -isystem /wrkdirs/usr/ports/devel/concurrencpp/work/concurrencpp-v.0.1.6/include -O2 -pipe -fstack-protector-strong -fno-strict-aliasing -O2 -pipe -fstack-protector-strong -fno-strict-aliasing -DNDEBUG -fPIC -fvisibility=hidden -fvisibility-inlines-hidden -pthread -std=c++20 -MD -MT CMakeFiles/concurrencpp.dir/source/threads/async_condition_variable.cpp.o -MF CMakeFiles/concurrencpp.dir/source/threads/async_condition_variable.cpp.o.d -o CMakeFiles/concurrencpp.dir/source/threads/async_condition_variable.cpp.o -c /wrkdirs/usr/ports/devel/concurrencpp/work/concurrencpp-v.0.1.6/source/threads/async_condition_variable.cpp
1. <eof> parser at end of file
2. Code generation
3. Running pass 'Function Pass Manager' on module '/wrkdirs/usr/ports/devel/concurrencpp/work/concurrencpp-v.0.1.6/source/threads/async_condition_variable.cpp'.
4. Running pass 'PowerPC DAG->DAG Pattern Instruction Selection' on function '@_ZN12concurrencpp24async_condition_variable10await_implENSt3__110shared_ptrINS_8executorEEERNS_17scoped_async_lockE.resume'
#0 0x0000000014640f34 (/usr/bin/c+++0x14640f34)
#1 0x000000001463e7e0 (/usr/bin/c+++0x1463e7e0)
#2 0x00000000145c85dc (/usr/bin/c+++0x145c85dc)
#3 0x00000000145c8534 (/usr/bin/c+++0x145c8534)
#4 0x000000001463724c (/usr/bin/c+++0x1463724c)
#5 0x00000000117363ac (/usr/bin/c+++0x117363ac)
#6 0x00000000145d2bcc (/usr/bin/c+++0x145d2bcc)
#7 0x00000000145d2a60 (/usr/bin/c+++0x145d2a60)
#8 0x0000000014f53dd4 (/usr/bin/c+++0x14f53dd4)
#9 0x000000001486cbb0 (/usr/bin/c+++0x1486cbb0)
#10 0x0000000014886a7c (/usr/bin/c+++0x14886a7c)
#11 0x0000000014874034 (/usr/bin/c+++0x14874034)
#12 0x000000001485ec10 (/usr/bin/c+++0x1485ec10)
#13 0x00000000148528fc (/usr/bin/c+++0x148528fc)
#14 0x000000001494ed30 (/usr/bin/c+++0x1494ed30)
#15 0x000000001494e624 (/usr/bin/c+++0x1494e624)
#16 0x000000001494c180 (/usr/bin/c+++0x1494c180)
#17 0x0000000014f9ec2c (/usr/bin/c+++0x14f9ec2c)
#18 0x0000000013d86c7c (/usr/bin/c+++0x13d86c7c)
#19 0x00000000141fc878 (/usr/bin/c+++0x141fc878)
#20 0x00000000142041bc (/usr/bin/c+++0x142041bc)
#21 0x00000000141fcf98 (/usr/bin/c+++0x141fcf98)
#22 0x0000000011fe2cc8 (/usr/bin/c+++0x11fe2cc8)
#23 0x0000000011fddc38 (/usr/bin/c+++0x11fddc38)
#24 0x0000000012300240 (/usr/bin/c+++0x12300240)
#25 0x00000000128db1d4 (/usr/bin/c+++0x128db1d4)
#26 0x000000001222c5d0 (/usr/bin/c+++0x1222c5d0)
#27 0x00000000122fe184 (/usr/bin/c+++0x122fe184)
#28 0x000000001222bda0 (/usr/bin/c+++0x1222bda0)
#29 0x00000000121a8184 (/usr/bin/c+++0x121a8184)
#30 0x00000000122f9880 (/usr/bin/c+++0x122f9880)
#31 0x0000000011735d88 (/usr/bin/c+++0x11735d88)
#32 0x0000000011744bbc (/usr/bin/c+++0x11744bbc)
#33 0x0000000012061858 (/usr/bin/c+++0x12061858)
#34 0x00000000145c84d4 (/usr/bin/c+++0x145c84d4)
#35 0x000000001206129c (/usr/bin/c+++0x1206129c)
#36 0x000000001202df2c (/usr/bin/c+++0x1202df2c)
#37 0x000000001202e3cc (/usr/bin/c+++0x1202e3cc)
#38 0x0000000012042e98 (/usr/bin/c+++0x12042e98)
c++: error: clang frontend command failed with exit code 70 (use -v to see invocation)
FreeBSD clang version 13.0.0 (git@github.com:llvm/llvm-project.git llvmorg-13.0.0-0-gd7b669b3a303)
Target: powerpc64-unknown-freebsd13.1
Thread model: posix
InstalledDir: /usr/bin
c++: note: diagnostic msg:
********************
PLEASE ATTACH THE FOLLOWING FILES TO THE BUG REPORT:
Preprocessed source(s) and associated run script(s) are located at:
c++: note: diagnostic msg: /tmp/async_condition_variable-6f1473.cpp
c++: note: diagnostic msg: /tmp/async_condition_variable-6f1473.sh
c++: note: diagnostic msg:
********************
[ 83% 15/18] /usr/bin/c++ -DCRCPP_EXPORT_API -Dconcurrencpp_EXPORTS -isystem /wrkdirs/usr/ports/devel/concurrencpp/work/concurrencpp-v.0.1.6/include -O2 -pipe -fstack-protector-strong -fno-strict-aliasing -O2 -pipe -fstack-protector-strong -fno-strict-aliasing -DNDEBUG -fPIC -fvisibility=hidden -fvisibility-inlines-hidden -pthread -std=c++20 -MD -MT CMakeFiles/concurrencpp.dir/source/timers/timer.cpp.o -MF CMakeFiles/concurrencpp.dir/source/timers/timer.cpp.o.d -o CMakeFiles/concurrencpp.dir/source/timers/timer.cpp.o -c /wrkdirs/usr/ports/devel/concurrencpp/work/concurrencpp-v.0.1.6/source/timers/timer.cpp
ninja: build stopped: subcommand failed.
===> Compilation failed unexpectedly.
Try to set MAKE_JOBS_UNSAFE=yes and rebuild before reporting the failure to
the maintainer.
*** Error code 1
Stop.
make: stopped in /usr/ports/devel/concurrencpp