[package - main-powerpc64le-default][java/openjdk11-jre] Failed for openjdk11-jre-11.0.19+7.1 in build
- Go to: [ bottom of page ] [ top of archives ] [ this month ]
Date: Sun, 02 Jul 2023 01:43:47 UTC
You are receiving this mail as a port that you maintain
is failing to build on the FreeBSD package build server.
Please investigate the failure and submit a PR to fix
build.
Maintainer: java@FreeBSD.org
Log URL: https://pkg-status.freebsd.org/foul2/data/main-powerpc64le-default/p8c7f3e19a83a_se495600ce3/logs/openjdk11-jre-11.0.19+7.1.log
Build URL: https://pkg-status.freebsd.org/foul2/build.html?mastername=main-powerpc64le-default&build=p8c7f3e19a83a_se495600ce3
Log:
=>> Building java/openjdk11-jre
build started at Sun Jul 2 01:24:20 UTC 2023
port directory: /usr/ports/java/openjdk11-jre
package name: openjdk11-jre-11.0.19+7.1
building for: FreeBSD main-powerpc64le-default-job-17 14.0-CURRENT FreeBSD 14.0-CURRENT 1400092 powerpc
maintained by: java@FreeBSD.org
Makefile ident:
Poudriere version: 3.2.8-23-ga7f8d188
Host OSVERSION: 1400088
Jail OSVERSION: 1400092
Job Id: 17
!!! Jail is newer than host. (Jail: 1400092, Host: 1400088) !!!
!!! This is not supported. !!!
!!! Host kernel must be same or newer than jail. !!!
!!! Expect build failures. !!!
---Begin Environment---
SHELL=/bin/sh
OSVERSION=1400092
UNAME_v=FreeBSD 14.0-CURRENT 1400092
UNAME_r=14.0-CURRENT
BLOCKSIZE=K
MAIL=/var/mail/root
MM_CHARSET=UTF-8
LANG=C.UTF-8
STATUS=1
HOME=/root
PATH=/sbin:/bin:/usr/sbin:/usr/bin:/usr/local/sbin:/usr/local/bin:/root/bin
LOCALBASE=/usr/local
USER=root
LIBEXECPREFIX=/usr/local/libexec/poudriere
POUDRIERE_VERSION=3.2.8-23-ga7f8d188
MASTERMNT=/usr/local/poudriere/data/.m/main-powerpc64le-default/ref
POUDRIERE_BUILD_TYPE=bulk
PACKAGE_BUILDING=yes
SAVED_TERM=
PWD=/usr/local/poudriere/data/.m/main-powerpc64le-default/ref/.p/pool
P_PORTS_FEATURES=FLAVORS SELECTED_OPTIONS
MASTERNAME=main-powerpc64le-default
SCRIPTPREFIX=/usr/local/share/poudriere
OLDPWD=/usr/local/poudriere/data/.m/main-powerpc64le-default/ref/.p
SCRIPTPATH=/usr/local/share/poudriere/bulk.sh
POUDRIEREPATH=/usr/local/bin/poudriere
---End Environment---
---Begin Poudriere Port Flags/Env---
PORT_FLAGS=
PKGENV=
FLAVOR=
DEPENDS_ARGS=
MAKE_ARGS=
---End Poudriere Port Flags/Env---
---Begin OPTIONS List---
===> The following configuration options are available for openjdk11-jre-11.0.19+7.1:
CUPS=on: CUPS printing system support
===> Use 'make config' to modify these settings
---End OPTIONS List---
--MAINTAINER--
java@FreeBSD.org
--End MAINTAINER--
--CONFIGURE_ARGS--
--with-boot-jdk=/usr/local/bootstrap-openjdk11 --disable-ccache --disable-javac-server --disable-hotspot-gtest --with-jvm-features=shenandoahgc --with-alsa=/usr/local --with-fontconfig=/usr/local --with-freetype=system --with-freetype-include=/usr/local/include/freetype2 --with-freetype-lib=/usr/local/lib --with-libjpeg=system --with-giflib=system --with-giflib-include=/usr/local/include --with-giflib-lib=/usr/local/lib --with-libpng=system --with-zlib=system --with-lcms=system --x-includes=/usr/local/include --x-libraries=/usr/local/lib --with-version-string=11.0.19+7-1 --with-native-debug-symbols=none --with-debug-level=release --with-vendor-name="OpenJDK BSD Porting Team" --with-vendor-url="https://github.com/battleblow/jdk11u/" --with-vendor-bug-url="https://bugs.freebsd.org/bugzilla/enter_bug.cgi?product=Ports%20%26%20Packages&component=Individual%20Port(s)&short_desc=java/openjdk11%3A%20" --with-vendor-vm-bug-url="https://bugs.freebsd.org/bugzilla/enter
_bug.cgi?product=Ports%20%26%20Packages&component=Individual%20Port(s)&short_desc=java/openjdk11%3A%20" --with-cups=/usr/local --with-toolchain-type=clang --disable-warnings-as-errors --disable-precompiled-headers --enable-aot=no --x-libraries=/usr/local/lib --x-includes=/usr/local/include --prefix=/usr/local ${_LATE_CONFIGURE_ARGS}
--End CONFIGURE_ARGS--
--CONFIGURE_ENV--
CC=/usr/local/bin/clang12 CXX=/usr/local/bin/clang++12 CPP=cpp ac_cv_path_SED=/usr/local/bin/gsed MAKE=gmake PKG_CONFIG=pkgconf XDG_DATA_HOME=/wrkdirs/usr/ports/java/openjdk11-jre/work XDG_CONFIG_HOME=/wrkdirs/usr/ports/java/openjdk11-jre/work XDG_CACHE_HOME=/wrkdirs/usr/ports/java/openjdk11-jre/work/.cache HOME=/wrkdirs/usr/ports/java/openjdk11-jre/work TMPDIR="/tmp" PATH=/wrkdirs/usr/ports/java/openjdk11-jre/work/.bin:/sbin:/bin:/usr/sbin:/usr/bin:/usr/local/sbin:/usr/local/bin:/root/bin PKG_CONFIG_LIBDIR=/wrkdirs/usr/ports/java/openjdk11-jre/work/.pkgconfig:/usr/local/libdata/pkgconfig:/usr/local/share/pkgconfig:/usr/libdata/pkgconfig SHELL=/bin/sh CONFIG_SHELL=/bin/sh CONFIG_SITE=/usr/ports/Templates/config.site lt_cv_sys_max_cmd_len=524288
--End CONFIGURE_ENV--
--MAKE_ENV--
LANG="C" LC_ALL="C" CLASSPATH="" JAVA_HOME="" LD_LIBRARY_PATH="" CC=/usr/local/bin/clang12 CXX=/usr/local/bin/clang++12 CPP=cpp MAKEFLAGS="" --with-toolchain-type=clang USE_CLANG=true XDG_DATA_HOME=/wrkdirs/usr/ports/java/openjdk11-jre/work XDG_CONFIG_HOME=/wrkdirs/usr/ports/java/openjdk11-jre/work XDG_CACHE_HOME=/wrkdirs/usr/ports/java/openjdk11-jre/work/.cache HOME=/wrkdirs/usr/ports/java/openjdk11-jre/work TMPDIR="/tmp" PATH=/wrkdirs/usr/ports/java/openjdk11-jre/work/.bin:/sbin:/bin:/usr/sbin:/usr/bin:/usr/local/sbin:/usr/local/bin:/root/bin PKG_CONFIG_LIBDIR=/wrkdirs/usr/ports/java/openjdk11-jre/work/.pkgconfig:/usr/local/libdata/pkgconfig:/usr/local/share/pkgconfig:/usr/libdata/pkgconfig MK_DEBUG_FILES=no MK_KERNEL_SYMBOLS=no SHELL=/bin/sh NO_LINT=YES PREFIX=/usr/local LOCALBASE=/usr/local CC="/usr/local/bin/clang12" CFLAGS="-O2 -pipe -DLIBICONV_PLUG -fstack-protector-strong -fno-strict-aliasing " CPP="cpp" CPPFLAGS="-DLIBICONV_PLUG" LDFLAGS=" -fstack-protector-s
trong " LIBS="" CXX="/usr/local/bin/clang++12" CXXFLAGS="-O2 -pipe -DLIBICONV_PLUG -fstack-protector-strong -fno-strict-aliasing -DLIBICONV_PLUG " MANPREFIX="/usr/local" BSD_INSTALL_PROGRAM="install -s -m 555" BSD_INSTALL_LIB="install -s -m 0644" BSD_INSTALL_SCRIPT="install -m 555" BSD_INSTALL_DATA="install -m 0644" BSD_INSTALL_MAN="install -m 444"
--End MAKE_ENV--
--PLIST_SUB--
OSREL=14.0 PREFIX=%D LOCALBASE=/usr/local RESETPREFIX=/usr/local LIB32DIR=lib DOCSDIR="share/doc/openjdk" EXAMPLESDIR="share/examples/openjdk" DATADIR="share/openjdk" WWWDIR="www/openjdk" ETCDIR="etc/openjdk"
--End PLIST_SUB--
--SUB_LIST--
PREFIX=/usr/local LOCALBASE=/usr/local DATADIR=/usr/local/share/openjdk DOCSDIR=/usr/local/share/doc/openjdk EXAMPLESDIR=/usr/local/share/examples/openjdk WWWDIR=/usr/local/www/openjdk ETCDIR=/usr/local/etc/openjdk
--End SUB_LIST--
---Begin make.conf---
USE_PACKAGE_DEPENDS=yes
BATCH=yes
WRKDIRPREFIX=/wrkdirs
PORTSDIR=/usr/ports
PACKAGES=/packages
DISTDIR=/distfiles
PACKAGE_BUILDING=yes
PACKAGE_BUILDING_FLAVORS=yes
#### /usr/local/etc/poudriere.d/make.conf ####
# XXX: We really need this but cannot use it while 'make checksum' does not
# try the next mirror on checksum failure. It currently retries the same
# failed mirror and then fails rather then trying another. It *does*
# try the next if the size is mismatched though.
#MASTER_SITE_FREEBSD=yes
# Build ALLOW_MAKE_JOBS_PACKAGES with 2 jobs
MAKE_JOBS_NUMBER=2
#### /usr/ports/Mk/Scripts/ports_env.sh ####
_CCVERSION_921dbbb2=FreeBSD clang version 16.0.6 (https://github.com/llvm/llvm-project.git llvmorg-16.0.6-0-g7cbf1a259152) Target: powerpc64le-unknown-freebsd14.0 Thread model: posix InstalledDir: /usr/bin
_ALTCCVERSION_921dbbb2=none
_CXXINTERNAL_acaad9ca=FreeBSD clang version 16.0.6 (https://github.com/llvm/llvm-project.git llvmorg-16.0.6-0-g7cbf1a259152) Target: powerpc64le-unknown-freebsd14.0 Thread model: posix InstalledDir: /usr/bin "/usr/bin/ld" "--eh-frame-hdr" "-dynamic-linker" "/libexec/ld-elf.so.1" "--enable-new-dtags" "-o" "a.out" "/usr/lib/crt1.o" "/usr/lib/crti.o" "/usr/lib/crtbegin.o" "-L/usr/lib" "/dev/null" "-lc++" "-lm" "-lgcc" "--as-needed" "-lgcc_s" "--no-as-needed" "-lc" "-lgcc" "--as-needed" "-lgcc_s" "--no-as-needed" "/usr/lib/crtend.o" "/usr/lib/crtn.o"
CC_OUTPUT_921dbbb2_58173849=yes
CC_OUTPUT_921dbbb2_9bdba57c=yes
CC_OUTPUT_921dbbb2_6a4fe7f5=yes
CC_OUTPUT_921dbbb2_6bcac02b=yes
CC_OUTPUT_921dbbb2_67d20829=yes
CC_OUTPUT_921dbbb2_bfa62e83=yes
CC_OUTPUT_921dbbb2_f0b4d593=yes
CC_OUTPUT_921dbbb2_308abb44=yes
CC_OUTPUT_921dbbb2_f00456e5=yes
CC_OUTPUT_921dbbb2_65ad290d=yes
CC_OUTPUT_921dbbb2_f2776b26=yes
CC_OUTPUT_921dbbb2_53255a77=yes
CC_OUTPUT_921dbbb2_911cfe02=yes
CC_OUTPUT_921dbbb2_b2657cc3=yes
CC_OUTPUT_921dbbb2_380987f7=yes
CC_OUTPUT_921dbbb2_160933ec=yes
CC_OUTPUT_921dbbb2_fb62803b=yes
CC_OUTPUT_921dbbb2_af59ad06=yes
CC_OUTPUT_921dbbb2_a15f3fcf=yes
_OBJC_CCVERSION_921dbbb2=FreeBSD clang version 16.0.6 (https://github.com/llvm/llvm-project.git llvmorg-16.0.6-0-g7cbf1a259152) Target: powerpc64le-unknown-freebsd14.0 Thread model: posix InstalledDir: /usr/bin
_OBJC_ALTCCVERSION_921dbbb2=none
ARCH=powerpc64le
OPSYS=FreeBSD
_OSRELEASE=14.0-CURRENT
OSREL=14.0
OSVERSION=1400092
PYTHONBASE=/usr/local
CONFIGURE_MAX_CMD_LEN=524288
HAVE_PORTS_ENV=1
#### Misc Poudriere ####
GID=0
UID=0
---End make.conf---
--Resource limits--
cpu time (seconds, -t) unlimited
file size (512-blocks, -f) unlimited
data seg size (kbytes, -d) 33554432
stack size (kbytes, -s) 524288
core file size (512-blocks, -c) unlimited
max memory size (kbytes, -m) unlimited
locked memory (kbytes, -l) unlimited
max user processes (-u) 89999
open files (-n) 1024
virtual mem size (kbytes, -v) unlimited
swap limit (kbytes, -w) unlimited
socket buffer size (bytes, -b) unlimited
pseudo-terminals (-p) unlimited
kqueues (-k) unlimited
umtx shared locks (-o) unlimited
--End resource limits--
=======================<phase: check-sanity >============================
===> License GPLv2 accepted by the user
===========================================================================
=======================<phase: pkg-depends >============================
===> openjdk11-jre-11.0.19+7.1 depends on file: /usr/local/sbin/pkg - not found
===> Installing existing package /packages/All/pkg-1.19.1_2.pkg
[main-powerpc64le-default-job-17] Installing pkg-1.19.1_2...
[main-powerpc64le-default-job-17] Extracting pkg-1.19.1_2: .......... done
===> openjdk11-jre-11.0.19+7.1 depends on file: /usr/local/sbin/pkg - found
===> Returning to build of openjdk11-jre-11.0.19+7.1
===========================================================================
=======================<phase: fetch-depends >============================
===========================================================================
=======================<phase: fetch >============================
===> License GPLv2 accepted by the user
===> Fetching all distfiles required by openjdk11-jre-11.0.19+7.1 for building
===========================================================================
=======================<phase: checksum >============================
===> License GPLv2 accepted by the user
===> Fetching all distfiles required by openjdk11-jre-11.0.19+7.1 for building
=> SHA256 Checksum OK for battleblow-jdk11u-jdk-11.0.19+7-1_GH0.tar.gz.
===========================================================================
=======================<phase: extract-depends>============================
===========================================================================
=======================<phase: extract >============================
===> License GPLv2 accepted by the user
===> Fetching all distfiles required by openjdk11-jre-11.0.19+7.1 for building
===> Extracting for openjdk11-jre-11.0.19+7.1
=> SHA256 Checksum OK for battleblow-jdk11u-jdk-11.0.19+7-1_GH0.tar.gz.
===========================================================================
=======================<phase: patch-depends >============================
===========================================================================
=======================<phase: patch >============================
===> Patching for openjdk11-jre-11.0.19+7.1
===> Applying FreeBSD patches for openjdk11-jre-11.0.19+7.1 from /usr/ports/java/openjdk11-jre/../openjdk11/files
===========================================================================
=======================<phase: build-depends >============================
===> openjdk11-jre-11.0.19+7.1 depends on executable: zip - not found
===> Installing existing package /packages/All/zip-3.0_1.pkg
<snip>
Compiling 131 files for BUILD_NASGEN
gmake[4]: Leaving directory '/wrkdirs/usr/ports/java/openjdk11-jre/work/jdk11u-jdk-11.0.19-7-1/make'
gmake[4]: Leaving directory '/wrkdirs/usr/ports/java/openjdk11-jre/work/jdk11u-jdk-11.0.19-7-1/make'
gmake[4]: Leaving directory '/wrkdirs/usr/ports/java/openjdk11-jre/work/jdk11u-jdk-11.0.19-7-1/make'
gmake[4]: Leaving directory '/wrkdirs/usr/ports/java/openjdk11-jre/work/jdk11u-jdk-11.0.19-7-1/make'
gmake[4]: Entering directory '/wrkdirs/usr/ports/java/openjdk11-jre/work/jdk11u-jdk-11.0.19-7-1/make/rmic'
gmake[4]: Entering directory '/wrkdirs/usr/ports/java/openjdk11-jre/work/jdk11u-jdk-11.0.19-7-1/make'
gmake[4]: Entering directory '/wrkdirs/usr/ports/java/openjdk11-jre/work/jdk11u-jdk-11.0.19-7-1/make'
Compiling 11 files for jdk.jstatd
gmake[4]: Leaving directory '/wrkdirs/usr/ports/java/openjdk11-jre/work/jdk11u-jdk-11.0.19-7-1/make'
Creating support/modules_libs/java.rmi/librmi.so from 1 file(s)
Warning: generation and use of skeletons and static stubs for JRMP
is deprecated. Skeletons are unnecessary, and static stubs have
been superseded by dynamically generated stubs. Users are
encouraged to migrate away from using rmic to generate skeletons and static
stubs. See the documentation for java.rmi.server.UnicastRemoteObject.
gmake[4]: Leaving directory '/wrkdirs/usr/ports/java/openjdk11-jre/work/jdk11u-jdk-11.0.19-7-1/make'
gmake[4]: Leaving directory '/wrkdirs/usr/ports/java/openjdk11-jre/work/jdk11u-jdk-11.0.19-7-1/make/rmic'
gmake[4]: Leaving directory '/wrkdirs/usr/ports/java/openjdk11-jre/work/jdk11u-jdk-11.0.19-7-1/make'
gmake[4]: Entering directory '/wrkdirs/usr/ports/java/openjdk11-jre/work/jdk11u-jdk-11.0.19-7-1/make'
gmake[4]: Entering directory '/wrkdirs/usr/ports/java/openjdk11-jre/work/jdk11u-jdk-11.0.19-7-1/make'
Compiling 14 files for jdk.management.jfr
Creating support/modules_libs/jdk.management/libmanagement_ext.so from 8 file(s)
gmake[4]: Leaving directory '/wrkdirs/usr/ports/java/openjdk11-jre/work/jdk11u-jdk-11.0.19-7-1/make'
gmake[4]: Leaving directory '/wrkdirs/usr/ports/java/openjdk11-jre/work/jdk11u-jdk-11.0.19-7-1/make'
gmake[4]: Leaving directory '/wrkdirs/usr/ports/java/openjdk11-jre/work/jdk11u-jdk-11.0.19-7-1/make'
#
# A fatal error has been detected by the Java Runtime Environment:
#
# SIGBUS (0xa) at pc=0x0000000812f4a648, pid=23370, tid=1029650
#
# JRE version: OpenJDK Runtime Environment (11.0.8) (build 11.0.8-internal+0-adhoc.pkubaj.openjdk-jdk11u)
# Java VM: OpenJDK 64-Bit Server VM (11.0.8-internal+0-adhoc.pkubaj.openjdk-jdk11u, mixed mode, tiered, compressed oops, g1 gc, bsd-ppc64le)
# Problematic frame:
# J 2968 c2 com.sun.tools.javac.code.Types$15.visitClassType(Lcom/sun/tools/javac/code/Type$ClassType;Ljava/lang/Object;)Ljava/lang/Object; jdk.compiler.interim (10 bytes) @ 0x0000000812f4a648 [0x0000000812f4a600+0x0000000000000048]
#
# Core dump will be written. Default location: /wrkdirs/usr/ports/java/openjdk11-jre/work/jdk11u-jdk-11.0.19-7-1/make/java.core
#
# An error report file with more information is saved as:
# /wrkdirs/usr/ports/java/openjdk11-jre/work/jdk11u-jdk-11.0.19-7-1/make/hs_err_pid23370.log
Compiled method (c2) 19658 2968 4 com.sun.tools.javac.code.Types$15::visitClassType (10 bytes)
total in heap [0x0000000812f4a390,0x0000000812f4a830] = 1184
relocation [0x0000000812f4a4f0,0x0000000812f4a520] = 48
constants [0x0000000812f4a580,0x0000000812f4a600] = 128
main code [0x0000000812f4a600,0x0000000812f4a700] = 256
stub code [0x0000000812f4a700,0x0000000812f4a790] = 144
oops [0x0000000812f4a790,0x0000000812f4a798] = 8
metadata [0x0000000812f4a798,0x0000000812f4a7b0] = 24
scopes data [0x0000000812f4a7b0,0x0000000812f4a7d0] = 32
scopes pcs [0x0000000812f4a7d0,0x0000000812f4a810] = 64
dependencies [0x0000000812f4a810,0x0000000812f4a818] = 8
handler table [0x0000000812f4a818,0x0000000812f4a830] = 24
Compiled method (c2) 19659 2968 4 com.sun.tools.javac.code.Types$15::visitClassType (10 bytes)
total in heap [0x0000000812f4a390,0x0000000812f4a830] = 1184
relocation [0x0000000812f4a4f0,0x0000000812f4a520] = 48
constants [0x0000000812f4a580,0x0000000812f4a600] = 128
main code [0x0000000812f4a600,0x0000000812f4a700] = 256
stub code [0x0000000812f4a700,0x0000000812f4a790] = 144
oops [0x0000000812f4a790,0x0000000812f4a798] = 8
metadata [0x0000000812f4a798,0x0000000812f4a7b0] = 24
scopes data [0x0000000812f4a7b0,0x0000000812f4a7d0] = 32
scopes pcs [0x0000000812f4a7d0,0x0000000812f4a810] = 64
dependencies [0x0000000812f4a810,0x0000000812f4a818] = 8
handler table [0x0000000812f4a818,0x0000000812f4a830] = 24
Compiled method (c2) 19659 2968 4 com.sun.tools.javac.code.Types$15::visitClassType (10 bytes)
total in heap [0x0000000812f4a390,0x0000000812f4a830] = 1184
relocation [0x0000000812f4a4f0,0x0000000812f4a520] = 48
constants [0x0000000812f4a580,0x0000000812f4a600] = 128
main code [0x0000000812f4a600,0x0000000812f4a700] = 256
stub code [0x0000000812f4a700,0x0000000812f4a790] = 144
oops [0x0000000812f4a790,0x0000000812f4a798] = 8
metadata [0x0000000812f4a798,0x0000000812f4a7b0] = 24
scopes data [0x0000000812f4a7b0,0x0000000812f4a7d0] = 32
scopes pcs [0x0000000812f4a7d0,0x0000000812f4a810] = 64
dependencies [0x0000000812f4a810,0x0000000812f4a818] = 8
handler table [0x0000000812f4a818,0x0000000812f4a830] = 24
Compiled method (c1) 19659 3404 3 com.sun.tools.javac.comp.Resolve$5::hasNext (55 bytes)
total in heap [0x000000080c371f90,0x000000080c372ba8] = 3096
relocation [0x000000080c3720f0,0x000000080c372138] = 72
constants [0x000000080c372180,0x000000080c372200] = 128
main code [0x000000080c372200,0x000000080c372900] = 1792
stub code [0x000000080c372900,0x000000080c3729a8] = 168
oops [0x000000080c3729a8,0x000000080c3729b0] = 8
metadata [0x000000080c3729b0,0x000000080c372a08] = 88
scopes data [0x000000080c372a08,0x000000080c372a88] = 128
scopes pcs [0x000000080c372a88,0x000000080c372b68] = 224
dependencies [0x000000080c372b68,0x000000080c372b70] = 8
nul chk table [0x000000080c372b70,0x000000080c372ba8] = 56
Compiled method (c2) 19663 2968 4 com.sun.tools.javac.code.Types$15::visitClassType (10 bytes)
total in heap [0x0000000812f4a390,0x0000000812f4a830] = 1184
relocation [0x0000000812f4a4f0,0x0000000812f4a520] = 48
constants [0x0000000812f4a580,0x0000000812f4a600] = 128
main code [0x0000000812f4a600,0x0000000812f4a700] = 256
stub code [0x0000000812f4a700,0x0000000812f4a790] = 144
oops [0x0000000812f4a790,0x0000000812f4a798] = 8
metadata [0x0000000812f4a798,0x0000000812f4a7b0] = 24
scopes data [0x0000000812f4a7b0,0x0000000812f4a7d0] = 32
scopes pcs [0x0000000812f4a7d0,0x0000000812f4a810] = 64
dependencies [0x0000000812f4a810,0x0000000812f4a818] = 8
handler table [0x0000000812f4a818,0x0000000812f4a830] = 24
Compiled method (nm) 19664 36 n 0 java.lang.Object::hashCode (native)
total in heap [0x0000000812c61c10,0x0000000812c61f30] = 800
relocation [0x0000000812c61d70,0x0000000812c61d78] = 8
main code [0x0000000812c61d80,0x0000000812c61f30] = 432
Compiled method (c2) 19665 2968 4 com.sun.tools.javac.code.Types$15::visitClassType (10 bytes)
total in heap [0x0000000812f4a390,0x0000000812f4a830] = 1184
relocation [0x0000000812f4a4f0,0x0000000812f4a520] = 48
constants [0x0000000812f4a580,0x0000000812f4a600] = 128
main code [0x0000000812f4a600,0x0000000812f4a700] = 256
stub code [0x0000000812f4a700,0x0000000812f4a790] = 144
oops [0x0000000812f4a790,0x0000000812f4a798] = 8
metadata [0x0000000812f4a798,0x0000000812f4a7b0] = 24
scopes data [0x0000000812f4a7b0,0x0000000812f4a7d0] = 32
scopes pcs [0x0000000812f4a7d0,0x0000000812f4a810] = 64
dependencies [0x0000000812f4a810,0x0000000812f4a818] = 8
handler table [0x0000000812f4a818,0x0000000812f4a830] = 24
Compiled method (c2) 19670 2968 4 com.sun.tools.javac.code.Types$15::visitClassType (10 bytes)
total in heap [0x0000000812f4a390,0x0000000812f4a830] = 1184
relocation [0x0000000812f4a4f0,0x0000000812f4a520] = 48
constants [0x0000000812f4a580,0x0000000812f4a600] = 128
main code [0x0000000812f4a600,0x0000000812f4a700] = 256
stub code [0x0000000812f4a700,0x0000000812f4a790] = 144
oops [0x0000000812f4a790,0x0000000812f4a798] = 8
metadata [0x0000000812f4a798,0x0000000812f4a7b0] = 24
scopes data [0x0000000812f4a7b0,0x0000000812f4a7d0] = 32
scopes pcs [0x0000000812f4a7d0,0x0000000812f4a810] = 64
dependencies [0x0000000812f4a810,0x0000000812f4a818] = 8
handler table [0x0000000812f4a818,0x0000000812f4a830] = 24
Could not load hsdis-ppc64le.so; library not loadable; PrintAssembly is disabled
#
# If you would like to submit a bug report, please visit:
# https://bugreport.java.com/bugreport/crash.jsp
#
gmake[4]: Leaving directory '/wrkdirs/usr/ports/java/openjdk11-jre/work/jdk11u-jdk-11.0.19-7-1/make'
gmake[4]: Entering directory '/wrkdirs/usr/ports/java/openjdk11-jre/work/jdk11u-jdk-11.0.19-7-1/make'
gmake[4]: Entering directory '/wrkdirs/usr/ports/java/openjdk11-jre/work/jdk11u-jdk-11.0.19-7-1/make'
gmake[4]: Entering directory '/wrkdirs/usr/ports/java/openjdk11-jre/work/jdk11u-jdk-11.0.19-7-1/make'
gmake[4]: Entering directory '/wrkdirs/usr/ports/java/openjdk11-jre/work/jdk11u-jdk-11.0.19-7-1/make'
gmake[4]: Entering directory '/wrkdirs/usr/ports/java/openjdk11-jre/work/jdk11u-jdk-11.0.19-7-1/make'
Compiling 14 files for java.management.rmi
Compiling 16 files for jdk.naming.dns
Compiling 7 files for jdk.naming.rmi
Compiling 4 files for jdk.naming.ldap
Compiling 219 files for java.security.jgss
gmake[4]: Leaving directory '/wrkdirs/usr/ports/java/openjdk11-jre/work/jdk11u-jdk-11.0.19-7-1/make'
/usr/local/bin/bash: line 1: 23370 Abort trap (core dumped) /usr/local/bootstrap-openjdk11/bin/java -Xms64M -Xmx1600M -XX:ThreadStackSize=1536 -Duser.language=en -Duser.country=US -XX:+UnlockDiagnosticVMOptions -XX:-VerifySharedSpaces -XX:SharedArchiveFile=/wrkdirs/usr/ports/java/openjdk11-jre/work/jdk11u-jdk-11.0.19-7-1/build/bsd-ppc64le-normal-server-release/configure-support/classes.jsa -Xshare:auto --limit-modules java.base,jdk.zipfs,java.compiler.interim,jdk.compiler.interim,jdk.javadoc.interim --add-modules java.compiler.interim,jdk.compiler.interim,jdk.javadoc.interim --module-path /wrkdirs/usr/ports/java/openjdk11-jre/work/jdk11u-jdk-11.0.19-7-1/build/bsd-ppc64le-normal-server-release/buildtools/interim_langtools_modules --add-exports java.base/sun.reflect.annotation=jdk.compiler.interim --add-exports java.base/jdk.internal.jmod=jdk.compiler.interim --add-exports java.base/jdk.internal.misc=jdk.compiler.interim -m jdk.compiler.interim/com.sun.tools.javac.Main -g
-source 11 -target 11 --doclint-format html5 -encoding ascii -XDignore.symbol.file=true -Xlint:all -Werror -Xlint:all,-deprecation,-removal,-unchecked,-rawtypes,-cast,-serial,-dep-ann,-static,-fallthrough,-try,-varargs,-empty,-finally,-overrides --module-source-path "/wrkdirs/usr/ports/java/openjdk11-jre/work/jdk11u-jdk-11.0.19-7-1/build/bsd-ppc64le-normal-server-release/support/gensrc/*:/wrkdirs/usr/ports/java/openjdk11-jre/work/jdk11u-jdk-11.0.19-7-1/src/*/bsd/classes:/wrkdirs/usr/ports/java/openjdk11-jre/work/jdk11u-jdk-11.0.19-7-1/src/*/unix/classes:/wrkdirs/usr/ports/java/openjdk11-jre/work/jdk11u-jdk-11.0.19-7-1/src/*/share/classes" --module-path "" --system none -implicit:none -classpath /wrkdirs/usr/ports/java/openjdk11-jre/work/jdk11u-jdk-11.0.19-7-1/build/bsd-ppc64le-normal-server-release/buildtools/depend -Xplugin:"depend /wrkdirs/usr/ports/java/openjdk11-jre/work/jdk11u-jdk-11.0.19-7-1/build/bsd-ppc64le-normal-server-release/jdk/modules/jdk.scripting.nashorn/_the.jdk.scr
ipting.nashorn_pubapi" -d /wrkdirs/usr/ports!
/java/openjdk11-jre/work/jdk11u-jdk-11.0.19-7-1/build/bsd-ppc64le-normal-server-release/jdk/modules -h /wrkdirs/usr/ports/java/openjdk11-jre/work/jdk11u-jdk-11.0.19-7-1/build/bsd-ppc64le-normal-server-release/support/headers.jdk.scripting.nashorn.tmp @/wrkdirs/usr/ports/java/openjdk11-jre/work/jdk11u-jdk-11.0.19-7-1/build/bsd-ppc64le-normal-server-release/jdk/modules/jdk.scripting.nashorn/_the.jdk.scripting.nashorn_batch.tmp > >(/usr/bin/tee -a /wrkdirs/usr/ports/java/openjdk11-jre/work/jdk11u-jdk-11.0.19-7-1/build/bsd-ppc64le-normal-server-release/jdk/modules/jdk.scripting.nashorn/_the.jdk.scripting.nashorn_batch.log) 2> >(/usr/bin/tee -a /wrkdirs/usr/ports/java/openjdk11-jre/work/jdk11u-jdk-11.0.19-7-1/build/bsd-ppc64le-normal-server-release/jdk/modules/jdk.scripting.nashorn/_the.jdk.scripting.nashorn_batch.log 1>&2)
gmake[4]: *** [CompileJavaModules.gmk:605: /wrkdirs/usr/ports/java/openjdk11-jre/work/jdk11u-jdk-11.0.19-7-1/build/bsd-ppc64le-normal-server-release/jdk/modules/jdk.scripting.nashorn/_the.jdk.scripting.nashorn_batch] Error 134
gmake[4]: Leaving directory '/wrkdirs/usr/ports/java/openjdk11-jre/work/jdk11u-jdk-11.0.19-7-1/make'
gmake[3]: *** [make/Main.gmk:199: jdk.scripting.nashorn-java] Error 2
gmake[3]: *** Waiting for unfinished jobs....
gmake[4]: Leaving directory '/wrkdirs/usr/ports/java/openjdk11-jre/work/jdk11u-jdk-11.0.19-7-1/make'
gmake[4]: Leaving directory '/wrkdirs/usr/ports/java/openjdk11-jre/work/jdk11u-jdk-11.0.19-7-1/make'
gmake[4]: Leaving directory '/wrkdirs/usr/ports/java/openjdk11-jre/work/jdk11u-jdk-11.0.19-7-1/make'
gmake[4]: Leaving directory '/wrkdirs/usr/ports/java/openjdk11-jre/work/jdk11u-jdk-11.0.19-7-1/make'
gmake[4]: Leaving directory '/wrkdirs/usr/ports/java/openjdk11-jre/work/jdk11u-jdk-11.0.19-7-1/make'
gmake[4]: Leaving directory '/wrkdirs/usr/ports/java/openjdk11-jre/work/jdk11u-jdk-11.0.19-7-1/make'
gmake[4]: Leaving directory '/wrkdirs/usr/ports/java/openjdk11-jre/work/jdk11u-jdk-11.0.19-7-1/make'
gmake[3]: Leaving directory '/wrkdirs/usr/ports/java/openjdk11-jre/work/jdk11u-jdk-11.0.19-7-1'
ERROR: Build failed for target 'legacy-images' in configuration 'bsd-ppc64le-normal-server-release' (exit code 2)
gmake[3]: Entering directory '/wrkdirs/usr/ports/java/openjdk11-jre/work/jdk11u-jdk-11.0.19-7-1'
=== Output from failing command(s) repeated here ===
* For target jdk_modules_jdk.scripting.nashorn__the.jdk.scripting.nashorn_batch:
#
# A fatal error has been detected by the Java Runtime Environment:
#
# SIGBUS (0xa) at pc=0x0000000812f4a648, pid=23370, tid=1029650
#
# JRE version: OpenJDK Runtime Environment (11.0.8) (build 11.0.8-internal+0-adhoc.pkubaj.openjdk-jdk11u)
# Java VM: OpenJDK 64-Bit Server VM (11.0.8-internal+0-adhoc.pkubaj.openjdk-jdk11u, mixed mode, tiered, compressed oops, g1 gc, bsd-ppc64le)
# Problematic frame:
# J 2968 c2 com.sun.tools.javac.code.Types$15.visitClassType(Lcom/sun/tools/javac/code/Type$ClassType;Ljava/lang/Object;)Ljava/lang/Object; jdk.compiler.interim (10 bytes) @ 0x0000000812f4a648 [0x0000000812f4a600+0x0000000000000048]
#
# Core dump will be written. Default location: /wrkdirs/usr/ports/java/openjdk11-jre/work/jdk11u-jdk-11.0.19-7-1/make/java.core
#
# An error report file with more information is saved as:
# /wrkdirs/usr/ports/java/openjdk11-jre/work/jdk11u-jdk-11.0.19-7-1/make/hs_err_pid23370.log
Compiled method (c2) 19658 2968 4 com.sun.tools.javac.code.Types$15::visitClassType (10 bytes)
... (rest of output omitted)
* All command lines available in /wrkdirs/usr/ports/java/openjdk11-jre/work/jdk11u-jdk-11.0.19-7-1/build/bsd-ppc64le-normal-server-release/make-support/failure-logs.
=== End of repeated output ===
No indication of failed target found.
Hint: Try searching the build log for '] Error'.
Hint: See doc/building.html#troubleshooting for assistance.
gmake[3]: Leaving directory '/wrkdirs/usr/ports/java/openjdk11-jre/work/jdk11u-jdk-11.0.19-7-1'
gmake[2]: *** [/wrkdirs/usr/ports/java/openjdk11-jre/work/jdk11u-jdk-11.0.19-7-1/make/Init.gmk:308: main] Error 2
gmake[2]: Leaving directory '/wrkdirs/usr/ports/java/openjdk11-jre/work/jdk11u-jdk-11.0.19-7-1'
gmake[1]: *** [/wrkdirs/usr/ports/java/openjdk11-jre/work/jdk11u-jdk-11.0.19-7-1/make/Init.gmk:186: legacy-images] Error 2
gmake[1]: Leaving directory '/wrkdirs/usr/ports/java/openjdk11-jre/work/jdk11u-jdk-11.0.19-7-1'
===> Compilation failed unexpectedly.
Try to set MAKE_JOBS_UNSAFE=yes and rebuild before reporting the failure to
the maintainer.
*** Error code 1
Stop.
make: stopped in /usr/ports/java/openjdk11-jre