[package - main-powerpc-default][editors/uemacs] Failed for uemacs-4.0_1 in build
- Go to: [ bottom of page ] [ top of archives ] [ this month ]
Date: Fri, 24 Feb 2023 12:15:52 UTC
You are receiving this mail as a port that you maintain
is failing to build on the FreeBSD package build server.
Please investigate the failure and submit a PR to fix
build.
Maintainer: mail@ozzmosis.com
Log URL: https://pkg-status.freebsd.org/foul1/data/main-powerpc-default/pb64d2f1e5acf_sc92790b3fb/logs/uemacs-4.0_1.log
Build URL: https://pkg-status.freebsd.org/foul1/build.html?mastername=main-powerpc-default&build=pb64d2f1e5acf_sc92790b3fb
Log:
=>> Building editors/uemacs
build started at Fri Feb 24 12:15:22 UTC 2023
port directory: /usr/ports/editors/uemacs
package name: uemacs-4.0_1
building for: FreeBSD main-powerpc-default-job-04 14.0-CURRENT FreeBSD 14.0-CURRENT 1400079 powerpc
maintained by: mail@ozzmosis.com
Makefile ident:
Poudriere version: 3.2.8-23-ga7f8d188
Host OSVERSION: 1400073
Jail OSVERSION: 1400079
Job Id: 04
!!! Jail is newer than host. (Jail: 1400079, Host: 1400073) !!!
!!! This is not supported. !!!
!!! Host kernel must be same or newer than jail. !!!
!!! Expect build failures. !!!
---Begin Environment---
SHELL=/bin/sh
UNAME_p=powerpc
UNAME_m=powerpc
OSVERSION=1400079
UNAME_v=FreeBSD 14.0-CURRENT 1400079
UNAME_r=14.0-CURRENT
BLOCKSIZE=K
MAIL=/var/mail/root
MM_CHARSET=UTF-8
LANG=C.UTF-8
STATUS=1
HOME=/root
PATH=/sbin:/bin:/usr/sbin:/usr/bin:/usr/local/sbin:/usr/local/bin:/root/bin
LOCALBASE=/usr/local
USER=root
LIBEXECPREFIX=/usr/local/libexec/poudriere
POUDRIERE_VERSION=3.2.8-23-ga7f8d188
MASTERMNT=/usr/local/poudriere/data/.m/main-powerpc-default/ref
POUDRIERE_BUILD_TYPE=bulk
PACKAGE_BUILDING=yes
SAVED_TERM=
PWD=/usr/local/poudriere/data/.m/main-powerpc-default/ref/.p/pool
P_PORTS_FEATURES=FLAVORS SELECTED_OPTIONS
MASTERNAME=main-powerpc-default
SCRIPTPREFIX=/usr/local/share/poudriere
OLDPWD=/usr/local/poudriere/data/.m/main-powerpc-default/ref/.p
SCRIPTPATH=/usr/local/share/poudriere/bulk.sh
POUDRIEREPATH=/usr/local/bin/poudriere
---End Environment---
---Begin Poudriere Port Flags/Env---
PORT_FLAGS=
PKGENV=
FLAVOR=
DEPENDS_ARGS=
MAKE_ARGS=
---End Poudriere Port Flags/Env---
---Begin OPTIONS List---
---End OPTIONS List---
--MAINTAINER--
mail@ozzmosis.com
--End MAINTAINER--
--CONFIGURE_ARGS--
--End CONFIGURE_ARGS--
--CONFIGURE_ENV--
XDG_DATA_HOME=/wrkdirs/usr/ports/editors/uemacs/work XDG_CONFIG_HOME=/wrkdirs/usr/ports/editors/uemacs/work XDG_CACHE_HOME=/wrkdirs/usr/ports/editors/uemacs/work/.cache HOME=/wrkdirs/usr/ports/editors/uemacs/work TMPDIR="/tmp" PATH=/wrkdirs/usr/ports/editors/uemacs/work/.bin:/sbin:/bin:/usr/sbin:/usr/bin:/usr/local/sbin:/usr/local/bin:/root/bin PKG_CONFIG_LIBDIR=/wrkdirs/usr/ports/editors/uemacs/work/.pkgconfig:/usr/local/libdata/pkgconfig:/usr/local/share/pkgconfig:/usr/libdata/pkgconfig SHELL=/bin/sh CONFIG_SHELL=/bin/sh
--End CONFIGURE_ENV--
--MAKE_ENV--
XDG_DATA_HOME=/wrkdirs/usr/ports/editors/uemacs/work XDG_CONFIG_HOME=/wrkdirs/usr/ports/editors/uemacs/work XDG_CACHE_HOME=/wrkdirs/usr/ports/editors/uemacs/work/.cache HOME=/wrkdirs/usr/ports/editors/uemacs/work TMPDIR="/tmp" PATH=/wrkdirs/usr/ports/editors/uemacs/work/.bin:/sbin:/bin:/usr/sbin:/usr/bin:/usr/local/sbin:/usr/local/bin:/root/bin PKG_CONFIG_LIBDIR=/wrkdirs/usr/ports/editors/uemacs/work/.pkgconfig:/usr/local/libdata/pkgconfig:/usr/local/share/pkgconfig:/usr/libdata/pkgconfig MK_DEBUG_FILES=no MK_KERNEL_SYMBOLS=no SHELL=/bin/sh NO_LINT=YES PREFIX=/usr/local LOCALBASE=/usr/local CC="cc" CFLAGS="-O2 -pipe -fstack-protector-strong -fno-strict-aliasing " CPP="cpp" CPPFLAGS="" LDFLAGS=" -fstack-protector-strong " LIBS="" CXX="c++" CXXFLAGS="-O2 -pipe -fstack-protector-strong -fno-strict-aliasing " MANPREFIX="/usr/local" BSD_INSTALL_PROGRAM="install -s -m 555" BSD_INSTALL_LIB="install -s -m 0644" BSD_INSTALL_SCRIPT="install -m 555" BSD_INSTALL_DATA="install -
m 0644" BSD_INSTALL_MAN="install -m 444"
--End MAKE_ENV--
--PLIST_SUB--
OSREL=14.0 PREFIX=%D LOCALBASE=/usr/local RESETPREFIX=/usr/local LIB32DIR=lib DOCSDIR="share/doc/uemacs" EXAMPLESDIR="share/examples/uemacs" DATADIR="share/uemacs" WWWDIR="www/uemacs" ETCDIR="etc/uemacs"
--End PLIST_SUB--
--SUB_LIST--
PREFIX=/usr/local LOCALBASE=/usr/local DATADIR=/usr/local/share/uemacs DOCSDIR=/usr/local/share/doc/uemacs EXAMPLESDIR=/usr/local/share/examples/uemacs WWWDIR=/usr/local/www/uemacs ETCDIR=/usr/local/etc/uemacs
--End SUB_LIST--
---Begin make.conf---
USE_PACKAGE_DEPENDS=yes
BATCH=yes
WRKDIRPREFIX=/wrkdirs
PORTSDIR=/usr/ports
PACKAGES=/packages
DISTDIR=/distfiles
PACKAGE_BUILDING=yes
PACKAGE_BUILDING_FLAVORS=yes
MACHINE=powerpc
MACHINE_ARCH=powerpc
ARCH=${MACHINE_ARCH}
#### /usr/local/etc/poudriere.d/make.conf ####
# XXX: We really need this but cannot use it while 'make checksum' does not
# try the next mirror on checksum failure. It currently retries the same
# failed mirror and then fails rather then trying another. It *does*
# try the next if the size is mismatched though.
#MASTER_SITE_FREEBSD=yes
# Build ALLOW_MAKE_JOBS_PACKAGES with 2 jobs
MAKE_JOBS_NUMBER=2
#### /usr/ports/Mk/Scripts/ports_env.sh ####
_CCVERSION_921dbbb2=FreeBSD clang version 15.0.7 (https://github.com/llvm/llvm-project.git llvmorg-15.0.7-0-g8dfdcc7b7bf6) Target: powerpc-unknown-freebsd14.0 Thread model: posix InstalledDir: /usr/bin
_ALTCCVERSION_921dbbb2=none
_CXXINTERNAL_acaad9ca=FreeBSD clang version 15.0.7 (https://github.com/llvm/llvm-project.git llvmorg-15.0.7-0-g8dfdcc7b7bf6) Target: powerpc-unknown-freebsd14.0 Thread model: posix InstalledDir: /usr/bin "/usr/bin/ld" "--eh-frame-hdr" "-dynamic-linker" "/libexec/ld-elf.so.1" "--enable-new-dtags" "-m" "elf32ppc_fbsd" "-o" "a.out" "/usr/lib/crt1.o" "/usr/lib/crti.o" "/usr/lib/crtbegin.o" "-L/usr/lib" "/dev/null" "-lc++" "-lm" "-lgcc" "--as-needed" "-lgcc_s" "--no-as-needed" "-lc" "-lgcc" "--as-needed" "-lgcc_s" "--no-as-needed" "/usr/lib/crtend.o" "/usr/lib/crtn.o"
CC_OUTPUT_921dbbb2_58173849=yes
CC_OUTPUT_921dbbb2_9bdba57c=yes
CC_OUTPUT_921dbbb2_6a4fe7f5=yes
CC_OUTPUT_921dbbb2_6bcac02b=yes
CC_OUTPUT_921dbbb2_67d20829=yes
CC_OUTPUT_921dbbb2_bfa62e83=yes
CC_OUTPUT_921dbbb2_f0b4d593=yes
CC_OUTPUT_921dbbb2_308abb44=yes
CC_OUTPUT_921dbbb2_f00456e5=yes
CC_OUTPUT_921dbbb2_65ad290d=yes
CC_OUTPUT_921dbbb2_f2776b26=yes
CC_OUTPUT_921dbbb2_53255a77=yes
CC_OUTPUT_921dbbb2_911cfe02=yes
CC_OUTPUT_921dbbb2_b2657cc3=yes
CC_OUTPUT_921dbbb2_380987f7=yes
CC_OUTPUT_921dbbb2_160933ec=yes
CC_OUTPUT_921dbbb2_fb62803b=yes
CC_OUTPUT_921dbbb2_af59ad06=yes
CC_OUTPUT_921dbbb2_a15f3fcf=yes
_OBJC_CCVERSION_921dbbb2=FreeBSD clang version 15.0.7 (https://github.com/llvm/llvm-project.git llvmorg-15.0.7-0-g8dfdcc7b7bf6) Target: powerpc-unknown-freebsd14.0 Thread model: posix InstalledDir: /usr/bin
_OBJC_ALTCCVERSION_921dbbb2=none
ARCH=powerpc
OPSYS=FreeBSD
_OSRELEASE=14.0-CURRENT
OSREL=14.0
OSVERSION=1400079
PYTHONBASE=/usr/local
CONFIGURE_MAX_CMD_LEN=524288
HAVE_PORTS_ENV=1
#### Misc Poudriere ####
GID=0
UID=0
---End make.conf---
--Resource limits--
cpu time (seconds, -t) unlimited
file size (512-blocks, -f) unlimited
data seg size (kbytes, -d) 1048576
stack size (kbytes, -s) 65536
core file size (512-blocks, -c) unlimited
max memory size (kbytes, -m) unlimited
locked memory (kbytes, -l) unlimited
max user processes (-u) 89999
open files (-n) 1024
virtual mem size (kbytes, -v) unlimited
swap limit (kbytes, -w) unlimited
socket buffer size (bytes, -b) unlimited
pseudo-terminals (-p) unlimited
kqueues (-k) unlimited
umtx shared locks (-o) unlimited
--End resource limits--
=======================<phase: check-sanity >============================
===> License uemacs accepted by the user
===========================================================================
=======================<phase: pkg-depends >============================
===> uemacs-4.0_1 depends on file: /usr/local/sbin/pkg - not found
===> Installing existing package /packages/All/pkg-1.19.1.pkg
[main-powerpc-default-job-04] Installing pkg-1.19.1...
[main-powerpc-default-job-04] Extracting pkg-1.19.1: .......... done
===> uemacs-4.0_1 depends on file: /usr/local/sbin/pkg - found
===> Returning to build of uemacs-4.0_1
===========================================================================
=======================<phase: fetch-depends >============================
===========================================================================
=======================<phase: fetch >============================
===> License uemacs accepted by the user
===> Fetching all distfiles required by uemacs-4.0_1 for building
===========================================================================
=======================<phase: checksum >============================
===> License uemacs accepted by the user
===> Fetching all distfiles required by uemacs-4.0_1 for building
=> SHA256 Checksum OK for ue400dev.zip.
===========================================================================
=======================<phase: extract-depends>============================
===========================================================================
=======================<phase: extract >============================
===> License uemacs accepted by the user
===> Fetching all distfiles required by uemacs-4.0_1 for building
===> Extracting for uemacs-4.0_1
=> SHA256 Checksum OK for ue400dev.zip.
===========================================================================
=======================<phase: patch-depends >============================
===========================================================================
=======================<phase: patch >============================
===> Patching for uemacs-4.0_1
===> Converting DOS text files to UNIX text files
===> Applying FreeBSD patches for uemacs-4.0_1 from /usr/ports/editors/uemacs/files
===========================================================================
<snip>
^~~~~~~~
./src/eval.c:108:12: warning: returning 'const char[]' from a function with result type 'char *' discards qualifiers [-Wincompatible-pointer-types-discards-qualifiers]
return(errorm);
^~~~~~~~
./src/eval.c:133:12: warning: returning 'const char[]' from a function with result type 'char *' discards qualifiers [-Wincompatible-pointer-types-discards-qualifiers]
return(errorm);
^~~~~~~~
./src/eval.c:151:12: warning: returning 'const char[]' from a function with result type 'char *' discards qualifiers [-Wincompatible-pointer-types-discards-qualifiers]
return(errorm);
^~~~~~~~
./src/eval.c:168:30: warning: passing 'const char[]' to parameter of type 'char *' discards qualifiers [-Wincompatible-pointer-types-discards-qualifiers]
return(bytecopy(result, errorm, NSTRING * 2));
^~~~~~
./h/eproto.h:83:52: note: passing argument to parameter 'src' here
extern char *PASCAL NEAR bytecopy(char *dst, char *src, int maxlen);
^
./src/eval.c:213:12: warning: returning 'const char[]' from a function with result type 'char *' discards qualifiers [-Wincompatible-pointer-types-discards-qualifiers]
return(errorm);
^~~~~~~~
./src/eval.c:240:1: warning: non-void function does not return a value in all control paths [-Wreturn-type]
}
^
./src/eval.c:242:19: warning: a function definition without a prototype is deprecated in all versions of C and is not supported in C2x [-Wdeprecated-non-prototype]
char *PASCAL NEAR gtusr(vname) /* look up a user var's value */
^
./src/eval.c:275:12: warning: returning 'const char[]' from a function with result type 'char *' discards qualifiers [-Wincompatible-pointer-types-discards-qualifiers]
return(errorm);
^~~~~~~~
./src/eval.c:283:8: warning: returning 'const char[]' from a function with result type 'char *' discards qualifiers [-Wincompatible-pointer-types-discards-qualifiers]
return(errorm);
^~~~~~~~
./src/eval.c:286:19: warning: a function definition without a prototype is deprecated in all versions of C and is not supported in C2x [-Wdeprecated-non-prototype]
char *PASCAL NEAR funval(i)
^
./src/eval.c:294:19: warning: a function definition without a prototype is deprecated in all versions of C and is not supported in C2x [-Wdeprecated-non-prototype]
char *PASCAL NEAR envval(i)
^
./src/eval.c:302:13: warning: type specifier missing, defaults to 'int'; ISO C99 and later do not support implicit int [-Wimplicit-int]
PASCAL NEAR binary(key, tval, tlength, klength)
^
int
./src/eval.c:302:13: warning: a function definition without a prototype is deprecated in all versions of C and is not supported in C2x [-Wdeprecated-non-prototype]
./src/eval.c:323:33: warning: passing arguments to a function without a prototype is deprecated in all versions of C and is not supported in C2x [-Wdeprecated-non-prototype]
cresult = strncmp(key, (*tval)(i), klength);
^
./src/eval.c:334:19: warning: a function definition without a prototype is deprecated in all versions of C and is not supported in C2x [-Wdeprecated-non-prototype]
char *PASCAL NEAR gtenv(vname)
^
./src/eval.c:347:9: warning: returning 'const char[]' from a function with result type 'char *' discards qualifiers [-Wincompatible-pointer-types-discards-qualifiers]
return(errorm);
^~~~~~~~
./src/eval.c:372:25: warning: returning 'const char *' from a function with result type 'char *' discards qualifiers [-Wincompatible-pointer-types-discards-qualifiers]
case EVDESKCLR: return(cname[deskcolor]);
^~~~~~~~~~~~~~~~~~
./src/eval.c:454:1: warning: non-void function does not return a value in all control paths [-Wreturn-type]
}
^
./src/eval.c:456:19: warning: a function definition without a prototype is deprecated in all versions of C and is not supported in C2x [-Wdeprecated-non-prototype]
char *PASCAL NEAR fixnull(s) /* Don't return NULL pointers! */
^
./src/eval.c:534:19: warning: a function definition without a prototype is deprecated in all versions of C and is not supported in C2x [-Wdeprecated-non-prototype]
char *PASCAL NEAR trimstr(s) /* trim whitespace off the end of a string */
^
./src/eval.c:548:17: warning: a function definition without a prototype is deprecated in all versions of C and is not supported in C2x [-Wdeprecated-non-prototype]
int PASCAL NEAR setvar(f, n) /* set a variable */
^
./src/eval.c:622:17: warning: a function definition without a prototype is deprecated in all versions of C and is not supported in C2x [-Wdeprecated-non-prototype]
int PASCAL NEAR global_var(f, n) /* declare a global variable */
^
./src/eval.c:681:17: warning: a function definition without a prototype is deprecated in all versions of C and is not supported in C2x [-Wdeprecated-non-prototype]
int PASCAL NEAR local_var(f, n) /* declare a local variable */
^
./src/eval.c:742:18: warning: a function definition without a prototype is deprecated in all versions of C and is not supported in C2x [-Wdeprecated-non-prototype]
VOID PASCAL NEAR findvar(var, vd, size, scope)
^
./src/eval.c:819:17: warning: a function definition without a prototype is deprecated in all versions of C and is not supported in C2x [-Wdeprecated-non-prototype]
int PASCAL NEAR svar(var, value) /* set a variable */
^
./src/eval.c:975:33: warning: passing 'char *' to parameter of type 'unsigned char *' converts between pointers to integer types where one is of the unique plain 'char' type and the other is not [-Wpointer-sign]
case EVISTERM: isterm = stock(value);
^~~~~
./h/eproto.h:470:54: note: passing argument to parameter 'keyname' here
extern unsigned int PASCAL NEAR stock(unsigned char *keyname);
^
./src/eval.c:1060:31: warning: passing 'char *' to parameter of type 'unsigned char *' converts between pointers to integer types where one is of the unique plain 'char' type and the other is not [-Wpointer-sign]
case EVSTERM: sterm = stock(value);
^~~~~
./h/eproto.h:470:54: note: passing argument to parameter 'keyname' here
extern unsigned int PASCAL NEAR stock(unsigned char *keyname);
^
./src/eval.c:1101:17: warning: a function definition without a prototype is deprecated in all versions of C and is not supported in C2x [-Wdeprecated-non-prototype]
int PASCAL NEAR asc_int(st)
^
./src/eval.c:1138:19: warning: a function definition without a prototype is deprecated in all versions of C and is not supported in C2x [-Wdeprecated-non-prototype]
char *PASCAL NEAR int_asc(i)
^
./src/eval.c:1181:19: warning: a function definition without a prototype is deprecated in all versions of C and is not supported in C2x [-Wdeprecated-non-prototype]
char *PASCAL NEAR long_asc(num)
^
./src/eval.c:1215:17: warning: a function definition without a prototype is deprecated in all versions of C and is not supported in C2x [-Wdeprecated-non-prototype]
int PASCAL NEAR gettyp(token) /* find the type of a passed token */
^
./src/eval.c:1248:19: warning: a function definition without a prototype is deprecated in all versions of C and is not supported in C2x [-Wdeprecated-non-prototype]
char *PASCAL NEAR getval(token) /* find the value of a token */
^
./src/eval.c:1264:24: warning: passing 'char[128]' to parameter of type 'unsigned char *' converts between pointers to integer types where one is of the unique plain 'char' type and the other is not [-Wpointer-sign]
status = getstring(buf, NSTRING, ctoec(RETCHAR));
^~~
./h/eproto.h:172:49: note: passing argument to parameter 'buf' here
extern int PASCAL NEAR getstring(unsigned char *buf, int nbuf, int eolchar);
^
./src/eval.c:1319:1: warning: non-void function does not return a value in all control paths [-Wreturn-type]
}
^
./src/eval.c:1321:17: warning: a function definition without a prototype is deprecated in all versions of C and is not supported in C2x [-Wdeprecated-non-prototype]
int PASCAL NEAR stol(val) /* convert a string to a numeric logical */
^
./src/eval.c:1336:19: warning: a function definition without a prototype is deprecated in all versions of C and is not supported in C2x [-Wdeprecated-non-prototype]
char *PASCAL NEAR ltos(val) /* numeric logical to string logical */
^
./src/eval.c:1342:9: warning: returning 'const char[]' from a function with result type 'char *' discards qualifiers [-Wincompatible-pointer-types-discards-qualifiers]
return(truem);
^~~~~~~
./src/eval.c:1344:9: warning: returning 'const char[]' from a function with result type 'char *' discards qualifiers [-Wincompatible-pointer-types-discards-qualifiers]
return(falsem);
^~~~~~~~
./src/eval.c:1347:19: warning: a function definition without a prototype is deprecated in all versions of C and is not supported in C2x [-Wdeprecated-non-prototype]
char *PASCAL NEAR mkupper(str) /* make a string upper case */
^
./src/eval.c:1360:19: warning: a function definition without a prototype is deprecated in all versions of C and is not supported in C2x [-Wdeprecated-non-prototype]
char *PASCAL NEAR mklower(str) /* make a string lower case */
^
./src/eval.c:1373:17: warning: a function definition without a prototype is deprecated in all versions of C and is not supported in C2x [-Wdeprecated-non-prototype]
int PASCAL NEAR absv(x) /* take the absolute value of an integer */
^
./src/eval.c:1398:17: warning: a function definition without a prototype is deprecated in all versions of C and is not supported in C2x [-Wdeprecated-non-prototype]
int PASCAL NEAR sindex(source, pattern) /* find pattern within source */
^
./src/eval.c:1433:19: warning: a function definition without a prototype is deprecated in all versions of C and is not supported in C2x [-Wdeprecated-non-prototype]
char *PASCAL NEAR xlat(source, lookup, trans)
^
./src/eval.c:1473:13: warning: type specifier missing, defaults to 'int'; ISO C99 and later do not support implicit int [-Wimplicit-int]
PASCAL NEAR setwlist(wclist)
^
int
./src/eval.c:1473:13: warning: a function definition without a prototype is deprecated in all versions of C and is not supported in C2x [-Wdeprecated-non-prototype]
./src/eval.c:1483:10: error: incompatible pointer to integer conversion returning 'void *' from a function with result type 'int' [-Wint-conversion]
return NULL;
^~~~
/usr/include/sys/_null.h:34:14: note: expanded from macro 'NULL'
#define NULL ((void *)0)
^~~~~~~~~~~
./src/eval.c:1495:9: error: incompatible pointer to integer conversion returning 'void *' from a function with result type 'int' [-Wint-conversion]
return NULL;
^~~~
/usr/include/sys/_null.h:34:14: note: expanded from macro 'NULL'
#define NULL ((void *)0)
^~~~~~~~~~~
./src/eval.c:1501:19: warning: a function definition without a prototype is deprecated in all versions of C and is not supported in C2x [-Wdeprecated-non-prototype]
char *PASCAL NEAR getwlist(buf)
^
./src/eval.c:1525:17: warning: a function definition without a prototype is deprecated in all versions of C and is not supported in C2x [-Wdeprecated-non-prototype]
int PASCAL NEAR is_num(st)
^
./src/eval.c:1558:17: warning: a function definition without a prototype is deprecated in all versions of C and is not supported in C2x [-Wdeprecated-non-prototype]
int PASCAL NEAR dispvar(f, n) /* display a variable's value */
^
./src/eval.c:1608:13: warning: type specifier missing, defaults to 'int'; ISO C99 and later do not support implicit int [-Wimplicit-int]
PASCAL NEAR desvars(f, n)
^
int
./src/eval.c:1608:13: warning: a function definition without a prototype is deprecated in all versions of C and is not supported in C2x [-Wdeprecated-non-prototype]
./src/eval.c:1711:17: warning: a function definition without a prototype is deprecated in all versions of C and is not supported in C2x [-Wdeprecated-non-prototype]
int PASCAL NEAR desfunc(f, n)
^
./src/eval.c:1754:18: warning: a function definition without a prototype is deprecated in all versions of C and is not supported in C2x [-Wdeprecated-non-prototype]
VOID PASCAL NEAR pad(s, len) /* pad a string to indicated length */
^
60 warnings and 2 errors generated.
*** [./eval.o] Error code 1
make[2]: stopped in /wrkdirs/usr/ports/editors/uemacs/work/uemacs-4.0_1/freebsd
--- ./display.o ---
32 warnings generated.
1 error
make[2]: stopped in /wrkdirs/usr/ports/editors/uemacs/work/uemacs-4.0_1/freebsd
*** [all] Error code 2
make[1]: stopped in /wrkdirs/usr/ports/editors/uemacs/work/uemacs-4.0_1
1 error
make[1]: stopped in /wrkdirs/usr/ports/editors/uemacs/work/uemacs-4.0_1
===> Compilation failed unexpectedly.
Try to set MAKE_JOBS_UNSAFE=yes and rebuild before reporting the failure to
the maintainer.
*** Error code 1
Stop.
make: stopped in /usr/ports/editors/uemacs