[package - main-i386-default][net/bindtest] Failed for bindtest-1.56_1 in build

From: <pkg-fallout_at_FreeBSD.org>
Date: Wed, 15 Feb 2023 07:19:18 UTC
You are receiving this mail as a port that you maintain
is failing to build on the FreeBSD package build server.
Please investigate the failure and submit a PR to fix
build.

Maintainer:     jmohacsi@bsd.hu
Log URL:        https://pkg-status.freebsd.org/beefy17/data/main-i386-default/pb4e310378258_s3a3450eda6/logs/bindtest-1.56_1.log
Build URL:      https://pkg-status.freebsd.org/beefy17/build.html?mastername=main-i386-default&build=pb4e310378258_s3a3450eda6
Log:

=>> Building net/bindtest
build started at Wed Feb 15 07:19:17 UTC 2023
port directory: /usr/ports/net/bindtest
package name: bindtest-1.56_1
building for: FreeBSD main-i386-default-job-07 14.0-CURRENT FreeBSD 14.0-CURRENT 1400079 i386
maintained by: jmohacsi@bsd.hu
Makefile ident: 
Poudriere version: 3.2.8-23-ga7f8d188
Host OSVERSION: 1400073
Jail OSVERSION: 1400079
Job Id: 07




!!! Jail is newer than host. (Jail: 1400079, Host: 1400073) !!!
!!! This is not supported. !!!
!!! Host kernel must be same or newer than jail. !!!
!!! Expect build failures. !!!



---Begin Environment---
SHELL=/bin/sh
UNAME_p=i386
UNAME_m=i386
OSVERSION=1400079
UNAME_v=FreeBSD 14.0-CURRENT 1400079
UNAME_r=14.0-CURRENT
BLOCKSIZE=K
MAIL=/var/mail/root
MM_CHARSET=UTF-8
LANG=C.UTF-8
STATUS=1
HOME=/root
PATH=/sbin:/bin:/usr/sbin:/usr/bin:/usr/local/sbin:/usr/local/bin:/root/bin
LOCALBASE=/usr/local
USER=root
LIBEXECPREFIX=/usr/local/libexec/poudriere
POUDRIERE_VERSION=3.2.8-23-ga7f8d188
MASTERMNT=/usr/local/poudriere/data/.m/main-i386-default/ref
POUDRIERE_BUILD_TYPE=bulk
PACKAGE_BUILDING=yes
SAVED_TERM=
PWD=/usr/local/poudriere/data/.m/main-i386-default/ref/.p/pool
P_PORTS_FEATURES=FLAVORS SELECTED_OPTIONS
MASTERNAME=main-i386-default
SCRIPTPREFIX=/usr/local/share/poudriere
OLDPWD=/usr/local/poudriere/data/.m/main-i386-default/ref/.p
SCRIPTPATH=/usr/local/share/poudriere/bulk.sh
POUDRIEREPATH=/usr/local/bin/poudriere
---End Environment---

---Begin Poudriere Port Flags/Env---
PORT_FLAGS=
PKGENV=
FLAVOR=
DEPENDS_ARGS=
MAKE_ARGS=
---End Poudriere Port Flags/Env---

---Begin OPTIONS List---
---End OPTIONS List---

--MAINTAINER--
jmohacsi@bsd.hu
--End MAINTAINER--

--CONFIGURE_ARGS--

--End CONFIGURE_ARGS--

--CONFIGURE_ENV--
XDG_DATA_HOME=/wrkdirs/usr/ports/net/bindtest/work  XDG_CONFIG_HOME=/wrkdirs/usr/ports/net/bindtest/work  XDG_CACHE_HOME=/wrkdirs/usr/ports/net/bindtest/work/.cache  HOME=/wrkdirs/usr/ports/net/bindtest/work TMPDIR="/tmp" PATH=/wrkdirs/usr/ports/net/bindtest/work/.bin:/sbin:/bin:/usr/sbin:/usr/bin:/usr/local/sbin:/usr/local/bin:/root/bin PKG_CONFIG_LIBDIR=/wrkdirs/usr/ports/net/bindtest/work/.pkgconfig:/usr/local/libdata/pkgconfig:/usr/local/share/pkgconfig:/usr/libdata/pkgconfig SHELL=/bin/sh CONFIG_SHELL=/bin/sh
--End CONFIGURE_ENV--

--MAKE_ENV--
XDG_DATA_HOME=/wrkdirs/usr/ports/net/bindtest/work  XDG_CONFIG_HOME=/wrkdirs/usr/ports/net/bindtest/work  XDG_CACHE_HOME=/wrkdirs/usr/ports/net/bindtest/work/.cache  HOME=/wrkdirs/usr/ports/net/bindtest/work TMPDIR="/tmp" PATH=/wrkdirs/usr/ports/net/bindtest/work/.bin:/sbin:/bin:/usr/sbin:/usr/bin:/usr/local/sbin:/usr/local/bin:/root/bin PKG_CONFIG_LIBDIR=/wrkdirs/usr/ports/net/bindtest/work/.pkgconfig:/usr/local/libdata/pkgconfig:/usr/local/share/pkgconfig:/usr/libdata/pkgconfig MK_DEBUG_FILES=no MK_KERNEL_SYMBOLS=no SHELL=/bin/sh NO_LINT=YES PREFIX=/usr/local  LOCALBASE=/usr/local  CC="cc" CFLAGS="-O2 -pipe  -fstack-protector-strong -fno-strict-aliasing "  CPP="cpp" CPPFLAGS=""  LDFLAGS=" -fstack-protector-strong " LIBS=""  CXX="c++" CXXFLAGS="-O2 -pipe -fstack-protector-strong -fno-strict-aliasing  "  MANPREFIX="/usr/local" BSD_INSTALL_PROGRAM="install  -s -m 555"  BSD_INSTALL_LIB="install  -s -m 0644"  BSD_INSTALL_SCRIPT="install  -m 555"  BSD_INSTALL_DATA="install  -m 0644"  BSD
 _INSTALL_MAN="install  -m 444"
--End MAKE_ENV--

--PLIST_SUB--
OSREL=14.0 PREFIX=%D LOCALBASE=/usr/local  RESETPREFIX=/usr/local LIB32DIR=lib DOCSDIR="share/doc/bindtest"  EXAMPLESDIR="share/examples/bindtest"  DATADIR="share/bindtest"  WWWDIR="www/bindtest"  ETCDIR="etc/bindtest"
--End PLIST_SUB--

--SUB_LIST--
PREFIX=/usr/local LOCALBASE=/usr/local  DATADIR=/usr/local/share/bindtest DOCSDIR=/usr/local/share/doc/bindtest EXAMPLESDIR=/usr/local/share/examples/bindtest  WWWDIR=/usr/local/www/bindtest ETCDIR=/usr/local/etc/bindtest
--End SUB_LIST--

---Begin make.conf---
USE_PACKAGE_DEPENDS=yes
BATCH=yes
WRKDIRPREFIX=/wrkdirs
PORTSDIR=/usr/ports
PACKAGES=/packages
DISTDIR=/distfiles
PACKAGE_BUILDING=yes
PACKAGE_BUILDING_FLAVORS=yes
MACHINE=i386
MACHINE_ARCH=i386
ARCH=${MACHINE_ARCH}
#### /usr/local/etc/poudriere.d/make.conf ####
# XXX: We really need this but cannot use it while 'make checksum' does not
# try the next mirror on checksum failure.  It currently retries the same
# failed mirror and then fails rather then trying another.  It *does*
# try the next if the size is mismatched though.
#MASTER_SITE_FREEBSD=yes
# Build ALLOW_MAKE_JOBS_PACKAGES with 2 jobs
MAKE_JOBS_NUMBER=2
#### /usr/ports/Mk/Scripts/ports_env.sh ####
_CCVERSION_921dbbb2=FreeBSD clang version 15.0.7 (https://github.com/llvm/llvm-project.git llvmorg-15.0.7-0-g8dfdcc7b7bf6) Target: i386-unknown-freebsd14.0 Thread model: posix InstalledDir: /usr/bin
_ALTCCVERSION_921dbbb2=none
_CXXINTERNAL_acaad9ca=FreeBSD clang version 15.0.7 (https://github.com/llvm/llvm-project.git llvmorg-15.0.7-0-g8dfdcc7b7bf6) Target: i386-unknown-freebsd14.0 Thread model: posix InstalledDir: /usr/bin "/usr/bin/ld" "--eh-frame-hdr" "-dynamic-linker" "/libexec/ld-elf.so.1" "--hash-style=both" "--enable-new-dtags" "-m" "elf_i386_fbsd" "-o" "a.out" "/usr/lib/crt1.o" "/usr/lib/crti.o" "/usr/lib/crtbegin.o" "-L/usr/lib" "/dev/null" "-lc++" "-lm" "-lgcc" "--as-needed" "-lgcc_s" "--no-as-needed" "-lc" "-lgcc" "--as-needed" "-lgcc_s" "--no-as-needed" "/usr/lib/crtend.o" "/usr/lib/crtn.o"
CC_OUTPUT_921dbbb2_58173849=yes
CC_OUTPUT_921dbbb2_9bdba57c=yes
CC_OUTPUT_921dbbb2_6a4fe7f5=yes
CC_OUTPUT_921dbbb2_6bcac02b=yes
CC_OUTPUT_921dbbb2_67d20829=yes
CC_OUTPUT_921dbbb2_bfa62e83=yes
CC_OUTPUT_921dbbb2_f0b4d593=yes
CC_OUTPUT_921dbbb2_308abb44=yes
CC_OUTPUT_921dbbb2_f00456e5=yes
CC_OUTPUT_921dbbb2_65ad290d=yes
CC_OUTPUT_921dbbb2_f2776b26=yes
CC_OUTPUT_921dbbb2_53255a77=yes
CC_OUTPUT_921dbbb2_911cfe02=yes
CC_OUTPUT_921dbbb2_b2657cc3=yes
CC_OUTPUT_921dbbb2_380987f7=yes
CC_OUTPUT_921dbbb2_160933ec=yes
CC_OUTPUT_921dbbb2_fb62803b=yes
CC_OUTPUT_921dbbb2_af59ad06=yes
CC_OUTPUT_921dbbb2_a15f3fcf=yes
_OBJC_CCVERSION_921dbbb2=FreeBSD clang version 15.0.7 (https://github.com/llvm/llvm-project.git llvmorg-15.0.7-0-g8dfdcc7b7bf6) Target: i386-unknown-freebsd14.0 Thread model: posix InstalledDir: /usr/bin
_OBJC_ALTCCVERSION_921dbbb2=none
ARCH=i386
OPSYS=FreeBSD
_OSRELEASE=14.0-CURRENT
OSREL=14.0
OSVERSION=1400079
PYTHONBASE=/usr/local
CONFIGURE_MAX_CMD_LEN=524288
HAVE_PORTS_ENV=1
#### Misc Poudriere ####
GID=0
UID=0
---End make.conf---
--Resource limits--
cpu time               (seconds, -t)  unlimited
file size           (512-blocks, -f)  unlimited
data seg size           (kbytes, -d)  524288
stack size              (kbytes, -s)  65536
core file size      (512-blocks, -c)  unlimited
max memory size         (kbytes, -m)  unlimited
locked memory           (kbytes, -l)  unlimited
max user processes              (-u)  89999
open files                      (-n)  1024
virtual mem size        (kbytes, -v)  unlimited
swap limit              (kbytes, -w)  unlimited
socket buffer size       (bytes, -b)  unlimited
pseudo-terminals                (-p)  unlimited
kqueues                         (-k)  unlimited
umtx shared locks               (-o)  unlimited
--End resource limits--
=======================<phase: check-sanity   >============================
===========================================================================
=======================<phase: pkg-depends    >============================
===>   bindtest-1.56_1 depends on file: /usr/local/sbin/pkg - not found
===>   Installing existing package /packages/All/pkg-1.19.1_1.pkg
[main-i386-default-job-07] Installing pkg-1.19.1_1...
[main-i386-default-job-07] Extracting pkg-1.19.1_1: .......... done
===>   bindtest-1.56_1 depends on file: /usr/local/sbin/pkg - found
===>   Returning to build of bindtest-1.56_1
===========================================================================
=======================<phase: fetch-depends  >============================
===========================================================================
=======================<phase: fetch          >============================
===> Fetching all distfiles required by bindtest-1.56_1 for building
===========================================================================
=======================<phase: checksum       >============================
===> Fetching all distfiles required by bindtest-1.56_1 for building
=> SHA256 Checksum OK for bindtest.tgz.
===========================================================================
=======================<phase: extract-depends>============================
===========================================================================
=======================<phase: extract        >============================
===> Fetching all distfiles required by bindtest-1.56_1 for building
===>  Extracting for bindtest-1.56_1
=> SHA256 Checksum OK for bindtest.tgz.
===========================================================================
=======================<phase: patch-depends  >============================
===========================================================================
=======================<phase: patch          >============================
===>  Patching for bindtest-1.56_1
===========================================================================
=======================<phase: build-depends  >============================
===========================================================================
=======================<phase: lib-depends    >============================
===========================================================================
=======================<phase: configure      >============================
===>  Configuring for bindtest-1.56_1
===========================================================================
=======================<phase: build          >============================
===>  Building for bindtest-1.56_1
--- objwarn ---
--- .depend ---
--- objwarn ---
Warning: Object directory not changed from original /wrkdirs/usr/ports/net/bindtest/work/bindtest
--- .depend ---
echo bindtest: /usr/lib/libc.a  >> .depend
--- bindtest.o ---
--- bindtest.1.gz ---
--- bindtest.o ---
cc  -O2 -pipe  -fstack-protector-strong -fno-strict-aliasing  -Wall -Werror   -MD  -MF.depend.bindtest.o -MTbindtest.o -std=gnu99 -Wno-format-zero-length -nobuiltininc -idirafter /usr/lib/clang/15.0.7/include -fstack-protector-strong    -Qunused-arguments    -c bindtest.c -o bindtest.o
--- bindtest.1.gz ---
gzip -cn bindtest.1 > bindtest.1.gz
--- bindtest.o ---
bindtest.c:147:1: error: a function definition without a prototype is deprecated in all versions of C and is not supported in C2x [-Werror,-Wdeprecated-non-prototype]
main(argc, argv)
^
bindtest.c:147:1: error: a function definition without a prototype is deprecated in all versions of C and is not supported in C2x [-Werror,-Wdeprecated-non-prototype]
bindtest.c:385:1: error: a function definition without a prototype is deprecated in all versions of C and is not supported in C2x [-Werror,-Wdeprecated-non-prototype]
getres(af, host, port, flags)
^
bindtest.c:385:1: error: a function definition without a prototype is deprecated in all versions of C and is not supported in C2x [-Werror,-Wdeprecated-non-prototype]
bindtest.c:405:1: error: a function definition without a prototype is deprecated in all versions of C and is not supported in C2x [-Werror,-Wdeprecated-non-prototype]
printsa(sa, salen)
^
bindtest.c:405:1: error: a function definition without a prototype is deprecated in all versions of C and is not supported in C2x [-Werror,-Wdeprecated-non-prototype]
bindtest.c:425:1: error: a function definition without a prototype is deprecated in all versions of C and is not supported in C2x [-Werror,-Wdeprecated-non-prototype]
printres(res)
^
bindtest.c:425:1: error: a function definition without a prototype is deprecated in all versions of C and is not supported in C2x [-Werror,-Wdeprecated-non-prototype]
bindtest.c:432:1: error: a function definition without a prototype is deprecated in all versions of C and is not supported in C2x [-Werror,-Wdeprecated-non-prototype]
test(t1, t2)
^
bindtest.c:432:1: error: a function definition without a prototype is deprecated in all versions of C and is not supported in C2x [-Werror,-Wdeprecated-non-prototype]
bindtest.c:654:1: error: a function definition without a prototype is deprecated in all versions of C and is not supported in C2x [-Werror,-Wdeprecated-non-prototype]
sendtest(sa, sb, ai)
^
bindtest.c:654:1: error: a function definition without a prototype is deprecated in all versions of C and is not supported in C2x [-Werror,-Wdeprecated-non-prototype]
bindtest.c:793:1: error: a function definition without a prototype is deprecated in all versions of C and is not supported in C2x [-Werror,-Wdeprecated-non-prototype]
conntest(sa, sb, ai)
^
bindtest.c:793:1: error: a function definition without a prototype is deprecated in all versions of C and is not supported in C2x [-Werror,-Wdeprecated-non-prototype]
14 errors generated.
*** [bindtest.o] Error code 1

make[1]: stopped in /wrkdirs/usr/ports/net/bindtest/work/bindtest
1 error

make[1]: stopped in /wrkdirs/usr/ports/net/bindtest/work/bindtest
===> Compilation failed unexpectedly.
Try to set MAKE_JOBS_UNSAFE=yes and rebuild before reporting the failure to
the maintainer.
*** Error code 1

Stop.
make: stopped in /usr/ports/net/bindtest