[package - 132i386-default][games/stuntrally] Failed for stuntrally-2.6.2_4 in build
- Go to: [ bottom of page ] [ top of archives ] [ this month ]
Date: Fri, 11 Aug 2023 02:39:30 UTC
You are receiving this mail as a port that you maintain
is failing to build on the FreeBSD package build server.
Please investigate the failure and submit a PR to fix
build.
Maintainer: amdmi3@FreeBSD.org
Log URL: https://pkg-status.freebsd.org/beefy15/data/132i386-default/f68709c1b069/logs/stuntrally-2.6.2_4.log
Build URL: https://pkg-status.freebsd.org/beefy15/build.html?mastername=132i386-default&build=f68709c1b069
Log:
=>> Building games/stuntrally
build started at Fri Aug 11 02:38:15 UTC 2023
port directory: /usr/ports/games/stuntrally
package name: stuntrally-2.6.2_4
building for: FreeBSD 132i386-default-job-07 13.2-RELEASE-p2 FreeBSD 13.2-RELEASE-p2 i386
maintained by: amdmi3@FreeBSD.org
Makefile ident:
Poudriere version: 3.2.8-23-ga7f8d188
Host OSVERSION: 1400089
Jail OSVERSION: 1302001
Job Id: 07
---Begin Environment---
SHELL=/bin/csh
UNAME_p=i386
UNAME_m=i386
OSVERSION=1302001
UNAME_v=FreeBSD 13.2-RELEASE-p2
UNAME_r=13.2-RELEASE-p2
BLOCKSIZE=K
MAIL=/var/mail/root
MM_CHARSET=UTF-8
LANG=C.UTF-8
STATUS=1
HOME=/root
PATH=/sbin:/bin:/usr/sbin:/usr/bin:/usr/local/sbin:/usr/local/bin:/root/bin
LOCALBASE=/usr/local
USER=root
LIBEXECPREFIX=/usr/local/libexec/poudriere
POUDRIERE_VERSION=3.2.8-23-ga7f8d188
MASTERMNT=/usr/local/poudriere/data/.m/132i386-default/ref
POUDRIERE_BUILD_TYPE=bulk
PACKAGE_BUILDING=yes
SAVED_TERM=
PWD=/usr/local/poudriere/data/.m/132i386-default/ref/.p/pool
P_PORTS_FEATURES=FLAVORS SELECTED_OPTIONS
MASTERNAME=132i386-default
SCRIPTPREFIX=/usr/local/share/poudriere
OLDPWD=/usr/local/poudriere/data/.m/132i386-default/ref/.p
SCRIPTPATH=/usr/local/share/poudriere/bulk.sh
POUDRIEREPATH=/usr/local/bin/poudriere
---End Environment---
---Begin Poudriere Port Flags/Env---
PORT_FLAGS=
PKGENV=
FLAVOR=
DEPENDS_ARGS=
MAKE_ARGS=
---End Poudriere Port Flags/Env---
---Begin OPTIONS List---
===> The following configuration options are available for stuntrally-2.6.2_4:
DOCS=on: Build and/or install documentation
EDITOR=on: Build the track editor
GAME=on: Build the game binary
MASTER_SERVER=off: Build the master server
===> Use 'make config' to modify these settings
---End OPTIONS List---
--MAINTAINER--
amdmi3@FreeBSD.org
--End MAINTAINER--
--CONFIGURE_ARGS--
--End CONFIGURE_ARGS--
--CONFIGURE_ENV--
PKG_CONFIG=pkgconf SDL2_CONFIG=/usr/local/bin/sdl2-config XDG_DATA_HOME=/wrkdirs/usr/ports/games/stuntrally/work XDG_CONFIG_HOME=/wrkdirs/usr/ports/games/stuntrally/work XDG_CACHE_HOME=/wrkdirs/usr/ports/games/stuntrally/work/.cache HOME=/wrkdirs/usr/ports/games/stuntrally/work TMPDIR="/tmp" PATH=/wrkdirs/usr/ports/games/stuntrally/work/.bin:/sbin:/bin:/usr/sbin:/usr/bin:/usr/local/sbin:/usr/local/bin:/root/bin PKG_CONFIG_LIBDIR=/wrkdirs/usr/ports/games/stuntrally/work/.pkgconfig:/usr/local/libdata/pkgconfig:/usr/local/share/pkgconfig:/usr/libdata/pkgconfig SHELL=/bin/sh CONFIG_SHELL=/bin/sh
--End CONFIGURE_ENV--
--MAKE_ENV--
NINJA_STATUS="[%p %s/%t] " SDL2_CONFIG=/usr/local/bin/sdl2-config XDG_DATA_HOME=/wrkdirs/usr/ports/games/stuntrally/work XDG_CONFIG_HOME=/wrkdirs/usr/ports/games/stuntrally/work XDG_CACHE_HOME=/wrkdirs/usr/ports/games/stuntrally/work/.cache HOME=/wrkdirs/usr/ports/games/stuntrally/work TMPDIR="/tmp" PATH=/wrkdirs/usr/ports/games/stuntrally/work/.bin:/sbin:/bin:/usr/sbin:/usr/bin:/usr/local/sbin:/usr/local/bin:/root/bin PKG_CONFIG_LIBDIR=/wrkdirs/usr/ports/games/stuntrally/work/.pkgconfig:/usr/local/libdata/pkgconfig:/usr/local/share/pkgconfig:/usr/libdata/pkgconfig MK_DEBUG_FILES=no MK_KERNEL_SYMBOLS=no SHELL=/bin/sh NO_LINT=YES DESTDIR=/wrkdirs/usr/ports/games/stuntrally/work/stage PREFIX=/usr/local LOCALBASE=/usr/local CC="cc" CFLAGS="-O2 -pipe -fstack-protector-strong -fno-strict-aliasing " CPP="cpp" CPPFLAGS="" LDFLAGS=" -fstack-protector-strong -Wl,-znotext" LIBS="" CXX="c++" CXXFLAGS="-O2 -pipe -fstack-protector-strong -fno-strict-aliasing " MANPREFIX="/usr/
local" BSD_INSTALL_PROGRAM="install -s -m 555" BSD_INSTALL_LIB="install -s -m 0644" BSD_INSTALL_SCRIPT="install -m 555" BSD_INSTALL_DATA="install -m 0644" BSD_INSTALL_MAN="install -m 444"
--End MAKE_ENV--
--PLIST_SUB--
PORTDOCS="" DOCS="" NO_DOCS="@comment " EDITOR="" NO_EDITOR="@comment " GAME="" NO_GAME="@comment " MASTER_SERVER="@comment " NO_MASTER_SERVER="" CMAKE_BUILD_TYPE="release" OSREL=13.2 PREFIX=%D LOCALBASE=/usr/local RESETPREFIX=/usr/local LIB32DIR=lib DOCSDIR="share/doc/stuntrally" EXAMPLESDIR="share/examples/stuntrally" DATADIR="share/stuntrally" WWWDIR="www/stuntrally" ETCDIR="etc/stuntrally"
--End PLIST_SUB--
--SUB_LIST--
DOCS="" NO_DOCS="@comment " EDITOR="" NO_EDITOR="@comment " GAME="" NO_GAME="@comment " MASTER_SERVER="@comment " NO_MASTER_SERVER="" PREFIX=/usr/local LOCALBASE=/usr/local DATADIR=/usr/local/share/stuntrally DOCSDIR=/usr/local/share/doc/stuntrally EXAMPLESDIR=/usr/local/share/examples/stuntrally WWWDIR=/usr/local/www/stuntrally ETCDIR=/usr/local/etc/stuntrally
--End SUB_LIST--
---Begin make.conf---
USE_PACKAGE_DEPENDS=yes
BATCH=yes
WRKDIRPREFIX=/wrkdirs
PORTSDIR=/usr/ports
PACKAGES=/packages
DISTDIR=/distfiles
PACKAGE_BUILDING=yes
PACKAGE_BUILDING_FLAVORS=yes
MACHINE=i386
MACHINE_ARCH=i386
ARCH=${MACHINE_ARCH}
#### /usr/local/etc/poudriere.d/make.conf ####
# XXX: We really need this but cannot use it while 'make checksum' does not
# try the next mirror on checksum failure. It currently retries the same
# failed mirror and then fails rather then trying another. It *does*
# try the next if the size is mismatched though.
#MASTER_SITE_FREEBSD=yes
# Build ALLOW_MAKE_JOBS_PACKAGES with 2 jobs
MAKE_JOBS_NUMBER=2
#### /usr/ports/Mk/Scripts/ports_env.sh ####
_CCVERSION_921dbbb2=FreeBSD clang version 14.0.5 (https://github.com/llvm/llvm-project.git llvmorg-14.0.5-0-gc12386ae247c) Target: i386-unknown-freebsd13.2 Thread model: posix InstalledDir: /usr/bin
_ALTCCVERSION_921dbbb2=none
_CXXINTERNAL_acaad9ca=FreeBSD clang version 14.0.5 (https://github.com/llvm/llvm-project.git llvmorg-14.0.5-0-gc12386ae247c) Target: i386-unknown-freebsd13.2 Thread model: posix InstalledDir: /usr/bin "/usr/bin/ld" "--eh-frame-hdr" "-dynamic-linker" "/libexec/ld-elf.so.1" "--hash-style=both" "--enable-new-dtags" "-m" "elf_i386_fbsd" "-o" "a.out" "/usr/lib/crt1.o" "/usr/lib/crti.o" "/usr/lib/crtbegin.o" "-L/usr/lib" "/dev/null" "-lc++" "-lm" "-lgcc" "--as-needed" "-lgcc_s" "--no-as-needed" "-lc" "-lgcc" "--as-needed" "-lgcc_s" "--no-as-needed" "/usr/lib/crtend.o" "/usr/lib/crtn.o"
CC_OUTPUT_921dbbb2_58173849=yes
CC_OUTPUT_921dbbb2_9bdba57c=yes
CC_OUTPUT_921dbbb2_6a4fe7f5=yes
CC_OUTPUT_921dbbb2_6bcac02b=yes
CC_OUTPUT_921dbbb2_67d20829=yes
CC_OUTPUT_921dbbb2_bfa62e83=yes
CC_OUTPUT_921dbbb2_f0b4d593=yes
CC_OUTPUT_921dbbb2_308abb44=yes
CC_OUTPUT_921dbbb2_f00456e5=yes
CC_OUTPUT_921dbbb2_65ad290d=yes
CC_OUTPUT_921dbbb2_f2776b26=yes
CC_OUTPUT_921dbbb2_53255a77=yes
CC_OUTPUT_921dbbb2_911cfe02=yes
CC_OUTPUT_921dbbb2_b2657cc3=yes
CC_OUTPUT_921dbbb2_380987f7=yes
CC_OUTPUT_921dbbb2_160933ec=yes
CC_OUTPUT_921dbbb2_fb62803b=yes
CC_OUTPUT_921dbbb2_af59ad06=yes
CC_OUTPUT_921dbbb2_a15f3fcf=yes
_OBJC_CCVERSION_921dbbb2=FreeBSD clang version 14.0.5 (https://github.com/llvm/llvm-project.git llvmorg-14.0.5-0-gc12386ae247c) Target: i386-unknown-freebsd13.2 Thread model: posix InstalledDir: /usr/bin
_OBJC_ALTCCVERSION_921dbbb2=none
ARCH=i386
OPSYS=FreeBSD
_OSRELEASE=13.2-RELEASE-p2
OSREL=13.2
OSVERSION=1302001
PYTHONBASE=/usr/local
CONFIGURE_MAX_CMD_LEN=524288
HAVE_PORTS_ENV=1
#### Misc Poudriere ####
GID=0
UID=0
---End make.conf---
--Resource limits--
cpu time (seconds, -t) unlimited
file size (512-blocks, -f) unlimited
data seg size (kbytes, -d) 524288
stack size (kbytes, -s) 65536
core file size (512-blocks, -c) unlimited
max memory size (kbytes, -m) unlimited
locked memory (kbytes, -l) unlimited
max user processes (-u) 89999
open files (-n) 1024
virtual mem size (kbytes, -v) unlimited
swap limit (kbytes, -w) unlimited
socket buffer size (bytes, -b) unlimited
pseudo-terminals (-p) unlimited
kqueues (-k) unlimited
umtx shared locks (-o) unlimited
--End resource limits--
=======================<phase: check-sanity >============================
===> License GPLv2+ accepted by the user
===========================================================================
=======================<phase: pkg-depends >============================
===> stuntrally-2.6.2_4 depends on file: /usr/local/sbin/pkg - not found
===> Installing existing package /packages/All/pkg-1.20.5.pkg
[132i386-default-job-07] Installing pkg-1.20.5...
[132i386-default-job-07] Extracting pkg-1.20.5: .......... done
===> stuntrally-2.6.2_4 depends on file: /usr/local/sbin/pkg - found
===> Returning to build of stuntrally-2.6.2_4
===========================================================================
=======================<phase: fetch-depends >============================
===========================================================================
=======================<phase: fetch >============================
===> License GPLv2+ accepted by the user
===> Fetching all distfiles required by stuntrally-2.6.2_4 for building
===========================================================================
=======================<phase: checksum >============================
===> License GPLv2+ accepted by the user
===> Fetching all distfiles required by stuntrally-2.6.2_4 for building
=> SHA256 Checksum OK for stuntrally-stuntrally-2.6.2_GH0.tar.gz.
=> SHA256 Checksum OK for stuntrally-tracks-2.6.2_GH0.tar.gz.
===========================================================================
=======================<phase: extract-depends>============================
===========================================================================
=======================<phase: extract >============================
===> License GPLv2+ accepted by the user
===> Fetching all distfiles required by stuntrally-2.6.2_4 for building
===> Extracting for stuntrally-2.6.2_4
=> SHA256 Checksum OK for stuntrally-stuntrally-2.6.2_GH0.tar.gz.
=> SHA256 Checksum OK for stuntrally-tracks-2.6.2_GH0.tar.gz.
===========================================================================
=======================<phase: patch-depends >============================
===========================================================================
=======================<phase: patch >============================
===> Patching for stuntrally-2.6.2_4
===> Converting DOS text files to UNIX text files
===> Applying FreeBSD patches for stuntrally-2.6.2_4 from /usr/ports/games/stuntrally/files
===========================================================================
=======================<phase: build-depends >============================
===> stuntrally-2.6.2_4 depends on file: /usr/local/include/MYGUI/MyGUI_OgreTexture.h - not found
<snip>
message("The practice of declaring the Bind placeholders (_1, _2, ...) " "in the global namespace is deprecated. Please use " "<boost/bind/bind.hpp> + using namespace boost::placeholders, " "or define BOOST_BIND_GLOBAL_PLACEHOLDERS to retain the current behavior.")
^
In file included from /wrkdirs/usr/ports/games/stuntrally/work/stuntrally-2.6.2/source/ogre/BaseApp_Create.cpp:8:
In file included from /wrkdirs/usr/ports/games/stuntrally/work/stuntrally-2.6.2/source/ogre/../network/masterclient.hpp:10:
In file included from /wrkdirs/usr/ports/games/stuntrally/work/stuntrally-2.6.2/source/ogre/../network/protocol.hpp:14:
In file included from /wrkdirs/usr/ports/games/stuntrally/work/stuntrally-2.6.2/source/ogre/../network/../vdrift/mathvector.h:8:
/wrkdirs/usr/ports/games/stuntrally/work/stuntrally-2.6.2/source/vdrift/joeserialize.h:949:4: warning: 'register' storage class specifier is deprecated and incompatible with C++17 [-Wdeprecated-register]
register int i = 0;
^~~~~~~~~
/wrkdirs/usr/ports/games/stuntrally/work/stuntrally-2.6.2/source/vdrift/joeserialize.h:950:4: warning: 'register' storage class specifier is deprecated and incompatible with C++17 [-Wdeprecated-register]
register int j = n-1;
^~~~~~~~~
/wrkdirs/usr/ports/games/stuntrally/work/stuntrally-2.6.2/source/vdrift/joeserialize.h:1028:4: warning: 'register' storage class specifier is deprecated and incompatible with C++17 [-Wdeprecated-register]
register int i = 0;
^~~~~~~~~
/wrkdirs/usr/ports/games/stuntrally/work/stuntrally-2.6.2/source/vdrift/joeserialize.h:1029:4: warning: 'register' storage class specifier is deprecated and incompatible with C++17 [-Wdeprecated-register]
register int j = n-1;
^~~~~~~~~
In file included from /wrkdirs/usr/ports/games/stuntrally/work/stuntrally-2.6.2/source/ogre/BaseApp_Create.cpp:13:
In file included from /wrkdirs/usr/ports/games/stuntrally/work/stuntrally-2.6.2/source/ogre/Compositor.h:3:
In file included from /wrkdirs/usr/ports/games/stuntrally/work/stuntrally-2.6.2/source/ogre/CGame.h:11:
In file included from /wrkdirs/usr/ports/games/stuntrally/work/stuntrally-2.6.2/source/ogre/../shiny/Main/Factory.hpp:8:
In file included from /wrkdirs/usr/ports/games/stuntrally/work/stuntrally-2.6.2/source/ogre/../shiny/Main/MaterialInstance.hpp:7:
/wrkdirs/usr/ports/games/stuntrally/work/stuntrally-2.6.2/source/ogre/../shiny/Main/PropertyBase.hpp:192:14: warning: expression with side effects will be evaluated despite being used as an operand to 'typeid' [-Wpotentially-evaluated-expression]
if (typeid(*value).name() == typeid(LinkedValue).name())
^
/wrkdirs/usr/ports/games/stuntrally/work/stuntrally-2.6.2/source/ogre/../shiny/Main/PropertyBase.hpp:198:34: warning: expression with side effects will be evaluated despite being used as an operand to 'typeid' [-Wpotentially-evaluated-expression]
if (typeid(T).name() == typeid(*value).name())
^
/wrkdirs/usr/ports/games/stuntrally/work/stuntrally-2.6.2/source/ogre/../shiny/Main/PropertyBase.hpp:205:14: warning: expression with side effects will be evaluated despite being used as an operand to 'typeid' [-Wpotentially-evaluated-expression]
&& typeid(*value).name() != typeid(StringValue).name())
^
In file included from /wrkdirs/usr/ports/games/stuntrally/work/stuntrally-2.6.2/source/ogre/BaseApp_Create.cpp:41:
/wrkdirs/usr/ports/games/stuntrally/work/stuntrally-2.6.2/source/ogre/common/PointerFix.h:20:15: warning: 'deserialization' overrides a member function but is not marked 'override' [-Winconsistent-missing-override]
virtual void deserialization(MyGUI::xml::ElementPtr _node, MyGUI::Version _version);
^
/usr/local/include/MYGUI/MyGUI_IResource.h:48:8: note: overridden virtual function is here
void deserialization(xml::ElementPtr _node, Version /*_version*/) override
^
In file included from /wrkdirs/usr/ports/games/stuntrally/work/stuntrally-2.6.2/source/ogre/BaseApp_Create.cpp:41:
/wrkdirs/usr/ports/games/stuntrally/work/stuntrally-2.6.2/source/ogre/common/PointerFix.h:22:15: warning: 'setImage' overrides a member function but is not marked 'override' [-Winconsistent-missing-override]
virtual void setImage(MyGUI::ImageBox* _image);
^
/usr/local/include/MYGUI/MyGUI_IPointer.h:22:16: note: overridden virtual function is here
virtual void setImage(ImageBox* _image) = 0;
^
In file included from /wrkdirs/usr/ports/games/stuntrally/work/stuntrally-2.6.2/source/ogre/BaseApp_Create.cpp:41:
/wrkdirs/usr/ports/games/stuntrally/work/stuntrally-2.6.2/source/ogre/common/PointerFix.h:23:15: warning: 'setPosition' overrides a member function but is not marked 'override' [-Winconsistent-missing-override]
virtual void setPosition(MyGUI::ImageBox* _image, const MyGUI::IntPoint& _point);
^
/usr/local/include/MYGUI/MyGUI_IPointer.h:23:16: note: overridden virtual function is here
virtual void setPosition(ImageBox* _image, const IntPoint& _point) = 0;
^
/wrkdirs/usr/ports/games/stuntrally/work/stuntrally-2.6.2/source/ogre/BaseApp_Create.cpp:120:7: error: member access into incomplete type 'Ogre::Root'
mRoot->addFrameListener(this);
^
/usr/local/include/OGRE/OgrePrerequisites.h:211:11: note: forward declaration of 'Ogre::Root'
class Root;
^
/wrkdirs/usr/ports/games/stuntrally/work/stuntrally-2.6.2/source/ogre/BaseApp_Create.cpp:133:8: error: member access into incomplete type 'Ogre::Root'
mRoot->startRendering(); // default
^
/usr/local/include/OGRE/OgrePrerequisites.h:211:11: note: forward declaration of 'Ogre::Root'
class Root;
^
/wrkdirs/usr/ports/games/stuntrally/work/stuntrally-2.6.2/source/ogre/BaseApp_Create.cpp:138:24: warning: 'WindowEventUtilities' is deprecated [-Wdeprecated-declarations]
WindowEventUtilities::messagePump();
^
/usr/local/include/OGRE/Bites/OgreWindowEventUtilities.h:177:13: note: 'WindowEventUtilities' has been explicitly marked deprecated here
typedef OGRE_DEPRECATED OgreBites::WindowEventUtilities WindowEventUtilities;
^
/usr/local/include/OGRE/OgreExports.h:25:43: note: expanded from macro 'OGRE_DEPRECATED'
# define OGRE_DEPRECATED __attribute__ ((__deprecated__))
^
/wrkdirs/usr/ports/games/stuntrally/work/stuntrally-2.6.2/source/ogre/BaseApp_Create.cpp:143:15: error: member access into incomplete type 'Ogre::Root'
if (!mRoot->renderOneFrame())
^
/usr/local/include/OGRE/OgrePrerequisites.h:211:11: note: forward declaration of 'Ogre::Root'
class Root;
^
/wrkdirs/usr/ports/games/stuntrally/work/stuntrally-2.6.2/source/ogre/BaseApp_Create.cpp:206:2: error: incomplete type 'Ogre::CompositorManager' named in nested name specifier
CompositorManager::getSingleton().removeAll();
^~~~~~~~~~~~~~~~~~~
/usr/local/include/OGRE/OgrePrerequisites.h:264:11: note: forward declaration of 'Ogre::CompositorManager'
class CompositorManager;
^
/wrkdirs/usr/ports/games/stuntrally/work/stuntrally-2.6.2/source/ogre/BaseApp_Create.cpp:230:7: error: member access into incomplete type 'Ogre::Root'
mRoot->unloadPlugin("RenderSystem_GL");
^
/usr/local/include/OGRE/OgrePrerequisites.h:211:11: note: forward declaration of 'Ogre::Root'
class Root;
^
/wrkdirs/usr/ports/games/stuntrally/work/stuntrally-2.6.2/source/ogre/BaseApp_Create.cpp:233:2: warning: deleting pointer to incomplete type 'Ogre::Root' may cause undefined behavior [-Wdelete-incomplete]
OGRE_DELETE mRoot;
^ ~~~~~
/usr/local/include/OGRE/OgreMemoryAllocatorConfig.h:202:24: note: expanded from macro 'OGRE_DELETE'
# define OGRE_DELETE delete
^
/usr/local/include/OGRE/OgrePrerequisites.h:211:11: note: forward declaration of 'Ogre::Root'
class Root;
^
/wrkdirs/usr/ports/games/stuntrally/work/stuntrally-2.6.2/source/ogre/BaseApp_Create.cpp:245:16: error: member access into incomplete type 'Ogre::Root'
if (rs = mRoot->getRenderSystemByName(pSet->rendersystem))
^
/usr/local/include/OGRE/OgrePrerequisites.h:211:11: note: forward declaration of 'Ogre::Root'
class Root;
^
/wrkdirs/usr/ports/games/stuntrally/work/stuntrally-2.6.2/source/ogre/BaseApp_Create.cpp:245:9: warning: using the result of an assignment as a condition without parentheses [-Wparentheses]
if (rs = mRoot->getRenderSystemByName(pSet->rendersystem))
~~~^~~~~~~~~~~~~~~~~~~~~~~~~~~~~~~~~~~~~~~~~~~~~~~~~~
/wrkdirs/usr/ports/games/stuntrally/work/stuntrally-2.6.2/source/ogre/BaseApp_Create.cpp:245:9: note: place parentheses around the assignment to silence this warning
if (rs = mRoot->getRenderSystemByName(pSet->rendersystem))
^
( )
/wrkdirs/usr/ports/games/stuntrally/work/stuntrally-2.6.2/source/ogre/BaseApp_Create.cpp:245:9: note: use '==' to turn this assignment into an equality comparison
if (rs = mRoot->getRenderSystemByName(pSet->rendersystem))
^
==
/wrkdirs/usr/ports/games/stuntrally/work/stuntrally-2.6.2/source/ogre/BaseApp_Create.cpp:247:8: error: member access into incomplete type 'Ogre::Root'
mRoot->setRenderSystem(rs);
^
/usr/local/include/OGRE/OgrePrerequisites.h:211:11: note: forward declaration of 'Ogre::Root'
class Root;
^
/wrkdirs/usr/ports/games/stuntrally/work/stuntrally-2.6.2/source/ogre/BaseApp_Create.cpp:253:8: error: member access into incomplete type 'Ogre::Root'
mRoot->getRenderSystem()->setConfigOption("RTT Preferred Mode", pSet->buffer);
^
/usr/local/include/OGRE/OgrePrerequisites.h:211:11: note: forward declaration of 'Ogre::Root'
class Root;
^
/wrkdirs/usr/ports/games/stuntrally/work/stuntrally-2.6.2/source/ogre/BaseApp_Create.cpp:255:7: error: member access into incomplete type 'Ogre::Root'
mRoot->initialise(false);
^
/usr/local/include/OGRE/OgrePrerequisites.h:211:11: note: forward declaration of 'Ogre::Root'
class Root;
^
/wrkdirs/usr/ports/games/stuntrally/work/stuntrally-2.6.2/source/ogre/BaseApp_Create.cpp:344:8: error: member access into incomplete type 'Ogre::Root'
mRoot->loadPlugin(PATHMANAGER::OgrePluginDir() + "/RenderSystem_GL" + D_SUFFIX);
^
/usr/local/include/OGRE/OgrePrerequisites.h:211:11: note: forward declaration of 'Ogre::Root'
class Root;
^
/wrkdirs/usr/ports/games/stuntrally/work/stuntrally-2.6.2/source/ogre/BaseApp_Create.cpp:350:9: error: member access into incomplete type 'Ogre::Root'
mRoot->loadPlugin(PATHMANAGER::OgrePluginDir() + "/RenderSystem_GL" + D_SUFFIX);
^
/usr/local/include/OGRE/OgrePrerequisites.h:211:11: note: forward declaration of 'Ogre::Root'
class Root;
^
/wrkdirs/usr/ports/games/stuntrally/work/stuntrally-2.6.2/source/ogre/BaseApp_Create.cpp:352:9: error: member access into incomplete type 'Ogre::Root'
mRoot->loadPlugin(PATHMANAGER::OgrePluginDir() + "/RenderSystem_Direct3D9" + D_SUFFIX);
^
/usr/local/include/OGRE/OgrePrerequisites.h:211:11: note: forward declaration of 'Ogre::Root'
class Root;
^
/wrkdirs/usr/ports/games/stuntrally/work/stuntrally-2.6.2/source/ogre/BaseApp_Create.cpp:355:7: error: member access into incomplete type 'Ogre::Root'
mRoot->loadPlugin(PATHMANAGER::OgrePluginDir() + "/Plugin_ParticleFX" + D_SUFFIX);
^
/usr/local/include/OGRE/OgrePrerequisites.h:211:11: note: forward declaration of 'Ogre::Root'
class Root;
^
/wrkdirs/usr/ports/games/stuntrally/work/stuntrally-2.6.2/source/ogre/BaseApp_Create.cpp:357:10: error: member access into incomplete type 'Ogre::Root'
mRoot->loadPlugin(PATHMANAGER::OgrePluginDir() + "/Codec_STBI" + D_SUFFIX);
^
/usr/local/include/OGRE/OgrePrerequisites.h:211:11: note: forward declaration of 'Ogre::Root'
class Root;
^
/wrkdirs/usr/ports/games/stuntrally/work/stuntrally-2.6.2/source/ogre/BaseApp_Create.cpp:370:19: error: member access into incomplete type 'Ogre::Root'
mSceneMgr = mRoot->createSceneManager("DefaultSceneManager");
^
/usr/local/include/OGRE/OgrePrerequisites.h:211:11: note: forward declaration of 'Ogre::Root'
class Root;
^
/wrkdirs/usr/ports/games/stuntrally/work/stuntrally-2.6.2/source/ogre/BaseApp_Create.cpp:374:11: error: member access into incomplete type 'Ogre::SceneManager'
mSceneMgr->addRenderQueueListener(pOverlaySystem);
^
/usr/local/include/OGRE/OgrePrerequisites.h:212:11: note: forward declaration of 'Ogre::SceneManager'
class SceneManager;
^
/wrkdirs/usr/ports/games/stuntrally/work/stuntrally-2.6.2/source/ogre/BaseApp_Create.cpp:381:2: error: incomplete type 'Ogre::TextureManager' named in nested name specifier
TextureManager::getSingleton().setDefaultNumMipmaps(5);
^~~~~~~~~~~~~~~~
/usr/local/include/OGRE/OgrePrerequisites.h:245:11: note: forward declaration of 'Ogre::TextureManager'
class TextureManager;
^
/wrkdirs/usr/ports/games/stuntrally/work/stuntrally-2.6.2/source/ogre/BaseApp_Create.cpp:438:2: error: unknown type name 'ConfigFile'
ConfigFile cf;
^
/wrkdirs/usr/ports/games/stuntrally/work/stuntrally-2.6.2/source/ogre/BaseApp_Create.cpp:444:2: error: use of undeclared identifier 'ConfigFile'
ConfigFile::SectionIterator seci = cf.getSectionIterator();
^
fatal error: too many errors emitted, stopping now [-ferror-limit=]
14 warnings and 20 errors generated.
ninja: build stopped: subcommand failed.
===> Compilation failed unexpectedly.
Try to set MAKE_JOBS_UNSAFE=yes and rebuild before reporting the failure to
the maintainer.
*** Error code 1
Stop.
make: stopped in /usr/ports/games/stuntrally