[package - 131powerpc64le-quarterly][graphics/filament] Failed for filament-1.32.1 in build
- Go to: [ bottom of page ] [ top of archives ] [ this month ]
Date: Sat, 22 Apr 2023 21:24:37 UTC
You are receiving this mail as a port that you maintain
is failing to build on the FreeBSD package build server.
Please investigate the failure and submit a PR to fix
build.
Maintainer: yuri@FreeBSD.org
Log URL: https://pkg-status.freebsd.org/foul2/data/131powerpc64le-quarterly/6969a9c96640/logs/filament-1.32.1.log
Build URL: https://pkg-status.freebsd.org/foul2/build.html?mastername=131powerpc64le-quarterly&build=6969a9c96640
Log:
=>> Building graphics/filament
build started at Sat Apr 22 20:13:06 UTC 2023
port directory: /usr/ports/graphics/filament
package name: filament-1.32.1
building for: FreeBSD 131powerpc64le-quarterly-job-18 13.1-RELEASE FreeBSD 13.1-RELEASE powerpc
maintained by: yuri@FreeBSD.org
Makefile ident:
Poudriere version: 3.2.8-23-ga7f8d188
Host OSVERSION: 1400073
Jail OSVERSION: 1301000
Job Id: 18
---Begin Environment---
SHELL=/bin/csh
OSVERSION=1301000
UNAME_v=FreeBSD 13.1-RELEASE
UNAME_r=13.1-RELEASE
BLOCKSIZE=K
MAIL=/var/mail/root
MM_CHARSET=UTF-8
LANG=C.UTF-8
STATUS=1
HOME=/root
PATH=/sbin:/bin:/usr/sbin:/usr/bin:/usr/local/sbin:/usr/local/bin:/root/bin
LOCALBASE=/usr/local
USER=root
LIBEXECPREFIX=/usr/local/libexec/poudriere
POUDRIERE_VERSION=3.2.8-23-ga7f8d188
MASTERMNT=/usr/local/poudriere/data/.m/131powerpc64le-quarterly/ref
POUDRIERE_BUILD_TYPE=bulk
PACKAGE_BUILDING=yes
SAVED_TERM=
PWD=/usr/local/poudriere/data/.m/131powerpc64le-quarterly/ref/.p/pool
P_PORTS_FEATURES=FLAVORS SELECTED_OPTIONS
MASTERNAME=131powerpc64le-quarterly
SCRIPTPREFIX=/usr/local/share/poudriere
OLDPWD=/usr/local/poudriere/data/.m/131powerpc64le-quarterly/ref/.p
SCRIPTPATH=/usr/local/share/poudriere/bulk.sh
POUDRIEREPATH=/usr/local/bin/poudriere
---End Environment---
---Begin Poudriere Port Flags/Env---
PORT_FLAGS=
PKGENV=
FLAVOR=
DEPENDS_ARGS=
MAKE_ARGS=
---End Poudriere Port Flags/Env---
---Begin OPTIONS List---
===> The following configuration options are available for filament-1.32.1:
SAMPLES=off: Build samples
===> Use 'make config' to modify these settings
---End OPTIONS List---
--MAINTAINER--
yuri@FreeBSD.org
--End MAINTAINER--
--CONFIGURE_ARGS--
--End CONFIGURE_ARGS--
--CONFIGURE_ENV--
PYTHON="/usr/local/bin/python3.9" SDL2_CONFIG=/usr/local/bin/sdl2-config XDG_DATA_HOME=/wrkdirs/usr/ports/graphics/filament/work XDG_CONFIG_HOME=/wrkdirs/usr/ports/graphics/filament/work XDG_CACHE_HOME=/wrkdirs/usr/ports/graphics/filament/work/.cache HOME=/wrkdirs/usr/ports/graphics/filament/work TMPDIR="/tmp" PATH=/wrkdirs/usr/ports/graphics/filament/work/.bin:/sbin:/bin:/usr/sbin:/usr/bin:/usr/local/sbin:/usr/local/bin:/root/bin PKG_CONFIG_LIBDIR=/wrkdirs/usr/ports/graphics/filament/work/.pkgconfig:/usr/local/libdata/pkgconfig:/usr/local/share/pkgconfig:/usr/libdata/pkgconfig SHELL=/bin/sh CONFIG_SHELL=/bin/sh CMAKE_PREFIX_PATH="/usr/local"
--End CONFIGURE_ENV--
--MAKE_ENV--
NINJA_STATUS="[%p %s/%t] " SDL2_CONFIG=/usr/local/bin/sdl2-config XDG_DATA_HOME=/wrkdirs/usr/ports/graphics/filament/work XDG_CONFIG_HOME=/wrkdirs/usr/ports/graphics/filament/work XDG_CACHE_HOME=/wrkdirs/usr/ports/graphics/filament/work/.cache HOME=/wrkdirs/usr/ports/graphics/filament/work TMPDIR="/tmp" PATH=/wrkdirs/usr/ports/graphics/filament/work/.bin:/sbin:/bin:/usr/sbin:/usr/bin:/usr/local/sbin:/usr/local/bin:/root/bin PKG_CONFIG_LIBDIR=/wrkdirs/usr/ports/graphics/filament/work/.pkgconfig:/usr/local/libdata/pkgconfig:/usr/local/share/pkgconfig:/usr/libdata/pkgconfig MK_DEBUG_FILES=no MK_KERNEL_SYMBOLS=no SHELL=/bin/sh NO_LINT=YES DESTDIR=/wrkdirs/usr/ports/graphics/filament/work/stage PREFIX=/usr/local LOCALBASE=/usr/local CC="cc" CFLAGS="-O2 -pipe -fstack-protector-strong -isystem /usr/local/include -fno-strict-aliasing " CPP="cpp" CPPFLAGS="-isystem /usr/local/include" LDFLAGS=" -lexecinfo -lSDL2 -fstack-protector-strong -L/usr/local/lib " LIBS="" CXX="c++" CXXFLAGS="
-O2 -pipe -fstack-protector-strong -isystem /usr/local/include -fno-strict-aliasing -isystem /usr/local/include " MANPREFIX="/usr/local" BSD_INSTALL_PROGRAM="install -s -m 555" BSD_INSTALL_LIB="install -s -m 0644" BSD_INSTALL_SCRIPT="install -m 555" BSD_INSTALL_DATA="install -m 0644" BSD_INSTALL_MAN="install -m 444"
--End MAKE_ENV--
--PLIST_SUB--
SAMPLES="@comment " NO_SAMPLES="" CMAKE_BUILD_TYPE="release" PYTHON_INCLUDEDIR=include/python3.9 PYTHON_LIBDIR=lib/python3.9 PYTHON_PLATFORM=freebsd13 PYTHON_SITELIBDIR=lib/python3.9/site-packages PYTHON_SUFFIX=39 PYTHON_EXT_SUFFIX=.cpython-39 PYTHON_VER=3.9 PYTHON_VERSION=python3.9 PYTHON2="@comment " PYTHON3="" OSREL=13.1 PREFIX=%D LOCALBASE=/usr/local RESETPREFIX=/usr/local LIB32DIR=lib DOCSDIR="share/doc/filament" EXAMPLESDIR="share/examples/filament" DATADIR="share/filament" WWWDIR="www/filament" ETCDIR="etc/filament"
--End PLIST_SUB--
--SUB_LIST--
SAMPLES="@comment " NO_SAMPLES="" PYTHON_INCLUDEDIR=/usr/local/include/python3.9 PYTHON_LIBDIR=/usr/local/lib/python3.9 PYTHON_PLATFORM=freebsd13 PYTHON_SITELIBDIR=/usr/local/lib/python3.9/site-packages PYTHON_SUFFIX=39 PYTHON_EXT_SUFFIX=.cpython-39 PYTHON_VER=3.9 PYTHON_VERSION=python3.9 PYTHON2="@comment " PYTHON3="" PREFIX=/usr/local LOCALBASE=/usr/local DATADIR=/usr/local/share/filament DOCSDIR=/usr/local/share/doc/filament EXAMPLESDIR=/usr/local/share/examples/filament WWWDIR=/usr/local/www/filament ETCDIR=/usr/local/etc/filament
--End SUB_LIST--
---Begin make.conf---
USE_PACKAGE_DEPENDS=yes
BATCH=yes
WRKDIRPREFIX=/wrkdirs
PORTSDIR=/usr/ports
PACKAGES=/packages
DISTDIR=/distfiles
PACKAGE_BUILDING=yes
PACKAGE_BUILDING_FLAVORS=yes
#### /usr/local/etc/poudriere.d/make.conf ####
# XXX: We really need this but cannot use it while 'make checksum' does not
# try the next mirror on checksum failure. It currently retries the same
# failed mirror and then fails rather then trying another. It *does*
# try the next if the size is mismatched though.
#MASTER_SITE_FREEBSD=yes
# Build ALLOW_MAKE_JOBS_PACKAGES with 2 jobs
MAKE_JOBS_NUMBER=2
#### /usr/ports/Mk/Scripts/ports_env.sh ####
_CCVERSION_921dbbb2=FreeBSD clang version 13.0.0 (git@github.com:llvm/llvm-project.git llvmorg-13.0.0-0-gd7b669b3a303) Target: powerpc64le-unknown-freebsd13.1 Thread model: posix InstalledDir: /usr/bin
_ALTCCVERSION_921dbbb2=none
_CXXINTERNAL_acaad9ca=FreeBSD clang version 13.0.0 (git@github.com:llvm/llvm-project.git llvmorg-13.0.0-0-gd7b669b3a303) Target: powerpc64le-unknown-freebsd13.1 Thread model: posix InstalledDir: /usr/bin "/usr/bin/ld" "--eh-frame-hdr" "-dynamic-linker" "/libexec/ld-elf.so.1" "--enable-new-dtags" "-o" "a.out" "/usr/lib/crt1.o" "/usr/lib/crti.o" "/usr/lib/crtbegin.o" "-L/usr/lib" "/dev/null" "-lc++" "-lm" "-lgcc" "--as-needed" "-lgcc_s" "--no-as-needed" "-lc" "-lgcc" "--as-needed" "-lgcc_s" "--no-as-needed" "/usr/lib/crtend.o" "/usr/lib/crtn.o"
CC_OUTPUT_921dbbb2_58173849=yes
CC_OUTPUT_921dbbb2_9bdba57c=yes
CC_OUTPUT_921dbbb2_6a4fe7f5=yes
CC_OUTPUT_921dbbb2_6bcac02b=yes
CC_OUTPUT_921dbbb2_67d20829=yes
CC_OUTPUT_921dbbb2_bfa62e83=yes
CC_OUTPUT_921dbbb2_f0b4d593=yes
CC_OUTPUT_921dbbb2_308abb44=yes
CC_OUTPUT_921dbbb2_f00456e5=yes
CC_OUTPUT_921dbbb2_65ad290d=yes
CC_OUTPUT_921dbbb2_f2776b26=yes
CC_OUTPUT_921dbbb2_53255a77=yes
CC_OUTPUT_921dbbb2_911cfe02=yes
CC_OUTPUT_921dbbb2_b2657cc3=yes
CC_OUTPUT_921dbbb2_380987f7=yes
CC_OUTPUT_921dbbb2_160933ec=yes
CC_OUTPUT_921dbbb2_fb62803b=yes
CC_OUTPUT_921dbbb2_af59ad06=yes
CC_OUTPUT_921dbbb2_a15f3fcf=yes
_OBJC_CCVERSION_921dbbb2=FreeBSD clang version 13.0.0 (git@github.com:llvm/llvm-project.git llvmorg-13.0.0-0-gd7b669b3a303) Target: powerpc64le-unknown-freebsd13.1 Thread model: posix InstalledDir: /usr/bin
_OBJC_ALTCCVERSION_921dbbb2=none
ARCH=powerpc64le
OPSYS=FreeBSD
_OSRELEASE=13.1-RELEASE
OSREL=13.1
OSVERSION=1301000
PYTHONBASE=/usr/local
CONFIGURE_MAX_CMD_LEN=524288
HAVE_PORTS_ENV=1
#### Misc Poudriere ####
GID=0
UID=0
---End make.conf---
--Resource limits--
cpu time (seconds, -t) unlimited
file size (512-blocks, -f) unlimited
data seg size (kbytes, -d) 33554432
stack size (kbytes, -s) 524288
core file size (512-blocks, -c) unlimited
max memory size (kbytes, -m) unlimited
locked memory (kbytes, -l) unlimited
max user processes (-u) 89999
open files (-n) 1024
virtual mem size (kbytes, -v) unlimited
swap limit (kbytes, -w) unlimited
socket buffer size (bytes, -b) unlimited
pseudo-terminals (-p) unlimited
kqueues (-k) unlimited
umtx shared locks (-o) unlimited
--End resource limits--
=======================<phase: check-sanity >============================
===> License APACHE20 accepted by the user
===========================================================================
=======================<phase: pkg-depends >============================
===> filament-1.32.1 depends on file: /usr/local/sbin/pkg - not found
===> Installing existing package /packages/All/pkg-1.19.1_1.pkg
[131powerpc64le-quarterly-job-18] Installing pkg-1.19.1_1...
[131powerpc64le-quarterly-job-18] Extracting pkg-1.19.1_1: .......... done
===> filament-1.32.1 depends on file: /usr/local/sbin/pkg - found
===> Returning to build of filament-1.32.1
===========================================================================
=======================<phase: fetch-depends >============================
===========================================================================
=======================<phase: fetch >============================
===> License APACHE20 accepted by the user
===> Fetching all distfiles required by filament-1.32.1 for building
===========================================================================
=======================<phase: checksum >============================
===> License APACHE20 accepted by the user
===> Fetching all distfiles required by filament-1.32.1 for building
=> SHA256 Checksum OK for google-filament-v1.32.1_GH0.tar.gz.
===========================================================================
=======================<phase: extract-depends>============================
===========================================================================
=======================<phase: extract >============================
===> License APACHE20 accepted by the user
===> Fetching all distfiles required by filament-1.32.1 for building
===> Extracting for filament-1.32.1
=> SHA256 Checksum OK for google-filament-v1.32.1_GH0.tar.gz.
===========================================================================
=======================<phase: patch-depends >============================
===========================================================================
=======================<phase: patch >============================
===> Patching for filament-1.32.1
===> Applying FreeBSD patches for filament-1.32.1 from /usr/ports/graphics/filament/files
===========================================================================
=======================<phase: build-depends >============================
===> filament-1.32.1 depends on executable: bash - not found
===> Installing existing package /packages/All/bash-5.2.15.pkg
[131powerpc64le-quarterly-job-18] Installing bash-5.2.15...
[131powerpc64le-quarterly-job-18] `-- Installing gettext-runtime-0.21.1...
[131powerpc64le-quarterly-job-18] | `-- Installing indexinfo-0.3.1...
[131powerpc64le-quarterly-job-18] | `-- Extracting indexinfo-0.3.1: .... done
[131powerpc64le-quarterly-job-18] `-- Extracting gettext-runtime-0.21.1: .......... done
[131powerpc64le-quarterly-job-18] `-- Installing readline-8.2.0...
[131powerpc64le-quarterly-job-18] `-- Extracting readline-8.2.0: .......... done
[131powerpc64le-quarterly-job-18] Extracting bash-5.2.15: .......... done
===> filament-1.32.1 depends on executable: bash - found
===> Returning to build of filament-1.32.1
<snip>
mov __blue_glCore_glColor4fNormal3fVertex3fSUN@GOTPCREL(%rip), %r11
^
/wrkdirs/usr/ports/graphics/filament/work/filament-1.32.1/libs/bluegl/src/BlueGLCoreLinuxImpl.S:15277:9: error: unknown operand
jmp *(%r11)
^
/wrkdirs/usr/ports/graphics/filament/work/filament-1.32.1/libs/bluegl/src/BlueGLCoreLinuxImpl.S:15282:62: error: invalid register name
mov __blue_glCore_glColor4fNormal3fVertex3fvSUN@GOTPCREL(%rip), %r11
^
/wrkdirs/usr/ports/graphics/filament/work/filament-1.32.1/libs/bluegl/src/BlueGLCoreLinuxImpl.S:15283:9: error: unknown operand
jmp *(%r11)
^
/wrkdirs/usr/ports/graphics/filament/work/filament-1.32.1/libs/bluegl/src/BlueGLCoreLinuxImpl.S:15288:56: error: invalid register name
mov __blue_glCore_glTexCoord2fVertex3fSUN@GOTPCREL(%rip), %r11
^
/wrkdirs/usr/ports/graphics/filament/work/filament-1.32.1/libs/bluegl/src/BlueGLCoreLinuxImpl.S:15289:9: error: unknown operand
jmp *(%r11)
^
/wrkdirs/usr/ports/graphics/filament/work/filament-1.32.1/libs/bluegl/src/BlueGLCoreLinuxImpl.S:15294:57: error: invalid register name
mov __blue_glCore_glTexCoord2fVertex3fvSUN@GOTPCREL(%rip), %r11
^
/wrkdirs/usr/ports/graphics/filament/work/filament-1.32.1/libs/bluegl/src/BlueGLCoreLinuxImpl.S:15295:9: error: unknown operand
jmp *(%r11)
^
/wrkdirs/usr/ports/graphics/filament/work/filament-1.32.1/libs/bluegl/src/BlueGLCoreLinuxImpl.S:15300:56: error: invalid register name
mov __blue_glCore_glTexCoord4fVertex4fSUN@GOTPCREL(%rip), %r11
^
/wrkdirs/usr/ports/graphics/filament/work/filament-1.32.1/libs/bluegl/src/BlueGLCoreLinuxImpl.S:15301:9: error: unknown operand
jmp *(%r11)
^
/wrkdirs/usr/ports/graphics/filament/work/filament-1.32.1/libs/bluegl/src/BlueGLCoreLinuxImpl.S:15306:57: error: invalid register name
mov __blue_glCore_glTexCoord4fVertex4fvSUN@GOTPCREL(%rip), %r11
^
/wrkdirs/usr/ports/graphics/filament/work/filament-1.32.1/libs/bluegl/src/BlueGLCoreLinuxImpl.S:15307:9: error: unknown operand
jmp *(%r11)
^
/wrkdirs/usr/ports/graphics/filament/work/filament-1.32.1/libs/bluegl/src/BlueGLCoreLinuxImpl.S:15312:64: error: invalid register name
mov __blue_glCore_glTexCoord2fColor4ubVertex3fSUN@GOTPCREL(%rip), %r11
^
/wrkdirs/usr/ports/graphics/filament/work/filament-1.32.1/libs/bluegl/src/BlueGLCoreLinuxImpl.S:15313:9: error: unknown operand
jmp *(%r11)
^
/wrkdirs/usr/ports/graphics/filament/work/filament-1.32.1/libs/bluegl/src/BlueGLCoreLinuxImpl.S:15318:65: error: invalid register name
mov __blue_glCore_glTexCoord2fColor4ubVertex3fvSUN@GOTPCREL(%rip), %r11
^
/wrkdirs/usr/ports/graphics/filament/work/filament-1.32.1/libs/bluegl/src/BlueGLCoreLinuxImpl.S:15319:9: error: unknown operand
jmp *(%r11)
^
/wrkdirs/usr/ports/graphics/filament/work/filament-1.32.1/libs/bluegl/src/BlueGLCoreLinuxImpl.S:15324:63: error: invalid register name
mov __blue_glCore_glTexCoord2fColor3fVertex3fSUN@GOTPCREL(%rip), %r11
^
/wrkdirs/usr/ports/graphics/filament/work/filament-1.32.1/libs/bluegl/src/BlueGLCoreLinuxImpl.S:15325:9: error: unknown operand
jmp *(%r11)
^
/wrkdirs/usr/ports/graphics/filament/work/filament-1.32.1/libs/bluegl/src/BlueGLCoreLinuxImpl.S:15330:64: error: invalid register name
mov __blue_glCore_glTexCoord2fColor3fVertex3fvSUN@GOTPCREL(%rip), %r11
^
/wrkdirs/usr/ports/graphics/filament/work/filament-1.32.1/libs/bluegl/src/BlueGLCoreLinuxImpl.S:15331:9: error: unknown operand
jmp *(%r11)
^
/wrkdirs/usr/ports/graphics/filament/work/filament-1.32.1/libs/bluegl/src/BlueGLCoreLinuxImpl.S:15336:64: error: invalid register name
mov __blue_glCore_glTexCoord2fNormal3fVertex3fSUN@GOTPCREL(%rip), %r11
^
/wrkdirs/usr/ports/graphics/filament/work/filament-1.32.1/libs/bluegl/src/BlueGLCoreLinuxImpl.S:15337:9: error: unknown operand
jmp *(%r11)
^
/wrkdirs/usr/ports/graphics/filament/work/filament-1.32.1/libs/bluegl/src/BlueGLCoreLinuxImpl.S:15342:65: error: invalid register name
mov __blue_glCore_glTexCoord2fNormal3fVertex3fvSUN@GOTPCREL(%rip), %r11
^
/wrkdirs/usr/ports/graphics/filament/work/filament-1.32.1/libs/bluegl/src/BlueGLCoreLinuxImpl.S:15343:9: error: unknown operand
jmp *(%r11)
^
/wrkdirs/usr/ports/graphics/filament/work/filament-1.32.1/libs/bluegl/src/BlueGLCoreLinuxImpl.S:15348:71: error: invalid register name
mov __blue_glCore_glTexCoord2fColor4fNormal3fVertex3fSUN@GOTPCREL(%rip), %r11
^
/wrkdirs/usr/ports/graphics/filament/work/filament-1.32.1/libs/bluegl/src/BlueGLCoreLinuxImpl.S:15349:9: error: unknown operand
jmp *(%r11)
^
/wrkdirs/usr/ports/graphics/filament/work/filament-1.32.1/libs/bluegl/src/BlueGLCoreLinuxImpl.S:15354:72: error: invalid register name
mov __blue_glCore_glTexCoord2fColor4fNormal3fVertex3fvSUN@GOTPCREL(%rip), %r11
^
/wrkdirs/usr/ports/graphics/filament/work/filament-1.32.1/libs/bluegl/src/BlueGLCoreLinuxImpl.S:15355:9: error: unknown operand
jmp *(%r11)
^
/wrkdirs/usr/ports/graphics/filament/work/filament-1.32.1/libs/bluegl/src/BlueGLCoreLinuxImpl.S:15360:71: error: invalid register name
mov __blue_glCore_glTexCoord4fColor4fNormal3fVertex4fSUN@GOTPCREL(%rip), %r11
^
/wrkdirs/usr/ports/graphics/filament/work/filament-1.32.1/libs/bluegl/src/BlueGLCoreLinuxImpl.S:15361:9: error: unknown operand
jmp *(%r11)
^
/wrkdirs/usr/ports/graphics/filament/work/filament-1.32.1/libs/bluegl/src/BlueGLCoreLinuxImpl.S:15366:72: error: invalid register name
mov __blue_glCore_glTexCoord4fColor4fNormal3fVertex4fvSUN@GOTPCREL(%rip), %r11
^
/wrkdirs/usr/ports/graphics/filament/work/filament-1.32.1/libs/bluegl/src/BlueGLCoreLinuxImpl.S:15367:9: error: unknown operand
jmp *(%r11)
^
/wrkdirs/usr/ports/graphics/filament/work/filament-1.32.1/libs/bluegl/src/BlueGLCoreLinuxImpl.S:15372:63: error: invalid register name
mov __blue_glCore_glReplacementCodeuiVertex3fSUN@GOTPCREL(%rip), %r11
^
/wrkdirs/usr/ports/graphics/filament/work/filament-1.32.1/libs/bluegl/src/BlueGLCoreLinuxImpl.S:15373:9: error: unknown operand
jmp *(%r11)
^
/wrkdirs/usr/ports/graphics/filament/work/filament-1.32.1/libs/bluegl/src/BlueGLCoreLinuxImpl.S:15378:64: error: invalid register name
mov __blue_glCore_glReplacementCodeuiVertex3fvSUN@GOTPCREL(%rip), %r11
^
/wrkdirs/usr/ports/graphics/filament/work/filament-1.32.1/libs/bluegl/src/BlueGLCoreLinuxImpl.S:15379:9: error: unknown operand
jmp *(%r11)
^
/wrkdirs/usr/ports/graphics/filament/work/filament-1.32.1/libs/bluegl/src/BlueGLCoreLinuxImpl.S:15384:71: error: invalid register name
mov __blue_glCore_glReplacementCodeuiColor4ubVertex3fSUN@GOTPCREL(%rip), %r11
^
/wrkdirs/usr/ports/graphics/filament/work/filament-1.32.1/libs/bluegl/src/BlueGLCoreLinuxImpl.S:15385:9: error: unknown operand
jmp *(%r11)
^
/wrkdirs/usr/ports/graphics/filament/work/filament-1.32.1/libs/bluegl/src/BlueGLCoreLinuxImpl.S:15390:72: error: invalid register name
mov __blue_glCore_glReplacementCodeuiColor4ubVertex3fvSUN@GOTPCREL(%rip), %r11
^
/wrkdirs/usr/ports/graphics/filament/work/filament-1.32.1/libs/bluegl/src/BlueGLCoreLinuxImpl.S:15391:9: error: unknown operand
jmp *(%r11)
^
/wrkdirs/usr/ports/graphics/filament/work/filament-1.32.1/libs/bluegl/src/BlueGLCoreLinuxImpl.S:15396:70: error: invalid register name
mov __blue_glCore_glReplacementCodeuiColor3fVertex3fSUN@GOTPCREL(%rip), %r11
^
/wrkdirs/usr/ports/graphics/filament/work/filament-1.32.1/libs/bluegl/src/BlueGLCoreLinuxImpl.S:15397:9: error: unknown operand
jmp *(%r11)
^
/wrkdirs/usr/ports/graphics/filament/work/filament-1.32.1/libs/bluegl/src/BlueGLCoreLinuxImpl.S:15402:71: error: invalid register name
mov __blue_glCore_glReplacementCodeuiColor3fVertex3fvSUN@GOTPCREL(%rip), %r11
^
/wrkdirs/usr/ports/graphics/filament/work/filament-1.32.1/libs/bluegl/src/BlueGLCoreLinuxImpl.S:15403:9: error: unknown operand
jmp *(%r11)
^
/wrkdirs/usr/ports/graphics/filament/work/filament-1.32.1/libs/bluegl/src/BlueGLCoreLinuxImpl.S:15408:71: error: invalid register name
mov __blue_glCore_glReplacementCodeuiNormal3fVertex3fSUN@GOTPCREL(%rip), %r11
^
/wrkdirs/usr/ports/graphics/filament/work/filament-1.32.1/libs/bluegl/src/BlueGLCoreLinuxImpl.S:15409:9: error: unknown operand
jmp *(%r11)
^
/wrkdirs/usr/ports/graphics/filament/work/filament-1.32.1/libs/bluegl/src/BlueGLCoreLinuxImpl.S:15414:72: error: invalid register name
mov __blue_glCore_glReplacementCodeuiNormal3fVertex3fvSUN@GOTPCREL(%rip), %r11
^
/wrkdirs/usr/ports/graphics/filament/work/filament-1.32.1/libs/bluegl/src/BlueGLCoreLinuxImpl.S:15415:9: error: unknown operand
jmp *(%r11)
^
/wrkdirs/usr/ports/graphics/filament/work/filament-1.32.1/libs/bluegl/src/BlueGLCoreLinuxImpl.S:15420:78: error: invalid register name
mov __blue_glCore_glReplacementCodeuiColor4fNormal3fVertex3fSUN@GOTPCREL(%rip), %r11
^
/wrkdirs/usr/ports/graphics/filament/work/filament-1.32.1/libs/bluegl/src/BlueGLCoreLinuxImpl.S:15421:9: error: unknown operand
jmp *(%r11)
^
/wrkdirs/usr/ports/graphics/filament/work/filament-1.32.1/libs/bluegl/src/BlueGLCoreLinuxImpl.S:15426:79: error: invalid register name
mov __blue_glCore_glReplacementCodeuiColor4fNormal3fVertex3fvSUN@GOTPCREL(%rip), %r11
^
/wrkdirs/usr/ports/graphics/filament/work/filament-1.32.1/libs/bluegl/src/BlueGLCoreLinuxImpl.S:15427:9: error: unknown operand
jmp *(%r11)
^
/wrkdirs/usr/ports/graphics/filament/work/filament-1.32.1/libs/bluegl/src/BlueGLCoreLinuxImpl.S:15432:73: error: invalid register name
mov __blue_glCore_glReplacementCodeuiTexCoord2fVertex3fSUN@GOTPCREL(%rip), %r11
^
/wrkdirs/usr/ports/graphics/filament/work/filament-1.32.1/libs/bluegl/src/BlueGLCoreLinuxImpl.S:15433:9: error: unknown operand
jmp *(%r11)
^
/wrkdirs/usr/ports/graphics/filament/work/filament-1.32.1/libs/bluegl/src/BlueGLCoreLinuxImpl.S:15438:74: error: invalid register name
mov __blue_glCore_glReplacementCodeuiTexCoord2fVertex3fvSUN@GOTPCREL(%rip), %r11
^
/wrkdirs/usr/ports/graphics/filament/work/filament-1.32.1/libs/bluegl/src/BlueGLCoreLinuxImpl.S:15439:9: error: unknown operand
jmp *(%r11)
^
/wrkdirs/usr/ports/graphics/filament/work/filament-1.32.1/libs/bluegl/src/BlueGLCoreLinuxImpl.S:15444:81: error: invalid register name
mov __blue_glCore_glReplacementCodeuiTexCoord2fNormal3fVertex3fSUN@GOTPCREL(%rip), %r11
^
/wrkdirs/usr/ports/graphics/filament/work/filament-1.32.1/libs/bluegl/src/BlueGLCoreLinuxImpl.S:15445:9: error: unknown operand
jmp *(%r11)
^
/wrkdirs/usr/ports/graphics/filament/work/filament-1.32.1/libs/bluegl/src/BlueGLCoreLinuxImpl.S:15450:82: error: invalid register name
mov __blue_glCore_glReplacementCodeuiTexCoord2fNormal3fVertex3fvSUN@GOTPCREL(%rip), %r11
^
/wrkdirs/usr/ports/graphics/filament/work/filament-1.32.1/libs/bluegl/src/BlueGLCoreLinuxImpl.S:15451:9: error: unknown operand
jmp *(%r11)
^
/wrkdirs/usr/ports/graphics/filament/work/filament-1.32.1/libs/bluegl/src/BlueGLCoreLinuxImpl.S:15456:88: error: invalid register name
mov __blue_glCore_glReplacementCodeuiTexCoord2fColor4fNormal3fVertex3fSUN@GOTPCREL(%rip), %r11
^
/wrkdirs/usr/ports/graphics/filament/work/filament-1.32.1/libs/bluegl/src/BlueGLCoreLinuxImpl.S:15457:9: error: unknown operand
jmp *(%r11)
^
/wrkdirs/usr/ports/graphics/filament/work/filament-1.32.1/libs/bluegl/src/BlueGLCoreLinuxImpl.S:15462:89: error: invalid register name
mov __blue_glCore_glReplacementCodeuiTexCoord2fColor4fNormal3fVertex3fvSUN@GOTPCREL(%rip), %r11
^
/wrkdirs/usr/ports/graphics/filament/work/filament-1.32.1/libs/bluegl/src/BlueGLCoreLinuxImpl.S:15463:9: error: unknown operand
jmp *(%r11)
^
[ 46% 585/1268] /usr/bin/c++ -DFILAMENT_DRIVER_SUPPORTS_VULKAN -DFILAMENT_SUPPORTS_OPENGL -DFILAMENT_SUPPORTS_X11 -DFILAMENT_SUPPORTS_XCB -DFILAMENT_SUPPORTS_XLIB -DSPIRV_CROSS_EXCEPTIONS_TO_ASSERTIONS -D__STDC_LIMIT_MACROS -I/wrkdirs/usr/ports/graphics/filament/work/filament-1.32.1/third_party/spirv-cross/tnt/.. -O2 -pipe -fstack-protector-strong -isystem /usr/local/include -fno-strict-aliasing -isystem /usr/local/include -std=c++17 -fstrict-aliasing -Wno-unknown-pragmas -Wno-unused-function -Wno-deprecated-declarations -fPIC -fcolor-diagnostics -fvisibility=hidden -O2 -pipe -fstack-protector-strong -isystem /usr/local/include -fno-strict-aliasing -isystem /usr/local/include -DNDEBUG -fomit-frame-pointer -ffunction-sections -fdata-sections -std=c++11 -Wall -Wextra -Werror -Wshadow -fno-exceptions -MD -MT third_party/spirv-cross/tnt/CMakeFiles/spirv-cross-msl.dir/__/spirv_msl.cpp.o -MF third_party/spirv-cross/tnt/CMakeFiles/spirv-cross-msl.dir/__/spirv_msl.cpp.o.d -o third_party/s
pirv-cross/tnt/CMakeFiles/spirv-cross-msl.dir/__/spirv_msl.cpp.o -c /wrkdirs/usr/ports/graphics/filament/work/filament-1.32.1/third_party/spirv-cross/spirv_msl.cpp
ninja: build stopped: subcommand failed.
===> Compilation failed unexpectedly.
Try to set MAKE_JOBS_UNSAFE=yes and rebuild before reporting the failure to
the maintainer.
*** Error code 1
Stop.
make: stopped in /usr/ports/graphics/filament