[package - main-amd64-default][devel/rubygem-aws-crt] Failed for rubygem-aws-crt-0.1.6 in stage

From: <pkg-fallout_at_FreeBSD.org>
Date: Wed, 12 Oct 2022 07:07:46 UTC
You are receiving this mail as a port that you maintain
is failing to build on the FreeBSD package build server.
Please investigate the failure and submit a PR to fix
build.

Maintainer:     sunpoet@FreeBSD.org
Log URL:        http://beefy18.nyi.freebsd.org/data/main-amd64-default/pd20a3cf7e848_s91a84eb5ba/logs/rubygem-aws-crt-0.1.6.log
Build URL:      http://beefy18.nyi.freebsd.org/build.html?mastername=main-amd64-default&build=pd20a3cf7e848_s91a84eb5ba
Log:

=>> Building devel/rubygem-aws-crt
build started at Wed Oct 12 07:06:32 UTC 2022
port directory: /usr/ports/devel/rubygem-aws-crt
package name: rubygem-aws-crt-0.1.6
building for: FreeBSD main-amd64-default-job-12 14.0-CURRENT FreeBSD 14.0-CURRENT 1400072 amd64
maintained by: sunpoet@FreeBSD.org
Makefile ident: 
Poudriere version: 3.2.8-21-g883afb07
Host OSVERSION: 1400063
Jail OSVERSION: 1400072
Job Id: 12




!!! Jail is newer than host. (Jail: 1400072, Host: 1400063) !!!
!!! This is not supported. !!!
!!! Host kernel must be same or newer than jail. !!!
!!! Expect build failures. !!!



---Begin Environment---
SHELL=/bin/sh
OSVERSION=1400072
UNAME_v=FreeBSD 14.0-CURRENT 1400072
UNAME_r=14.0-CURRENT
BLOCKSIZE=K
MAIL=/var/mail/root
MM_CHARSET=UTF-8
LANG=C.UTF-8
STATUS=1
HOME=/root
PATH=/sbin:/bin:/usr/sbin:/usr/bin:/usr/local/sbin:/usr/local/bin:/root/bin
LOCALBASE=/usr/local
USER=root
LIBEXECPREFIX=/usr/local/libexec/poudriere
POUDRIERE_VERSION=3.2.8-21-g883afb07
MASTERMNT=/usr/local/poudriere/data/.m/main-amd64-default/ref
POUDRIERE_BUILD_TYPE=bulk
PACKAGE_BUILDING=yes
SAVED_TERM=
PWD=/usr/local/poudriere/data/.m/main-amd64-default/ref/.p/pool
P_PORTS_FEATURES=FLAVORS SELECTED_OPTIONS
MASTERNAME=main-amd64-default
SCRIPTPREFIX=/usr/local/share/poudriere
OLDPWD=/usr/local/poudriere/data/.m/main-amd64-default/ref/.p
SCRIPTPATH=/usr/local/share/poudriere/bulk.sh
POUDRIEREPATH=/usr/local/bin/poudriere
---End Environment---

---Begin Poudriere Port Flags/Env---
PORT_FLAGS=
PKGENV=
FLAVOR=
DEPENDS_ARGS=
MAKE_ARGS=
---End Poudriere Port Flags/Env---

---Begin OPTIONS List---
---End OPTIONS List---

--MAINTAINER--
sunpoet@FreeBSD.org
--End MAINTAINER--

--CONFIGURE_ARGS--

--End CONFIGURE_ARGS--

--CONFIGURE_ENV--
PYTHON="/usr/local/bin/python3.9" XDG_DATA_HOME=/wrkdirs/usr/ports/devel/rubygem-aws-crt/work  XDG_CONFIG_HOME=/wrkdirs/usr/ports/devel/rubygem-aws-crt/work  XDG_CACHE_HOME=/wrkdirs/usr/ports/devel/rubygem-aws-crt/work/.cache  HOME=/wrkdirs/usr/ports/devel/rubygem-aws-crt/work TMPDIR="/tmp" PATH=/wrkdirs/usr/ports/devel/rubygem-aws-crt/work/.bin:/sbin:/bin:/usr/sbin:/usr/bin:/usr/local/sbin:/usr/local/bin:/root/bin PKG_CONFIG_LIBDIR=/wrkdirs/usr/ports/devel/rubygem-aws-crt/work/.pkgconfig:/usr/local/libdata/pkgconfig:/usr/local/share/pkgconfig:/usr/libdata/pkgconfig SHELL=/bin/sh CONFIG_SHELL=/bin/sh LANG=en_US.UTF-8 LC_ALL=en_US.UTF-8
--End CONFIGURE_ENV--

--MAKE_ENV--
XDG_DATA_HOME=/wrkdirs/usr/ports/devel/rubygem-aws-crt/work  XDG_CONFIG_HOME=/wrkdirs/usr/ports/devel/rubygem-aws-crt/work  XDG_CACHE_HOME=/wrkdirs/usr/ports/devel/rubygem-aws-crt/work/.cache  HOME=/wrkdirs/usr/ports/devel/rubygem-aws-crt/work TMPDIR="/tmp" PATH=/wrkdirs/usr/ports/devel/rubygem-aws-crt/work/.bin:/sbin:/bin:/usr/sbin:/usr/bin:/usr/local/sbin:/usr/local/bin:/root/bin PKG_CONFIG_LIBDIR=/wrkdirs/usr/ports/devel/rubygem-aws-crt/work/.pkgconfig:/usr/local/libdata/pkgconfig:/usr/local/share/pkgconfig:/usr/libdata/pkgconfig NO_PIE=yes MK_DEBUG_FILES=no MK_KERNEL_SYMBOLS=no SHELL=/bin/sh NO_LINT=YES LANG=en_US.UTF-8 LC_ALL=en_US.UTF-8 PREFIX=/usr/local  LOCALBASE=/usr/local  CC="cc" CFLAGS="-O2 -pipe  -fstack-protector-strong -fno-strict-aliasing "  CPP="cpp" CPPFLAGS=""  LDFLAGS=" -fstack-protector-strong " LIBS=""  CXX="c++" CXXFLAGS="-O2 -pipe -fstack-protector-strong -fno-strict-aliasing  "  MANPREFIX="/usr/local" BSD_INSTALL_PROGRAM="install  -s -m 555"  BSD_INSTALL_LIB=
 "install  -s -m 0644"  BSD_INSTALL_SCRIPT="install  -m 555"  BSD_INSTALL_DATA="install  -m 0644"  BSD_INSTALL_MAN="install  -m 444"
--End MAKE_ENV--

--PLIST_SUB--
RUBY_LIBDIR="lib/ruby/3.0" RUBY_ARCHLIBDIR="lib/ruby/3.0/amd64-freebsd14" RUBY_SITELIBDIR="lib/ruby/site_ruby/3.0" RUBY_SITEARCHLIBDIR="lib/ruby/site_ruby/3.0/amd64-freebsd14" RUBY_VENDORLIBDIR="lib/ruby/vendor_ruby/3.0" RUBY_VENDORARCHLIBDIR="lib/ruby/vendor_ruby/3.0/amd64-freebsd14" RUBY_MODDOCDIR="share/doc/ruby30/aws-crt" RUBY_MODEXAMPLESDIR="share/examples/ruby30/aws-crt" RUBY_DOCDIR="share/doc/ruby30" RUBY_EXAMPLESDIR="share/examples/ruby30" RUBY_RIDIR="share/ri/3.0/system" RUBY_SITERIDIR="share/ri/3.0/site"  RUBY_VERSION="3.0.4"  RUBY_VER="3.0"  RUBY_SHLIBVER="30"  RUBY_ARCH="amd64-freebsd14"  RUBY_SUFFIX="30"  RUBY_DEFAULT_SUFFIX="30" PORTVERSION="0.1.6"  REV=""  GEMS_BASE_DIR="lib/ruby/gems/3.0"  GEMS_DIR="lib/ruby/gems/3.0/gems"  DOC_DIR="lib/ruby/gems/3.0/doc"  CACHE_DIR="lib/ruby/gems/3.0/cache"  SPEC_DIR="lib/ruby/gems/3.0/specifications"  EXT_DIR="lib/ruby/gems/3.0/extensions"  PLUGINS_DIR="lib/ruby/gems/3.0/plugins"  GEM_NAME="aws-crt-0.1.6"  GEM_LIB_DIR="lib/ruby/gems
 /3.0/gems/aws-crt-0.1.6"  GEM_DOC_DIR="lib/ruby/gems/3.0/doc/aws-crt-0.1.6"  GEM_SPEC="lib/ruby/gems/3.0/specifications/aws-crt-0.1.6.gemspec"  GEM_CACHE="lib/ruby/gems/3.0/cache/aws-crt-0.1.6.gem"  EXTRACT_SUFX=".gem" PYTHON_INCLUDEDIR=include/python3.9  PYTHON_LIBDIR=lib/python3.9  PYTHON_PLATFORM=freebsd14  PYTHON_SITELIBDIR=lib/python3.9/site-packages  PYTHON_SUFFIX=39  PYTHON_EXT_SUFFIX=.cpython-39  PYTHON_VER=3.9  PYTHON_VERSION=python3.9 PYTHON2="@comment " PYTHON3="" OSREL=14.0 PREFIX=%D LOCALBASE=/usr/local  RESETPREFIX=/usr/local LIB32DIR=lib DOCSDIR="share/doc/aws-crt"  EXAMPLESDIR="share/examples/aws-crt"  DATADIR="share/aws-crt"  WWWDIR="www/aws-crt"  ETCDIR="etc/aws-crt"
--End PLIST_SUB--

--SUB_LIST--
PREFIX=/usr/local LOCALBASE=/usr/local  DATADIR=/usr/local/share/aws-crt DOCSDIR=/usr/local/share/doc/aws-crt EXAMPLESDIR=/usr/local/share/examples/aws-crt  WWWDIR=/usr/local/www/aws-crt ETCDIR=/usr/local/etc/aws-crt
--End SUB_LIST--

---Begin make.conf---
USE_PACKAGE_DEPENDS=yes
BATCH=yes
WRKDIRPREFIX=/wrkdirs
PORTSDIR=/usr/ports
PACKAGES=/packages
DISTDIR=/distfiles
PACKAGE_BUILDING=yes
PACKAGE_BUILDING_FLAVORS=yes
#### /usr/local/etc/poudriere.d/make.conf ####
# XXX: We really need this but cannot use it while 'make checksum' does not
# try the next mirror on checksum failure.  It currently retries the same
# failed mirror and then fails rather then trying another.  It *does*
# try the next if the size is mismatched though.
#MASTER_SITE_FREEBSD=yes
# Build ALLOW_MAKE_JOBS_PACKAGES with 2 jobs
MAKE_JOBS_NUMBER=2
#### /usr/ports/Mk/Scripts/ports_env.sh ####
_CCVERSION_921dbbb2=FreeBSD clang version 14.0.5 (https://github.com/llvm/llvm-project.git llvmorg-14.0.5-0-gc12386ae247c) Target: x86_64-unknown-freebsd14.0 Thread model: posix InstalledDir: /usr/bin
_ALTCCVERSION_921dbbb2=none
_CXXINTERNAL_acaad9ca=FreeBSD clang version 14.0.5 (https://github.com/llvm/llvm-project.git llvmorg-14.0.5-0-gc12386ae247c) Target: x86_64-unknown-freebsd14.0 Thread model: posix InstalledDir: /usr/bin "/usr/bin/ld" "--eh-frame-hdr" "-dynamic-linker" "/libexec/ld-elf.so.1" "--hash-style=both" "--enable-new-dtags" "-o" "a.out" "/usr/lib/crt1.o" "/usr/lib/crti.o" "/usr/lib/crtbegin.o" "-L/usr/lib" "/dev/null" "-lc++" "-lm" "-lgcc" "--as-needed" "-lgcc_s" "--no-as-needed" "-lc" "-lgcc" "--as-needed" "-lgcc_s" "--no-as-needed" "/usr/lib/crtend.o" "/usr/lib/crtn.o"
CC_OUTPUT_921dbbb2_58173849=yes
CC_OUTPUT_921dbbb2_9bdba57c=yes
CC_OUTPUT_921dbbb2_6a4fe7f5=yes
CC_OUTPUT_921dbbb2_6bcac02b=yes
CC_OUTPUT_921dbbb2_67d20829=yes
CC_OUTPUT_921dbbb2_bfa62e83=yes
CC_OUTPUT_921dbbb2_f0b4d593=yes
CC_OUTPUT_921dbbb2_308abb44=yes
CC_OUTPUT_921dbbb2_f00456e5=yes
CC_OUTPUT_921dbbb2_65ad290d=yes
CC_OUTPUT_921dbbb2_f2776b26=yes
CC_OUTPUT_921dbbb2_53255a77=yes
CC_OUTPUT_921dbbb2_911cfe02=yes
CC_OUTPUT_921dbbb2_b2657cc3=yes
CC_OUTPUT_921dbbb2_380987f7=yes
CC_OUTPUT_921dbbb2_160933ec=yes
CC_OUTPUT_921dbbb2_fb62803b=yes
CC_OUTPUT_921dbbb2_af59ad06=yes
CC_OUTPUT_921dbbb2_a15f3fcf=yes
_OBJC_CCVERSION_921dbbb2=FreeBSD clang version 14.0.5 (https://github.com/llvm/llvm-project.git llvmorg-14.0.5-0-gc12386ae247c) Target: x86_64-unknown-freebsd14.0 Thread model: posix InstalledDir: /usr/bin
_OBJC_ALTCCVERSION_921dbbb2=none
ARCH=amd64
OPSYS=FreeBSD
_OSRELEASE=14.0-CURRENT
OSREL=14.0
OSVERSION=1400072
PYTHONBASE=/usr/local
HAVE_COMPAT_IA32_KERN=YES
CONFIGURE_MAX_CMD_LEN=524288
HAVE_PORTS_ENV=1
#### Misc Poudriere ####
GID=0
UID=0
---End make.conf---
--Resource limits--
cpu time               (seconds, -t)  unlimited
file size           (512-blocks, -f)  unlimited
data seg size           (kbytes, -d)  33554432
stack size              (kbytes, -s)  524288
core file size      (512-blocks, -c)  unlimited
max memory size         (kbytes, -m)  unlimited
locked memory           (kbytes, -l)  unlimited
max user processes              (-u)  89999
open files                      (-n)  1024
virtual mem size        (kbytes, -v)  unlimited
swap limit              (kbytes, -w)  unlimited
socket buffer size       (bytes, -b)  unlimited
pseudo-terminals                (-p)  unlimited
kqueues                         (-k)  unlimited
umtx shared locks               (-o)  unlimited
--End resource limits--
=======================<phase: check-sanity   >============================
===>  License APACHE20 accepted by the user
===========================================================================
=======================<phase: pkg-depends    >============================
===>   rubygem-aws-crt-0.1.6 depends on file: /usr/local/sbin/pkg - not found
===>   Installing existing package /packages/All/pkg-1.18.4.pkg
[main-amd64-default-job-12] Installing pkg-1.18.4...
[main-amd64-default-job-12] Extracting pkg-1.18.4: .......... done
===>   rubygem-aws-crt-0.1.6 depends on file: /usr/local/sbin/pkg - found
===>   Returning to build of rubygem-aws-crt-0.1.6
===========================================================================
=======================<phase: fetch-depends  >============================
===========================================================================
=======================<phase: fetch          >============================
===>  License APACHE20 accepted by the user
===> Fetching all distfiles required by rubygem-aws-crt-0.1.6 for building
===========================================================================
=======================<phase: checksum       >============================
===>  License APACHE20 accepted by the user
===> Fetching all distfiles required by rubygem-aws-crt-0.1.6 for building
=> SHA256 Checksum OK for rubygem/aws-crt-0.1.6.gem.
===========================================================================
=======================<phase: extract-depends>============================
===>   rubygem-aws-crt-0.1.6 depends on file: /usr/local/bin/ruby30 - not found
===>   Installing existing package /packages/All/ruby-3.0.4_3,1.pkg
[main-amd64-default-job-12] Installing ruby-3.0.4_3,1...
[main-amd64-default-job-12] `-- Installing libedit-3.1.20210910,1...
[main-amd64-default-job-12] `-- Extracting libedit-3.1.20210910,1: .......... done
[main-amd64-default-job-12] `-- Installing libffi-3.4.3...
[main-amd64-default-job-12] |   `-- Installing indexinfo-0.3.1...
[main-amd64-default-job-12] |   `-- Extracting indexinfo-0.3.1: .... done
[main-amd64-default-job-12] `-- Extracting libffi-3.4.3: .......... done
[main-amd64-default-job-12] `-- Installing libunwind-20211201_1...
[main-amd64-default-job-12] `-- Extracting libunwind-20211201_1: .......... done
[main-amd64-default-job-12] `-- Installing libyaml-0.2.5...
[main-amd64-default-job-12] `-- Extracting libyaml-0.2.5: ......... done
[main-amd64-default-job-12] Extracting ruby-3.0.4_3,1: .......... done
=====
Message from ruby-3.0.4_3,1:

--
<snip>
[  1%] Building C object crt/aws-c-common/CMakeFiles/aws-c-common.dir/source/cache.c.o
[  0%] Building C object crt/aws-c-common/CMakeFiles/aws-c-common.dir/source/codegen.c.o
[  1%] Building C object crt/aws-c-common/CMakeFiles/aws-c-common.dir/source/command_line_parser.c.o
[  2%] Building C object crt/aws-c-common/CMakeFiles/aws-c-common.dir/source/common.c.o
[  2%] Building C object crt/aws-c-common/CMakeFiles/aws-c-common.dir/source/condition_variable.c.o
[  0%] Building C object crt/aws-c-common/CMakeFiles/aws-c-common.dir/source/date_time.c.o
[  2%] Building C object crt/aws-c-common/CMakeFiles/aws-c-common.dir/source/encoding.c.o
[  0%] Building C object crt/aws-c-common/CMakeFiles/aws-c-common.dir/source/error.c.o
[  1%] Building C object crt/aws-c-common/CMakeFiles/aws-c-common.dir/source/file.c.o
[  1%] Building C object crt/aws-c-common/CMakeFiles/aws-c-common.dir/source/hash_table.c.o
[  2%] Building C object crt/aws-c-common/CMakeFiles/aws-c-common.dir/source/json.c.o
[  3%] Building C object crt/aws-c-common/CMakeFiles/aws-c-common.dir/source/lifo_cache.c.o
[  0%] Building C object crt/aws-c-common/CMakeFiles/aws-c-common.dir/source/linked_hash_table.c.o
[  3%] Building C object crt/aws-c-common/CMakeFiles/aws-c-common.dir/source/log_channel.c.o
[  2%] Building C object crt/aws-c-common/CMakeFiles/aws-c-common.dir/source/log_writer.c.o
[  3%] Building C object crt/aws-c-common/CMakeFiles/aws-c-common.dir/source/logging.c.o
[  1%] Building C object crt/aws-c-common/CMakeFiles/aws-c-common.dir/source/lru_cache.c.o
[  2%] Building C object crt/aws-c-common/CMakeFiles/aws-c-common.dir/source/math.c.o
[  1%] Building C object crt/aws-c-common/CMakeFiles/aws-c-common.dir/source/memtrace.c.o
[  3%] Building C object crt/aws-c-common/CMakeFiles/aws-c-common.dir/source/posix/condition_variable.c.o
[  3%] Building C object crt/aws-c-common/CMakeFiles/aws-c-common.dir/source/posix/device_random.c.o
[  3%] Building C object crt/aws-c-common/CMakeFiles/aws-c-common.dir/source/posix/file.c.o
[  3%] Building C object crt/aws-c-common/CMakeFiles/aws-c-common.dir/source/posix/mutex.c.o
[  3%] Building C object crt/aws-c-common/CMakeFiles/aws-c-common.dir/source/posix/process.c.o
[  2%] Building C object crt/aws-c-common/CMakeFiles/aws-c-common.dir/source/posix/time.c.o
[  3%] Building C object crt/aws-c-common/CMakeFiles/aws-c-common.dir/source/promise.c.o
[  4%] Building C object crt/aws-c-common/CMakeFiles/aws-c-common.dir/source/external/cJSON.c.o
[  4%] Building C object crt/aws-c-common/CMakeFiles/aws-c-common.dir/source/device_random.c.o
[  4%] Building C object crt/aws-c-common/CMakeFiles/aws-c-common.dir/source/posix/thread.c.o
[  5%] Building C object crt/aws-c-common/CMakeFiles/aws-c-common.dir/source/posix/clock.c.o
[  5%] Building C object crt/aws-c-common/CMakeFiles/aws-c-common.dir/source/posix/system_info.c.o
[  6%] Building C object crt/aws-c-common/CMakeFiles/aws-c-common.dir/source/posix/rw_lock.c.o
[  6%] Building C object crt/aws-c-common/CMakeFiles/aws-c-common.dir/source/fifo_cache.c.o
[  6%] Building C object crt/aws-c-common/CMakeFiles/aws-c-common.dir/source/posix/environment.c.o
[  6%] Building C object crt/aws-c-common/CMakeFiles/aws-c-common.dir/source/priority_queue.c.o
[  7%] Building C object crt/aws-c-common/CMakeFiles/aws-c-common.dir/source/ref_count.c.o
[  7%] Building C object crt/aws-c-common/CMakeFiles/aws-c-common.dir/source/log_formatter.c.o
[  7%] Building C object crt/aws-c-common/CMakeFiles/aws-c-common.dir/source/ring_buffer.c.o
[  7%] Building C object crt/aws-c-common/CMakeFiles/aws-c-common.dir/source/process_common.c.o
Scanning dependencies of target fipsmodule
[  7%] Building C object crt/aws-lc/crypto/fipsmodule/CMakeFiles/fipsmodule.dir/bcm.c.o
[  7%] Building C object crt/aws-c-common/CMakeFiles/aws-c-common.dir/source/string.c.o
[  7%] Building C object crt/aws-c-common/CMakeFiles/aws-c-common.dir/source/task_scheduler.c.o
[  7%] Building C object crt/aws-c-common/CMakeFiles/aws-c-common.dir/source/statistics.c.o
[  7%] Building C object crt/aws-lc/crypto/fipsmodule/CMakeFiles/fipsmodule.dir/fips_shared_support.c.o
[  7%] Building ASM object crt/aws-lc/crypto/fipsmodule/CMakeFiles/fipsmodule.dir/aesni-gcm-x86_64.S.o
[  7%] Building C object crt/aws-c-common/CMakeFiles/aws-c-common.dir/source/xml_parser.c.o
[  8%] Building ASM object crt/aws-lc/crypto/fipsmodule/CMakeFiles/fipsmodule.dir/aesni-x86_64.S.o
[  8%] Building ASM object crt/aws-lc/crypto/fipsmodule/CMakeFiles/fipsmodule.dir/ghash-ssse3-x86_64.S.o
[  8%] Building C object crt/aws-c-common/CMakeFiles/aws-c-common.dir/source/thread_shared.c.o
[  8%] Building ASM object crt/aws-lc/crypto/fipsmodule/CMakeFiles/fipsmodule.dir/p256-x86_64-asm.S.o
[  9%] Building C object crt/aws-c-common/CMakeFiles/aws-c-common.dir/source/uuid.c.o
[  9%] Building ASM object crt/aws-lc/crypto/fipsmodule/CMakeFiles/fipsmodule.dir/p256_beeu-x86_64-asm.S.o
[  9%] Building C object crt/aws-c-common/CMakeFiles/aws-c-common.dir/source/arch/intel/encoding_avx2.c.o
[  9%] Building ASM object crt/aws-lc/crypto/fipsmodule/CMakeFiles/fipsmodule.dir/md5-x86_64.S.o
[  9%] Building C object crt/aws-c-common/CMakeFiles/aws-c-common.dir/source/thread_scheduler.c.o
[  9%] Building ASM object crt/aws-lc/crypto/fipsmodule/CMakeFiles/fipsmodule.dir/ghash-x86_64.S.o
[  9%] Building ASM object crt/aws-lc/crypto/fipsmodule/CMakeFiles/fipsmodule.dir/rdrand-x86_64.S.o
[ 10%] Building ASM object crt/aws-lc/crypto/fipsmodule/CMakeFiles/fipsmodule.dir/sha1-x86_64.S.o
[ 10%] Building ASM object crt/aws-lc/crypto/fipsmodule/CMakeFiles/fipsmodule.dir/rsaz-avx2.S.o
[ 10%] Building ASM object crt/aws-lc/crypto/fipsmodule/CMakeFiles/fipsmodule.dir/sha256-x86_64.S.o
[ 10%] Building ASM object crt/aws-lc/crypto/fipsmodule/CMakeFiles/fipsmodule.dir/sha512-x86_64.S.o
[ 10%] Building ASM object crt/aws-lc/crypto/fipsmodule/CMakeFiles/fipsmodule.dir/vpaes-x86_64.S.o
[ 10%] Building ASM object crt/aws-lc/crypto/fipsmodule/CMakeFiles/fipsmodule.dir/x86_64-mont.S.o
[ 10%] Building ASM object crt/aws-lc/crypto/fipsmodule/CMakeFiles/fipsmodule.dir/x86_64-mont5.S.o
[ 10%] Building ASM object crt/aws-lc/crypto/fipsmodule/CMakeFiles/fipsmodule.dir/__/__/third_party/s2n-bignum/x86_att/p384/bignum_add_p384.S.o
[ 11%] Building ASM object crt/aws-lc/crypto/fipsmodule/CMakeFiles/fipsmodule.dir/__/__/third_party/s2n-bignum/x86_att/p384/bignum_sub_p384.S.o
[ 11%] Building ASM object crt/aws-lc/crypto/fipsmodule/CMakeFiles/fipsmodule.dir/__/__/third_party/s2n-bignum/x86_att/p384/bignum_neg_p384.S.o
[ 11%] Building ASM object crt/aws-lc/crypto/fipsmodule/CMakeFiles/fipsmodule.dir/__/__/third_party/s2n-bignum/x86_att/p384/bignum_tomont_p384.S.o
[ 11%] Building ASM object crt/aws-lc/crypto/fipsmodule/CMakeFiles/fipsmodule.dir/__/__/third_party/s2n-bignum/x86_att/p384/bignum_deamont_p384.S.o
[ 11%] Building ASM object crt/aws-lc/crypto/fipsmodule/CMakeFiles/fipsmodule.dir/__/__/third_party/s2n-bignum/x86_att/p384/bignum_montmul_p384.S.o
[ 11%] Building ASM object crt/aws-lc/crypto/fipsmodule/CMakeFiles/fipsmodule.dir/__/__/third_party/s2n-bignum/x86_att/p384/bignum_montmul_p384_alt.S.o
[ 11%] Building ASM object crt/aws-lc/crypto/fipsmodule/CMakeFiles/fipsmodule.dir/__/__/third_party/s2n-bignum/x86_att/p384/bignum_montsqr_p384.S.o
[ 12%] Building ASM object crt/aws-lc/crypto/fipsmodule/CMakeFiles/fipsmodule.dir/__/__/third_party/s2n-bignum/x86_att/p384/bignum_montsqr_p384_alt.S.o
[ 12%] Building ASM object crt/aws-lc/crypto/fipsmodule/CMakeFiles/fipsmodule.dir/__/__/third_party/s2n-bignum/x86_att/p384/bignum_nonzero_6.S.o
[ 12%] Building ASM object crt/aws-lc/crypto/fipsmodule/CMakeFiles/fipsmodule.dir/__/__/third_party/s2n-bignum/x86_att/p384/bignum_littleendian_6.S.o
[ 12%] Building ASM object crt/aws-lc/crypto/fipsmodule/CMakeFiles/fipsmodule.dir/__/__/third_party/s2n-bignum/x86_att/p521/bignum_add_p521.S.o
[ 12%] Building ASM object crt/aws-lc/crypto/fipsmodule/CMakeFiles/fipsmodule.dir/__/__/third_party/s2n-bignum/x86_att/p521/bignum_neg_p521.S.o
[ 12%] Building ASM object crt/aws-lc/crypto/fipsmodule/CMakeFiles/fipsmodule.dir/__/__/third_party/s2n-bignum/x86_att/p521/bignum_sub_p521.S.o
[ 13%] Building ASM object crt/aws-lc/crypto/fipsmodule/CMakeFiles/fipsmodule.dir/__/__/third_party/s2n-bignum/x86_att/p521/bignum_mul_p521_alt.S.o
[ 13%] Building ASM object crt/aws-lc/crypto/fipsmodule/CMakeFiles/fipsmodule.dir/__/__/third_party/s2n-bignum/x86_att/p521/bignum_mul_p521.S.o
[ 13%] Building ASM object crt/aws-lc/crypto/fipsmodule/CMakeFiles/fipsmodule.dir/__/__/third_party/s2n-bignum/x86_att/p521/bignum_tolebytes_p521.S.o
[ 13%] Building ASM object crt/aws-lc/crypto/fipsmodule/CMakeFiles/fipsmodule.dir/__/__/third_party/s2n-bignum/x86_att/p521/bignum_sqr_p521.S.o
[ 13%] Building ASM object crt/aws-lc/crypto/fipsmodule/CMakeFiles/fipsmodule.dir/__/__/third_party/s2n-bignum/x86_att/p521/bignum_sqr_p521_alt.S.o
[ 13%] Building ASM object crt/aws-lc/crypto/fipsmodule/CMakeFiles/fipsmodule.dir/__/__/third_party/s2n-bignum/x86_att/p521/bignum_fromlebytes_p521.S.o
[ 13%] Building ASM object crt/aws-lc/crypto/fipsmodule/CMakeFiles/fipsmodule.dir/__/__/third_party/s2n-bignum/x86_att/p384/bignum_tomont_p384_alt.S.o
[ 13%] Building ASM object crt/aws-lc/crypto/fipsmodule/CMakeFiles/fipsmodule.dir/__/__/third_party/s2n-bignum/x86_att/p384/bignum_deamont_p384_alt.S.o
[ 13%] Linking C static library libaws-c-common.a
[ 13%] Built target aws-c-common
[ 13%] Building C object crt/aws-checksums/CMakeFiles/aws-checksums.dir/source/crc.c.o
[ 13%] Building C object crt/aws-c-sdkutils/CMakeFiles/aws-c-sdkutils.dir/source/aws_profile.c.o
[ 13%] Building C object crt/aws-c-compression/CMakeFiles/aws-c-compression.dir/source/huffman.c.o
[ 13%] Building C object crt/aws-c-sdkutils/CMakeFiles/aws-c-sdkutils.dir/source/sdkutils.c.o
[ 13%] Building C object crt/aws-c-compression/CMakeFiles/aws-c-compression.dir/source/huffman_testing.c.o
[ 13%] Building C object crt/aws-c-sdkutils/CMakeFiles/aws-c-sdkutils.dir/source/resource_name.c.o
[ 13%] Building C object crt/aws-c-compression/CMakeFiles/aws-c-compression.dir/source/compression.c.o
[ 13%] Building C object crt/aws-checksums/CMakeFiles/aws-checksums.dir/source/crc_sw.c.o
[ 13%] Building C object crt/aws-checksums/CMakeFiles/aws-checksums.dir/source/intel/asm/crc32c_sse42_asm.c.o
Assertion failed: (i == DstIdx || !MI->getOperand(i).isReg() || MI->getOperand(i).getReg() != RegA), function processTiedPairs, file /usr/local/poudriere/jails/main-amd64/usr/src/contrib/llvm-project/llvm/lib/CodeGen/TwoAddressInstructionPass.cpp, line 1494.
PLEASE submit a bug report to https://bugs.freebsd.org/submit/ and include the crash backtrace, preprocessed source, and associated run script.
Stack dump:
0.	Program arguments: /usr/bin/cc -DHAVE_SYSCONF -I/wrkdirs/usr/ports/devel/rubygem-aws-crt/work/stage/usr/local/lib/ruby/gems/3.0/gems/aws-crt-0.1.6/aws-crt-ffi/crt/aws-checksums/include -I/wrkdirs/usr/ports/devel/rubygem-aws-crt/work/stage/usr/local/lib/ruby/gems/3.0/gems/aws-crt-0.1.6/aws-crt-ffi/crt/aws-c-common/include -I/wrkdirs/usr/ports/devel/rubygem-aws-crt/work/stage/usr/local/lib/ruby/gems/3.0/gems/aws-crt-0.1.6/tmp/amd64/build/crt/aws-c-common/generated/include -O2 -g -DNDEBUG -Wall -Wstrict-prototypes -fno-omit-frame-pointer -Wextra -pedantic -Wno-long-long -fPIC -Wgnu -Wno-gnu-zero-variadic-macro-arguments -std=gnu99 -MD -MT crt/aws-checksums/CMakeFiles/aws-checksums.dir/source/intel/asm/crc32c_sse42_asm.c.o -MF CMakeFiles/aws-checksums.dir/source/intel/asm/crc32c_sse42_asm.c.o.d -o CMakeFiles/aws-checksums.dir/source/intel/asm/crc32c_sse42_asm.c.o -c /wrkdirs/usr/ports/devel/rubygem-aws-crt/work/stage/usr/local/lib/ruby/gems/3.0/gems/aws-crt-0.1.6/aws-crt-ffi/crt/aws-c
 hecksums/source/intel/asm/crc32c_sse42_asm.c
1.	<eof> parser at end of file
2.	Code generation
3.	Running pass 'Function Pass Manager' on module '/wrkdirs/usr/ports/devel/rubygem-aws-crt/work/stage/usr/local/lib/ruby/gems/3.0/gems/aws-crt-0.1.6/aws-crt-ffi/crt/aws-checksums/source/intel/asm/crc32c_sse42_asm.c'.
4.	Running pass 'Two-Address instruction pass' on function '@aws_checksums_crc32c_hw'
 #0 0x00000000050cbf71 (/usr/bin/cc+0x50cbf71)
 #1 0x00000000050ca2a5 (/usr/bin/cc+0x50ca2a5)
 #2 0x00000000050724ce (/usr/bin/cc+0x50724ce)
 #3 0x0000000005072693 (/usr/bin/cc+0x5072693)
 #4 0x0000000828c88bd0 (/lib/libthr.so.3+0x19bd0)
 #5 0x0000000828c8818f (/lib/libthr.so.3+0x1918f)
 #6 0x00007ffffffff8a3 ([vdso]+0x2d3)
 #7 0x000000082af96d4a __sys_thr_kill (/lib/libc.so.7+0x13dd4a)
 #8 0x000000082af0fac4 __raise (/lib/libc.so.7+0xb6ac4)
 #9 0x000000082afc0bb9 abort (/lib/libc.so.7+0x167bb9)
#10 0x000000082aef28a1 (/lib/libc.so.7+0x998a1)
#11 0x0000000004b9fb34 (/usr/bin/cc+0x4b9fb34)
#12 0x00000000048ca1de (/usr/bin/cc+0x48ca1de)
#13 0x0000000004d3548f (/usr/bin/cc+0x4d3548f)
#14 0x0000000004d3bba1 (/usr/bin/cc+0x4d3bba1)
#15 0x0000000004d35aab (/usr/bin/cc+0x4d35aab)
#16 0x0000000002cd0fa4 (/usr/bin/cc+0x2cd0fa4)
#17 0x0000000002fbfc13 (/usr/bin/cc+0x2fbfc13)
#18 0x00000000034f5214 (/usr/bin/cc+0x34f5214)
#19 0x0000000002efc0af (/usr/bin/cc+0x2efc0af)
#20 0x0000000002e906ef (/usr/bin/cc+0x2e906ef)
#21 0x0000000002fb9156 (/usr/bin/cc+0x2fb9156)
#22 0x000000000248a235 (/usr/bin/cc+0x248a235)
#23 0x0000000002497785 (/usr/bin/cc+0x2497785)
#24 0x0000000002d4c857 (/usr/bin/cc+0x2d4c857)
#25 0x0000000005072404 (/usr/bin/cc+0x5072404)
#26 0x0000000002d4c463 (/usr/bin/cc+0x2d4c463)
#27 0x0000000002d1a882 (/usr/bin/cc+0x2d1a882)
#28 0x0000000002d1ad29 (/usr/bin/cc+0x2d1ad29)
#29 0x0000000002d2fa4c (/usr/bin/cc+0x2d2fa4c)
cc: error: clang frontend command failed with exit code 134 (use -v to see invocation)
FreeBSD clang version 14.0.5 (https://github.com/llvm/llvm-project.git llvmorg-14.0.5-0-gc12386ae247c)
Target: x86_64-unknown-freebsd14.0
Thread model: posix
InstalledDir: /usr/bin
[ 14%] Linking C static library libaws-c-compression.a
cc: note: diagnostic msg: 
********************

PLEASE ATTACH THE FOLLOWING FILES TO THE BUG REPORT:
Preprocessed source(s) and associated run script(s) are located at:
cc: note: diagnostic msg: /tmp/crc32c_sse42_asm-6680a4.c
cc: note: diagnostic msg: /tmp/crc32c_sse42_asm-6680a4.sh
cc: note: diagnostic msg: 

********************
--- crt/aws-checksums/CMakeFiles/aws-checksums.dir/source/intel/asm/crc32c_sse42_asm.c.o ---
*** [crt/aws-checksums/CMakeFiles/aws-checksums.dir/source/intel/asm/crc32c_sse42_asm.c.o] Error code 134

make[3]: stopped in /wrkdirs/usr/ports/devel/rubygem-aws-crt/work/stage/usr/local/lib/ruby/gems/3.0/gems/aws-crt-0.1.6/tmp/amd64/build
--- crt/aws-c-compression/CMakeFiles/aws-c-compression.dir/all ---
*** [crt/aws-c-compression/CMakeFiles/aws-c-compression.dir/all] Error code 6

make[2]: stopped in /wrkdirs/usr/ports/devel/rubygem-aws-crt/work/stage/usr/local/lib/ruby/gems/3.0/gems/aws-crt-0.1.6/tmp/amd64/build
1 error

make[3]: stopped in /wrkdirs/usr/ports/devel/rubygem-aws-crt/work/stage/usr/local/lib/ruby/gems/3.0/gems/aws-crt-0.1.6/tmp/amd64/build
--- crt/aws-checksums/CMakeFiles/aws-checksums.dir/all ---
*** [crt/aws-checksums/CMakeFiles/aws-checksums.dir/all] Error code 2

make[2]: stopped in /wrkdirs/usr/ports/devel/rubygem-aws-crt/work/stage/usr/local/lib/ruby/gems/3.0/gems/aws-crt-0.1.6/tmp/amd64/build
--- crt/aws-c-sdkutils/CMakeFiles/aws-c-sdkutils.dir/all ---
*** [crt/aws-c-sdkutils/CMakeFiles/aws-c-sdkutils.dir/all] Error code 6

make[2]: stopped in /wrkdirs/usr/ports/devel/rubygem-aws-crt/work/stage/usr/local/lib/ruby/gems/3.0/gems/aws-crt-0.1.6/tmp/amd64/build
--- crt/aws-lc/crypto/fipsmodule/CMakeFiles/fipsmodule.dir/all ---
*** [crt/aws-lc/crypto/fipsmodule/CMakeFiles/fipsmodule.dir/all] Error code 6

make[2]: stopped in /wrkdirs/usr/ports/devel/rubygem-aws-crt/work/stage/usr/local/lib/ruby/gems/3.0/gems/aws-crt-0.1.6/tmp/amd64/build
4 errors

make[2]: stopped in /wrkdirs/usr/ports/devel/rubygem-aws-crt/work/stage/usr/local/lib/ruby/gems/3.0/gems/aws-crt-0.1.6/tmp/amd64/build
*** [all] Error code 2

make[1]: stopped in /wrkdirs/usr/ports/devel/rubygem-aws-crt/work/stage/usr/local/lib/ruby/gems/3.0/gems/aws-crt-0.1.6/tmp/amd64/build
1 error

make[1]: stopped in /wrkdirs/usr/ports/devel/rubygem-aws-crt/work/stage/usr/local/lib/ruby/gems/3.0/gems/aws-crt-0.1.6/tmp/amd64/build
/wrkdirs/usr/ports/devel/rubygem-aws-crt/work/stage/usr/local/lib/ruby/gems/3.0/gems/aws-crt-0.1.6/ext/compile.rb:31:in `run_cmd': Error running: cmake --build /wrkdirs/usr/ports/devel/rubygem-aws-crt/work/stage/usr/local/lib/ruby/gems/3.0/gems/aws-crt-0.1.6/tmp/amd64/build --target install --config RelWithDebInfo --parallel 48 (RuntimeError)
	from /wrkdirs/usr/ports/devel/rubygem-aws-crt/work/stage/usr/local/lib/ruby/gems/3.0/gems/aws-crt-0.1.6/ext/compile.rb:86:in `compile_bin'
	from extconf.rb:14:in `<main>'

To see why this extension failed to compile, please check the mkmf.log which can be found here:

  /wrkdirs/usr/ports/devel/rubygem-aws-crt/work/stage/usr/local/lib/ruby/gems/3.0/extensions/amd64-freebsd-14/3.0/aws-crt-0.1.6/mkmf.log

extconf failed, exit code 1

Gem files will remain installed in /wrkdirs/usr/ports/devel/rubygem-aws-crt/work/stage/usr/local/lib/ruby/gems/3.0/gems/aws-crt-0.1.6 for inspection.
Results logged to /wrkdirs/usr/ports/devel/rubygem-aws-crt/work/stage/usr/local/lib/ruby/gems/3.0/extensions/amd64-freebsd-14/3.0/aws-crt-0.1.6/gem_make.out
*** Error code 1

Stop.
make: stopped in /usr/ports/devel/rubygem-aws-crt