[package - 130arm64-default][databases/foundationdb-devel] Failed for foundationdb-devel-7.0.0 in build

From: <pkg-fallout_at_FreeBSD.org>
Date: Sun, 16 Jan 2022 14:30:33 GMT
You are receiving this mail as a port that you maintain
is failing to build on the FreeBSD package build server.
Please investigate the failure and submit a PR to fix
build.

Maintainer:     dch_at_FreeBSD.org
Log URL:        http://ampere1.nyi.freebsd.org/data/130arm64-default/a11d0355153c/logs/foundationdb-devel-7.0.0.log
Build URL:      http://ampere1.nyi.freebsd.org/build.html?mastername=130arm64-default&build=a11d0355153c
Log:

=>> Building databases/foundationdb-devel
build started at Sun Jan 16 14:29:38 UTC 2022
port directory: /usr/ports/databases/foundationdb-devel
package name: foundationdb-devel-7.0.0
building for: FreeBSD 130arm64-default-job-06 13.0-RELEASE-p5 FreeBSD 13.0-RELEASE-p5 arm64
maintained by: dch_at_FreeBSD.org
Makefile ident: 
Poudriere version: 3.2.8-21-g883afb07
Host OSVERSION: 1400008
Jail OSVERSION: 1300139
Job Id: 06

---Begin Environment---
SHELL=/bin/csh
OSVERSION=1300139
UNAME_v=FreeBSD 13.0-RELEASE-p5
UNAME_r=13.0-RELEASE-p5
BLOCKSIZE=K
MAIL=/var/mail/root
MM_CHARSET=UTF-8
LANG=C.UTF-8
STATUS=1
HOME=/root
PATH=/sbin:/bin:/usr/sbin:/usr/bin:/usr/local/sbin:/usr/local/bin:/root/bin
LOCALBASE=/usr/local
USER=root
LIBEXECPREFIX=/usr/local/libexec/poudriere
POUDRIERE_VERSION=3.2.8-21-g883afb07
MASTERMNT=/usr/local/poudriere/data/.m/130arm64-default/ref
POUDRIERE_BUILD_TYPE=bulk
PACKAGE_BUILDING=yes
SAVED_TERM=
PWD=/usr/local/poudriere/data/.m/130arm64-default/ref/.p/pool
P_PORTS_FEATURES=FLAVORS SELECTED_OPTIONS
MASTERNAME=130arm64-default
SCRIPTPREFIX=/usr/local/share/poudriere
OLDPWD=/usr/local/poudriere/data/.m/130arm64-default/ref/.p
SCRIPTPATH=/usr/local/share/poudriere/bulk.sh
POUDRIEREPATH=/usr/local/bin/poudriere
---End Environment---

---Begin Poudriere Port Flags/Env---
PORT_FLAGS=
PKGENV=
FLAVOR=
DEPENDS_ARGS=
MAKE_ARGS=
---End Poudriere Port Flags/Env---

---Begin OPTIONS List---
---End OPTIONS List---

--MAINTAINER--
dch_at_FreeBSD.org
--End MAINTAINER--

--CONFIGURE_ARGS--

--End CONFIGURE_ARGS--

--CONFIGURE_ENV--
MONO_SHARED_DIR="/wrkdirs/usr/ports/databases/foundationdb-devel/work" PYTHON="/usr/local/bin/python3.8" XDG_DATA_HOME=/wrkdirs/usr/ports/databases/foundationdb-devel/work  XDG_CONFIG_HOME=/wrkdirs/usr/ports/databases/foundationdb-devel/work  XDG_CACHE_HOME=/wrkdirs/usr/ports/databases/foundationdb-devel/work/.cache  HOME=/wrkdirs/usr/ports/databases/foundationdb-devel/work TMPDIR="/tmp" PATH=/wrkdirs/usr/ports/databases/foundationdb-devel/work/.bin:/sbin:/bin:/usr/sbin:/usr/bin:/usr/local/sbin:/usr/local/bin:/root/bin SHELL=/bin/sh CONFIG_SHELL=/bin/sh
--End CONFIGURE_ENV--

--MAKE_ENV--
MONO_REGISTRY_PATH=/tmp/registry NINJA_STATUS="[%p %s/%t] " MONO_SHARED_DIR="/wrkdirs/usr/ports/databases/foundationdb-devel/work" TZ=UTC OPENSSLBASE=/usr OPENSSLDIR=/etc/ssl OPENSSLINC=/usr/include OPENSSLLIB=/usr/lib XDG_DATA_HOME=/wrkdirs/usr/ports/databases/foundationdb-devel/work  XDG_CONFIG_HOME=/wrkdirs/usr/ports/databases/foundationdb-devel/work  XDG_CACHE_HOME=/wrkdirs/usr/ports/databases/foundationdb-devel/work/.cache  HOME=/wrkdirs/usr/ports/databases/foundationdb-devel/work TMPDIR="/tmp" PATH=/wrkdirs/usr/ports/databases/foundationdb-devel/work/.bin:/sbin:/bin:/usr/sbin:/usr/bin:/usr/local/sbin:/usr/local/bin:/root/bin NO_PIE=yes MK_DEBUG_FILES=no MK_KERNEL_SYMBOLS=no SHELL=/bin/sh NO_LINT=YES DESTDIR=/wrkdirs/usr/ports/databases/foundationdb-devel/work/stage PREFIX=/usr/local  LOCALBASE=/usr/local  CC="cc" CFLAGS="-O2 -pipe  -fstack-protector-strong -fno-strict-aliasing "  CPP="cpp" CPPFLAGS=""  LDFLAGS="  -fstack-protector-strong " LIBS=""  CXX="c++" CXXFLAGS="-O2 -pipe
  -fstack-protector-strong -fno-strict-aliasing  "  MANPREFIX="/usr/local" BSD_INSTALL_PROGRAM="install  -s -m 555"  BSD_INSTALL_LIB="install  -s -m 0644"  BSD_INSTALL_SCRIPT="install  -m 555"  BSD_INSTALL_DATA="install  -m 0644"  BSD_INSTALL_MAN="install  -m 444"
--End MAKE_ENV--

--PLIST_SUB--
DB_USER=foundationdb DB_GROUP=foundationdb DB_DIR=/var/db/foundationdb  LOG_DIR=/var/log/foundationdb CMAKE_BUILD_TYPE="release" PYTHON_INCLUDEDIR=include/python3.8  PYTHON_LIBDIR=lib/python3.8  PYTHON_PLATFORM=freebsd13  PYTHON_SITELIBDIR=lib/python3.8/site-packages  PYTHON_SUFFIX=38  PYTHON_EXT_SUFFIX=.cpython-38  PYTHON_VER=3.8  PYTHON_VERSION=python3.8 PYTHON2="_at_comment " PYTHON3="" OSREL=13.0 PREFIX=%D LOCALBASE=/usr/local  RESETPREFIX=/usr/local LIB32DIR=lib DOCSDIR="share/doc/foundationdb-devel"  EXAMPLESDIR="share/examples/foundationdb-devel"  DATADIR="share/foundationdb-devel"  WWWDIR="www/foundationdb-devel"  ETCDIR="etc/foundationdb-devel"
--End PLIST_SUB--

--SUB_LIST--
DB_USER=foundationdb DB_GROUP=foundationdb DB_DIR=/var/db/foundationdb  LOG_DIR=/var/log/foundationdb PREFIX=/usr/local LOCALBASE=/usr/local  DATADIR=/usr/local/share/foundationdb-devel DOCSDIR=/usr/local/share/doc/foundationdb-devel EXAMPLESDIR=/usr/local/share/examples/foundationdb-devel  WWWDIR=/usr/local/www/foundationdb-devel ETCDIR=/usr/local/etc/foundationdb-devel
--End SUB_LIST--

---Begin make.conf---
USE_PACKAGE_DEPENDS=yes
BATCH=yes
WRKDIRPREFIX=/wrkdirs
PORTSDIR=/usr/ports
PACKAGES=/packages
DISTDIR=/distfiles
PACKAGE_BUILDING=yes
PACKAGE_BUILDING_FLAVORS=yes
#### /usr/local/etc/poudriere.d/make.conf ####
# XXX: We really need this but cannot use it while 'make checksum' does not
# try the next mirror on checksum failure.  It currently retries the same
# failed mirror and then fails rather then trying another.  It *does*
# try the next if the size is mismatched though.
#MASTER_SITE_FREEBSD=yes
# Build ALLOW_MAKE_JOBS_PACKAGES with 2 jobs
MAKE_JOBS_NUMBER=2
#### /usr/ports/Mk/Scripts/ports_env.sh ####
_CCVERSION_921dbbb2=FreeBSD clang version 11.0.1 (git_at_github.com:llvm/llvm-project.git llvmorg-11.0.1-0-g43ff75f2c3fe) Target: aarch64-unknown-freebsd13.0 Thread model: posix InstalledDir: /usr/bin
_ALTCCVERSION_921dbbb2=none
_CXXINTERNAL_acaad9ca=FreeBSD clang version 11.0.1 (git_at_github.com:llvm/llvm-project.git llvmorg-11.0.1-0-g43ff75f2c3fe) Target: aarch64-unknown-freebsd13.0 Thread model: posix InstalledDir: /usr/bin "/usr/bin/ld" "--eh-frame-hdr" "-dynamic-linker" "/libexec/ld-elf.so.1" "--enable-new-dtags" "-o" "a.out" "/usr/lib/crt1.o" "/usr/lib/crti.o" "/usr/lib/crtbegin.o" "-L/usr/lib" "/dev/null" "-lc++" "-lm" "-lgcc" "--as-needed" "-lgcc_s" "--no-as-needed" "-lc" "-lgcc" "--as-needed" "-lgcc_s" "--no-as-needed" "/usr/lib/crtend.o" "/usr/lib/crtn.o"
CC_OUTPUT_921dbbb2_58173849=yes
CC_OUTPUT_921dbbb2_9bdba57c=yes
CC_OUTPUT_921dbbb2_6a4fe7f5=yes
CC_OUTPUT_921dbbb2_6bcac02b=yes
CC_OUTPUT_921dbbb2_67d20829=yes
CC_OUTPUT_921dbbb2_bfa62e83=yes
CC_OUTPUT_921dbbb2_f0b4d593=yes
CC_OUTPUT_921dbbb2_308abb44=yes
CC_OUTPUT_921dbbb2_f00456e5=yes
CC_OUTPUT_921dbbb2_65ad290d=yes
CC_OUTPUT_921dbbb2_f2776b26=yes
CC_OUTPUT_921dbbb2_b2657cc3=yes
CC_OUTPUT_921dbbb2_380987f7=yes
CC_OUTPUT_921dbbb2_160933ec=yes
CC_OUTPUT_921dbbb2_fb62803b=yes
_OBJC_CCVERSION_921dbbb2=FreeBSD clang version 11.0.1 (git_at_github.com:llvm/llvm-project.git llvmorg-11.0.1-0-g43ff75f2c3fe) Target: aarch64-unknown-freebsd13.0 Thread model: posix InstalledDir: /usr/bin
_OBJC_ALTCCVERSION_921dbbb2=none
ARCH=aarch64
OPSYS=FreeBSD
_OSRELEASE=13.0-RELEASE-p5
OSREL=13.0
OSVERSION=1300139
PYTHONBASE=/usr/local
CONFIGURE_MAX_CMD_LEN=524288
HAVE_PORTS_ENV=1
#### Misc Poudriere ####
GID=0
UID=0
---End make.conf---
--Resource limits--
cpu time               (seconds, -t)  unlimited
file size           (512-blocks, -f)  unlimited
data seg size           (kbytes, -d)  1048576
stack size              (kbytes, -s)  1048576
core file size      (512-blocks, -c)  unlimited
max memory size         (kbytes, -m)  unlimited
locked memory           (kbytes, -l)  unlimited
max user processes              (-u)  89999
open files                      (-n)  1024
virtual mem size        (kbytes, -v)  unlimited
swap limit              (kbytes, -w)  unlimited
socket buffer size       (bytes, -b)  unlimited
pseudo-terminals                (-p)  unlimited
kqueues                         (-k)  unlimited
umtx shared locks               (-o)  unlimited
--End resource limits--
=======================<phase: check-sanity   >============================
===>  License APACHE20 accepted by the user
===========================================================================
=======================<phase: pkg-depends    >============================
===>   foundationdb-devel-7.0.0 depends on file: /usr/local/sbin/pkg - not found
===>   Installing existing package /packages/All/pkg-1.17.5.pkg
[130arm64-default-job-06] Installing pkg-1.17.5...
[130arm64-default-job-06] Extracting pkg-1.17.5: .......... done
===>   foundationdb-devel-7.0.0 depends on file: /usr/local/sbin/pkg - found
===>   Returning to build of foundationdb-devel-7.0.0
===========================================================================
=======================<phase: fetch-depends  >============================
===========================================================================
=======================<phase: fetch          >============================
===>  License APACHE20 accepted by the user
===> Fetching all distfiles required by foundationdb-devel-7.0.0 for building
===========================================================================
=======================<phase: checksum       >============================
===>  License APACHE20 accepted by the user
===> Fetching all distfiles required by foundationdb-devel-7.0.0 for building
=> SHA256 Checksum OK for apple-foundationdb-7.0.0_GH0.tar.gz.
===========================================================================
=======================<phase: extract-depends>============================
===========================================================================
=======================<phase: extract        >============================
===>  License APACHE20 accepted by the user
===> Fetching all distfiles required by foundationdb-devel-7.0.0 for building
===>  Extracting for foundationdb-devel-7.0.0
=> SHA256 Checksum OK for apple-foundationdb-7.0.0_GH0.tar.gz.
===========================================================================
=======================<phase: patch-depends  >============================
===========================================================================
=======================<phase: patch          >============================
===>  Patching for foundationdb-devel-7.0.0
===>  Applying FreeBSD patches for foundationdb-devel-7.0.0 from /usr/ports/databases/foundationdb-devel/files
/usr/bin/sed -i.bak 's/OPENSSL_USE_STATIC_LIBS TRUE/OPENSSL_USE_STATIC_LIBS FALSE/'  /wrkdirs/usr/ports/databases/foundationdb-devel/work/foundationdb-7.0.0/cmake/FDBComponents.cmake
===========================================================================
=======================<phase: build-depends  >============================
===>   foundationdb-devel-7.0.0 depends on file: /usr/local/include/doctest/doctest.h - not found
===>   Installing existing package /packages/All/doctest-2.4.7.pkg
[130arm64-default-job-06] Installing doctest-2.4.7...
[130arm64-default-job-06] Extracting doctest-2.4.7: ......... done
===>   foundationdb-devel-7.0.0 depends on file: /usr/local/include/doctest/doctest.h - found
===>   Returning to build of foundationdb-devel-7.0.0
===>   foundationdb-devel-7.0.0 depends on file: /usr/local/include/toml.hpp - not found
===>   Installing existing package /packages/All/toml11-3.7.0.pkg
[130arm64-default-job-06] Installing toml11-3.7.0...
[130arm64-default-job-06] Extracting toml11-3.7.0: .......... done
===>   foundationdb-devel-7.0.0 depends on file: /usr/local/include/toml.hpp - found
===>   Returning to build of foundationdb-devel-7.0.0
===>   foundationdb-devel-7.0.0 depends on executable: bash - not found
===>   Installing existing package /packages/All/bash-5.1.16.pkg
[130arm64-default-job-06] Installing bash-5.1.16...
[130arm64-default-job-06] `-- Installing gettext-runtime-0.21...
[130arm64-default-job-06] |   `-- Installing indexinfo-0.3.1...
[130arm64-default-job-06] |   `-- Extracting indexinfo-0.3.1: .... done
<snip>
-- ADDING SIMULATOR TEST 68 rare/RedwoodDeltaTree
-- ADDING SIMULATOR TEST 69 rare/Throttling
-- ADDING SIMULATOR TEST 70 rare/TransactionTagApiCorrectness
-- ADDING SIMULATOR TEST 71 rare/TransactionTagSwizzledApiCorrectness
-- ADDING SIMULATOR TEST 72 rare/WriteTagThrottling
-- ADDING SIMULATOR TEST 73 restarting/from_7.0.0/SnapIncrementalRestore-1
-- ADDING SIMULATOR TEST 75 restarting/from_7.0.0/ConfigureTestRestart-1
-- ADDING SIMULATOR TEST 77 restarting/from_5.0.0_until_6.3.0/CycleTestRestart-1
-- ADDING SIMULATOR TEST 79 restarting/from_5.0.0_until_6.3.0/StorefrontTestRestart-1
-- ADDING SIMULATOR TEST 81 restarting/from_6.2.33_until_6.3.0/SnapTestAttrition-1
-- ADDING SIMULATOR TEST 83 restarting/from_6.2.33_until_6.3.0/SnapTestSimpleRestart-1
-- ADDING SIMULATOR TEST 85 restarting/from_6.2.33_until_6.3.0/SnapTestRestart-1
-- ADDING SIMULATOR TEST 87 restarting/from_6.2.33_until_6.3.0/SnapCycleRestart-1
-- ADDING SIMULATOR TEST 89 restarting/from_5.1.7_until_6.3.0/DrUpgradeRestart-1
-- ADDING SIMULATOR TEST 91 restarting/from_5.2.0_until_6.3.0/ClientTransactionProfilingCorrectness-1
-- ADDING SIMULATOR TEST 93 restarting/from_6.3.13/ClientTransactionProfilingCorrectness-1
-- ADDING SIMULATOR TEST 95 restarting/from_6.3.13/CycleTestRestart-1
-- ADDING SIMULATOR TEST 97 restarting/from_6.3.13/DrUpgradeRestart-1
-- ADDING SIMULATOR TEST 99 restarting/from_6.3.13/SnapCycleRestart-1
-- ADDING SIMULATOR TEST 101 restarting/from_6.3.13/SnapTestAttrition-1
-- ADDING SIMULATOR TEST 103 restarting/from_6.3.13/SnapTestRestart-1
-- ADDING SIMULATOR TEST 105 restarting/from_6.3.13/SnapTestSimpleRestart-1
-- ADDING SIMULATOR TEST 107 restarting/from_6.3.13/StorefrontTestRestart-1
-- ADDING SIMULATOR TEST 109 restarting/from_7.0.0/UpgradeAndBackupRestore-1
-- ADDING SIMULATOR TEST 111 restarting/to_6.3.13_until_7.0.0/CycleTestRestart-1
-- ADDING SIMULATOR TEST 113 restarting/to_7.0.0/CycleTestRestart-1
-- ADDING SIMULATOR TEST 115 slow/ApiCorrectness
-- ADDING SIMULATOR TEST 116 slow/ApiCorrectnessAtomicRestore
-- ADDING SIMULATOR TEST 117 slow/ApiCorrectnessSwitchover
-- ADDING SIMULATOR TEST 118 slow/ClogWithRollbacks
-- ADDING SIMULATOR TEST 119 slow/CloggedCycleTest
-- ADDING SIMULATOR TEST 120 slow/CloggedStorefront
-- ADDING SIMULATOR TEST 121 slow/CommitBug
-- ADDING SIMULATOR TEST 122 slow/ConfigureTest
-- ADDING SIMULATOR TEST 123 slow/ConfigureStorageMigrationTest
-- ADDING SIMULATOR TEST 124 slow/CycleRollbackPlain
-- ADDING SIMULATOR TEST 125 slow/DDBalanceAndRemove
-- ADDING SIMULATOR TEST 126 slow/DDBalanceAndRemoveStatus
-- ADDING SIMULATOR TEST 127 slow/DifferentClustersSameRV
-- ADDING SIMULATOR TEST 128 slow/DiskFailureCycle
-- ADDING SIMULATOR TEST 129 slow/FastTriggeredWatches
-- ADDING SIMULATOR TEST 130 slow/LowLatencyWithFailures
-- ADDING SIMULATOR TEST 131 slow/MoveKeysClean
-- ADDING SIMULATOR TEST 132 slow/MoveKeysSideband
-- ADDING SIMULATOR TEST 133 slow/RyowCorrectness
-- ADDING SIMULATOR TEST 134 slow/Serializability
-- ADDING SIMULATOR TEST 135 slow/SharedBackupCorrectness
-- ADDING SIMULATOR TEST 136 slow/SharedBackupToDBCorrectness
-- ADDING SIMULATOR TEST 137 slow/StorefrontTest
-- ADDING SIMULATOR TEST 138 slow/SwizzledApiCorrectness
-- ADDING SIMULATOR TEST 139 slow/SwizzledCycleTest
-- ADDING SIMULATOR TEST 140 slow/SwizzledDdBalance
-- ADDING SIMULATOR TEST 141 slow/SwizzledRollbackTimeLapse
-- ADDING SIMULATOR TEST 142 slow/SwizzledRollbackTimeLapseIncrement
-- ADDING SIMULATOR TEST 143 slow/VersionStampBackupToDB
-- ADDING SIMULATOR TEST 144 slow/VersionStampSwitchover
-- ADDING SIMULATOR TEST 145 slow/WriteDuringReadAtomicRestore
-- ADDING SIMULATOR TEST 146 slow/WriteDuringReadSwitchover
-- ADDING SIMULATOR TEST 147 slow/ddbalance
-- ADDING SIMULATOR TEST 148 slow/ParallelRestoreNewBackupCorrectnessAtomicOp
-- ADDING SIMULATOR TEST 149 slow/ParallelRestoreNewBackupCorrectnessCycle
-- ADDING SIMULATOR TEST 150 slow/ParallelRestoreNewBackupCorrectnessMultiCycles
-- ADDING SIMULATOR TEST 151 slow/ParallelRestoreNewBackupWriteDuringReadAtomicRestore
-- ADDING SIMULATOR TEST 152 slow/ParallelRestoreOldBackupCorrectnessAtomicOp
-- ADDING SIMULATOR TEST 153 slow/ParallelRestoreOldBackupCorrectnessCycle
-- ADDING SIMULATOR TEST 154 slow/ParallelRestoreOldBackupCorrectnessMultiCycles
-- ADDING SIMULATOR TEST 155 slow/ParallelRestoreOldBackupWriteDuringReadAtomicRestore
-- ADDING SIMULATOR TEST 156 status/invalid_proc_addresses
-- ADDING SIMULATOR TEST 157 status/local_6_machine_no_replicas_remain
-- ADDING SIMULATOR TEST 158 status/separate_1_of_3_coordinators_remain
-- ADDING SIMULATOR TEST 159 status/separate_2_of_3_coordinators_remain
-- ADDING SIMULATOR TEST 160 status/separate_cannot_write_cluster_file
-- ADDING SIMULATOR TEST 161 status/separate_idle
-- ADDING SIMULATOR TEST 162 status/separate_initializing
-- ADDING SIMULATOR TEST 163 status/separate_no_coordinators
-- ADDING SIMULATOR TEST 164 status/separate_no_database
-- ADDING SIMULATOR TEST 165 status/separate_no_servers
-- ADDING SIMULATOR TEST 166 status/separate_not_enough_servers
-- ADDING SIMULATOR TEST 167 status/single_process_too_many_config_params
-- Check versions.h on fdb_flow_actors
-- Check versions.h on fdb_flow_tester_actors
-- Check versions.h on tutorial_actors
-- Add html target
-- add_custom_target(html DEPENDS /wrkdirs/usr/ports/databases/foundationdb-devel/work/.build/documentation/html_done)
-- math(EXPRport(0x572578c0d838024 % 8000) + 8000OUTPUT_FORMATDECIMAL)
-- Port is 14244
-- =========================================
--    Components Build Overview 
-- =========================================
-- Build Bindings (depends on Python):   ON
-- Build C Bindings:                     ON
-- Build Python Bindings:                ON
-- Build Java Bindings:                  OFF
-- Build Go bindings:                    OFF
-- Build Ruby bindings:                  OFF
-- Build with TLS support:               ON
-- Build Documentation (make html):      ON
-- Build Python sdist (make package):    ON
-- Configure CTest (depends on Python):  ON
-- Build contrib:                        ON
-- Build with FlowBench:                 OFF
-- Build with RocksDB:                   OFF
-- =========================================
-- CPACK_COMPONENTS_ALL clients-deb;clients-el7;clients-tgz;clients-versioned;server-deb;server-el7;server-tgz;server-versioned
-- Configuring done
-- Generating done
CMake Warning:
  Manually-specified variables were not used by the project:

    BOOST_PYTHON_SUFFIX
    CMAKE_COLOR_MAKEFILE
    CMAKE_MODULE_LINKER_FLAGS
    CMAKE_VERBOSE_MAKEFILE
    Python_ADDITIONAL_VERSIONS


-- Build files have been written to: /wrkdirs/usr/ports/databases/foundationdb-devel/work/.build
===========================================================================
=======================<phase: build          >============================
===>  Building for foundationdb-devel-7.0.0
[  0% 2/824] cd /wrkdirs/usr/ports/databases/foundationdb-devel/work/.build && /usr/local/bin/mcs -r:System,System.Core,System.Xml.Linq,System.Data.DataSetExtensions,Microsoft.CSharp,System.Data,System.Xml /wrkdirs/usr/ports/databases/foundationdb-devel/work/foundationdb-7.0.0/flow/coveragetool/Program.cs /wrkdirs/usr/ports/databases/foundationdb-devel/work/foundationdb-7.0.0/flow/coveragetool/Properties/AssemblyInfo.cs -target:exe -out:coveragetool.exe
[  0% 3/824] cd /wrkdirs/usr/ports/databases/foundationdb-devel/work/.build && /usr/local/bin/mcs -r:System,System.Core,System.Xml.Linq,System.Data.DataSetExtensions,Microsoft.CSharp,System.Data,System.Xml /wrkdirs/usr/ports/databases/foundationdb-devel/work/foundationdb-7.0.0/flow/actorcompiler/ActorCompiler.cs /wrkdirs/usr/ports/databases/foundationdb-devel/work/foundationdb-7.0.0/flow/actorcompiler/ActorParser.cs /wrkdirs/usr/ports/databases/foundationdb-devel/work/foundationdb-7.0.0/flow/actorcompiler/ParseTree.cs /wrkdirs/usr/ports/databases/foundationdb-devel/work/foundationdb-7.0.0/flow/actorcompiler/Program.cs /wrkdirs/usr/ports/databases/foundationdb-devel/work/foundationdb-7.0.0/flow/actorcompiler/Properties/AssemblyInfo.cs -target:exe -out:actorcompiler.exe
[  0% 4/824] cd /wrkdirs/usr/ports/databases/foundationdb-devel/work/.build && /usr/local/bin/mcs -r:System,System.Core,System.Data,System.Xml,System.Xml.Linq /wrkdirs/usr/ports/databases/foundationdb-devel/work/foundationdb-7.0.0/fdbclient/vexillographer/c.cs /wrkdirs/usr/ports/databases/foundationdb-devel/work/foundationdb-7.0.0/fdbclient/vexillographer/cpp.cs /wrkdirs/usr/ports/databases/foundationdb-devel/work/foundationdb-7.0.0/fdbclient/vexillographer/java.cs /wrkdirs/usr/ports/databases/foundationdb-devel/work/foundationdb-7.0.0/fdbclient/vexillographer/python.cs /wrkdirs/usr/ports/databases/foundationdb-devel/work/foundationdb-7.0.0/fdbclient/vexillographer/ruby.cs /wrkdirs/usr/ports/databases/foundationdb-devel/work/foundationdb-7.0.0/fdbclient/vexillographer/vexillographer.cs -target:exe -out:/wrkdirs/usr/ports/databases/foundationdb-devel/work/.build/vexillographer.exe
[  0% 5/824] cd /wrkdirs/usr/ports/databases/foundationdb-devel/work/.build/flow && /usr/local/bin/cmake -DFILE="/wrkdirs/usr/ports/databases/foundationdb-devel/work/foundationdb-7.0.0/versions.h" -P /wrkdirs/usr/ports/databases/foundationdb-devel/work/foundationdb-7.0.0/cmake/AssertFileDoesntExist.cmake
[  0% 6/824] cd /wrkdirs/usr/ports/databases/foundationdb-devel/work/.build/flow && /usr/local/bin/mono /wrkdirs/usr/ports/databases/foundationdb-devel/work/.build/actorcompiler.exe /wrkdirs/usr/ports/databases/foundationdb-devel/work/foundationdb-7.0.0/flow/ActorCollection.actor.cpp /wrkdirs/usr/ports/databases/foundationdb-devel/work/.build/flow/ActorCollection.actor.g.cpp --generate-probes > /dev/null
[  0% 7/824] cd /wrkdirs/usr/ports/databases/foundationdb-devel/work/.build/flow && /usr/local/bin/mono /wrkdirs/usr/ports/databases/foundationdb-devel/work/.build/actorcompiler.exe /wrkdirs/usr/ports/databases/foundationdb-devel/work/foundationdb-7.0.0/flow/CompressedInt.actor.cpp /wrkdirs/usr/ports/databases/foundationdb-devel/work/.build/flow/CompressedInt.actor.g.cpp --generate-probes > /dev/null
[  0% 8/824] /usr/bin/c++ -DBOOST_ERROR_CODE_HEADER_ONLY -DBOOST_SYSTEM_NO_DEPRECATED -DNO_INTELLISENSE -I/wrkdirs/usr/ports/databases/foundationdb-devel/work/foundationdb-7.0.0 -I/wrkdirs/usr/ports/databases/foundationdb-devel/work/.build -I/usr/local/include -O2 -pipe -fstack-protector-strong -fno-strict-aliasing -O2 -pipe -fstack-protector-strong -fno-strict-aliasing -DCMAKE_BUILD -ggdb -fno-omit-frame-pointer -stdlib=libc++ -Wall -Wextra -Wredundant-move -Wpessimizing-move -Woverloaded-virtual -Wshift-sign-overflow -Wno-comment -Wno-dangling-else -Wno-delete-non-virtual-dtor -Wno-format -Wno-mismatched-tags -Wno-missing-field-initializers -Wno-reorder -Wno-reorder-ctor -Wno-sign-compare -Wno-tautological-pointer-compare -Wno-undefined-var-template -Wno-unknown-pragmas -Wno-unknown-warning-option -Wno-unused-function -Wno-unused-local-typedef -Wno-unused-parameter -Wno-self-assign -Wno-error=format -Wunused-variable -Wno-deprecated -fvisibility=hidden -Wreturn-type -fPIC -march=ar
 mv8.2-a+crc+simd -DHAVE_OPENSSL -DHAVE_OPENSSL_INIT_NO_AT_EXIT -std=gnu++17 -MD -MT flow/CMakeFiles/stacktrace.dir/stacktrace.amalgamation.cpp.o -MF flow/CMakeFiles/stacktrace.dir/stacktrace.amalgamation.cpp.o.d -o flow/CMakeFiles/stacktrace.dir/stacktrace.amalgamation.cpp.o -c /wrkdirs/usr/ports/databases/foundationdb-devel/work/foundationdb-7.0.0/flow/stacktrace.amalgamation.cpp
[  0% 9/824] cd /wrkdirs/usr/ports/databases/foundationdb-devel/work/.build/flow && /usr/local/bin/mono /wrkdirs/usr/ports/databases/foundationdb-devel/work/.build/actorcompiler.exe /wrkdirs/usr/ports/databases/foundationdb-devel/work/foundationdb-7.0.0/flow/EventTypes.actor.h /wrkdirs/usr/ports/databases/foundationdb-devel/work/.build/flow/EventTypes.actor.g.h --generate-probes > /dev/null
[  1% 10/824] : && /usr/local/bin/cmake -E rm -f lib/libstacktrace.a && /usr/bin/llvm-ar qc lib/libstacktrace.a  flow/CMakeFiles/stacktrace.dir/stacktrace.amalgamation.cpp.o && /usr/bin/llvm-ranlib lib/libstacktrace.a && :
[  1% 11/824] cd /wrkdirs/usr/ports/databases/foundationdb-devel/work/.build/flow && /usr/local/bin/mono /wrkdirs/usr/ports/databases/foundationdb-devel/work/.build/actorcompiler.exe /wrkdirs/usr/ports/databases/foundationdb-devel/work/foundationdb-7.0.0/flow/IThreadPoolTest.actor.cpp /wrkdirs/usr/ports/databases/foundationdb-devel/work/.build/flow/IThreadPoolTest.actor.g.cpp --generate-probes > /dev/null
[  1% 12/824] cd /wrkdirs/usr/ports/databases/foundationdb-devel/work/.build/flow && /usr/local/bin/mono /wrkdirs/usr/ports/databases/foundationdb-devel/work/.build/actorcompiler.exe /wrkdirs/usr/ports/databases/foundationdb-devel/work/foundationdb-7.0.0/flow/IndexedSet.actor.h /wrkdirs/usr/ports/databases/foundationdb-devel/work/.build/flow/IndexedSet.actor.g.h --generate-probes > /dev/null
[  1% 13/824] cd /wrkdirs/usr/ports/databases/foundationdb-devel/work/.build/flow && /usr/local/bin/mono /wrkdirs/usr/ports/databases/foundationdb-devel/work/.build/actorcompiler.exe /wrkdirs/usr/ports/databases/foundationdb-devel/work/foundationdb-7.0.0/flow/Net2.actor.cpp /wrkdirs/usr/ports/databases/foundationdb-devel/work/.build/flow/Net2.actor.g.cpp --generate-probes > /dev/null
[  1% 14/824] cd /wrkdirs/usr/ports/databases/foundationdb-devel/work/.build/flow && /usr/local/bin/mono /wrkdirs/usr/ports/databases/foundationdb-devel/work/.build/actorcompiler.exe /wrkdirs/usr/ports/databases/foundationdb-devel/work/foundationdb-7.0.0/flow/Platform.actor.h /wrkdirs/usr/ports/databases/foundationdb-devel/work/.build/flow/Platform.actor.g.h --generate-probes > /dev/null
[  1% 15/824] cd /wrkdirs/usr/ports/databases/foundationdb-devel/work/.build/flow && /usr/local/bin/mono /wrkdirs/usr/ports/databases/foundationdb-devel/work/.build/actorcompiler.exe /wrkdirs/usr/ports/databases/foundationdb-devel/work/foundationdb-7.0.0/flow/Platform.actor.cpp /wrkdirs/usr/ports/databases/foundationdb-devel/work/.build/flow/Platform.actor.g.cpp --generate-probes > /dev/null
[  1% 16/824] cd /wrkdirs/usr/ports/databases/foundationdb-devel/work/.build/flow && /usr/local/bin/mono /wrkdirs/usr/ports/databases/foundationdb-devel/work/.build/actorcompiler.exe /wrkdirs/usr/ports/databases/foundationdb-devel/work/foundationdb-7.0.0/flow/Profiler.actor.cpp /wrkdirs/usr/ports/databases/foundationdb-devel/work/.build/flow/Profiler.actor.g.cpp --generate-probes > /dev/null
[  1% 17/824] cd /wrkdirs/usr/ports/databases/foundationdb-devel/work/.build/flow && /usr/local/bin/mono /wrkdirs/usr/ports/databases/foundationdb-devel/work/.build/actorcompiler.exe /wrkdirs/usr/ports/databases/foundationdb-devel/work/foundationdb-7.0.0/flow/TDMetric.actor.h /wrkdirs/usr/ports/databases/foundationdb-devel/work/.build/flow/TDMetric.actor.g.h --generate-probes > /dev/null
[  2% 18/824] cd /wrkdirs/usr/ports/databases/foundationdb-devel/work/.build/flow && /usr/local/bin/mono /wrkdirs/usr/ports/databases/foundationdb-devel/work/.build/actorcompiler.exe /wrkdirs/usr/ports/databases/foundationdb-devel/work/foundationdb-7.0.0/flow/TLSConfig.actor.cpp /wrkdirs/usr/ports/databases/foundationdb-devel/work/.build/flow/TLSConfig.actor.g.cpp --generate-probes > /dev/null
[  2% 19/824] cd /wrkdirs/usr/ports/databases/foundationdb-devel/work/.build/flow && /usr/local/bin/mono /wrkdirs/usr/ports/databases/foundationdb-devel/work/.build/actorcompiler.exe /wrkdirs/usr/ports/databases/foundationdb-devel/work/foundationdb-7.0.0/flow/TLSConfig.actor.h /wrkdirs/usr/ports/databases/foundationdb-devel/work/.build/flow/TLSConfig.actor.g.h --generate-probes > /dev/null
[  2% 20/824] cd /wrkdirs/usr/ports/databases/foundationdb-devel/work/.build/flow && /usr/local/bin/mono /wrkdirs/usr/ports/databases/foundationdb-devel/work/.build/actorcompiler.exe /wrkdirs/usr/ports/databases/foundationdb-devel/work/foundationdb-7.0.0/flow/ThreadHelper.actor.h /wrkdirs/usr/ports/databases/foundationdb-devel/work/.build/flow/ThreadHelper.actor.g.h --generate-probes > /dev/null
[  2% 21/824] cd /wrkdirs/usr/ports/databases/foundationdb-devel/work/.build/flow && /usr/local/bin/mono /wrkdirs/usr/ports/databases/foundationdb-devel/work/.build/actorcompiler.exe /wrkdirs/usr/ports/databases/foundationdb-devel/work/foundationdb-7.0.0/flow/Tracing.actor.cpp /wrkdirs/usr/ports/databases/foundationdb-devel/work/.build/flow/Tracing.actor.g.cpp --generate-probes > /dev/null
[  2% 22/824] cd /wrkdirs/usr/ports/databases/foundationdb-devel/work/.build/flow && /usr/local/bin/mono /wrkdirs/usr/ports/databases/foundationdb-devel/work/.build/actorcompiler.exe /wrkdirs/usr/ports/databases/foundationdb-devel/work/foundationdb-7.0.0/flow/genericactors.actor.cpp /wrkdirs/usr/ports/databases/foundationdb-devel/work/.build/flow/genericactors.actor.g.cpp --generate-probes > /dev/null
[  2% 23/824] cd /wrkdirs/usr/ports/databases/foundationdb-devel/work/.build/flow && /usr/local/bin/mono /wrkdirs/usr/ports/databases/foundationdb-devel/work/.build/actorcompiler.exe /wrkdirs/usr/ports/databases/foundationdb-devel/work/foundationdb-7.0.0/flow/genericactors.actor.h /wrkdirs/usr/ports/databases/foundationdb-devel/work/.build/flow/genericactors.actor.g.h --generate-probes > /dev/null
[  2% 24/824] /usr/bin/cc -DBOOST_ERROR_CODE_HEADER_ONLY -DBOOST_SYSTEM_NO_DEPRECATED -DNO_INTELLISENSE -DUSE_UCONTEXT -I/wrkdirs/usr/ports/databases/foundationdb-devel/work/foundationdb-7.0.0 -I/wrkdirs/usr/ports/databases/foundationdb-devel/work/.build -I/usr/local/include -O2 -pipe  -fstack-protector-strong -fno-strict-aliasing -O2 -pipe  -fstack-protector-strong -fno-strict-aliasing -DCMAKE_BUILD -ggdb -fno-omit-frame-pointer -Wall -Wextra -Wredundant-move -Wpessimizing-move -Woverloaded-virtual -Wshift-sign-overflow -Wno-comment -Wno-dangling-else -Wno-delete-non-virtual-dtor -Wno-format -Wno-mismatched-tags -Wno-missing-field-initializers -Wno-reorder -Wno-reorder-ctor -Wno-sign-compare -Wno-tautological-pointer-compare -Wno-undefined-var-template -Wno-unknown-pragmas -Wno-unknown-warning-option -Wno-unused-function -Wno-unused-local-typedef -Wno-unused-parameter -Wno-self-assign -Wno-error=format -Wunused-variable -Wno-deprecated -fvisibility=hidden -Wreturn-type -fPIC -march=
 armv8.2-a+crc+simd -DHAVE_OPENSSL -DHAVE_OPENSSL_INIT_NO_AT_EXIT -w -std=gnu11 -MD -MT fdbrpc/CMakeFiles/coro.dir/libcoroutine/Common.c.o -MF fdbrpc/CMakeFiles/coro.dir/libcoroutine/Common.c.o.d -o fdbrpc/CMakeFiles/coro.dir/libcoroutine/Common.c.o -c /wrkdirs/usr/ports/databases/foundationdb-devel/work/foundationdb-7.0.0/fdbrpc/libcoroutine/Common.c
[  2% 25/824] /usr/bin/cc -DBOOST_ERROR_CODE_HEADER_ONLY -DBOOST_SYSTEM_NO_DEPRECATED -DNO_INTELLISENSE -DUSE_UCONTEXT -I/wrkdirs/usr/ports/databases/foundationdb-devel/work/foundationdb-7.0.0 -I/wrkdirs/usr/ports/databases/foundationdb-devel/work/.build -I/usr/local/include -O2 -pipe  -fstack-protector-strong -fno-strict-aliasing -O2 -pipe  -fstack-protector-strong -fno-strict-aliasing -DCMAKE_BUILD -ggdb -fno-omit-frame-pointer -Wall -Wextra -Wredundant-move -Wpessimizing-move -Woverloaded-virtual -Wshift-sign-overflow -Wno-comment -Wno-dangling-else -Wno-delete-non-virtual-dtor -Wno-format -Wno-mismatched-tags -Wno-missing-field-initializers -Wno-reorder -Wno-reorder-ctor -Wno-sign-compare -Wno-tautological-pointer-compare -Wno-undefined-var-template -Wno-unknown-pragmas -Wno-unknown-warning-option -Wno-unused-function -Wno-unused-local-typedef -Wno-unused-parameter -Wno-self-assign -Wno-error=format -Wunused-variable -Wno-deprecated -fvisibility=hidden -Wreturn-type -fPIC -march=
 armv8.2-a+crc+simd -DHAVE_OPENSSL -DHAVE_OPENSSL_INIT_NO_AT_EXIT -w -std=gnu11 -MD -MT fdbrpc/CMakeFiles/coro.dir/libcoroutine/Coro.c.o -MF fdbrpc/CMakeFiles/coro.dir/libcoroutine/Coro.c.o.d -o fdbrpc/CMakeFiles/coro.dir/libcoroutine/Coro.c.o -c /wrkdirs/usr/ports/databases/foundationdb-devel/work/foundationdb-7.0.0/fdbrpc/libcoroutine/Coro.c
[  3% 26/824] /usr/bin/cc -DBOOST_ERROR_CODE_HEADER_ONLY -DBOOST_SYSTEM_NO_DEPRECATED -DNO_INTELLISENSE -DUSE_UCONTEXT -I/wrkdirs/usr/ports/databases/foundationdb-devel/work/foundationdb-7.0.0 -I/wrkdirs/usr/ports/databases/foundationdb-devel/work/.build -I/usr/local/include -O2 -pipe  -fstack-protector-strong -fno-strict-aliasing -O2 -pipe  -fstack-protector-strong -fno-strict-aliasing -DCMAKE_BUILD -ggdb -fno-omit-frame-pointer -Wall -Wextra -Wredundant-move -Wpessimizing-move -Woverloaded-virtual -Wshift-sign-overflow -Wno-comment -Wno-dangling-else -Wno-delete-non-virtual-dtor -Wno-format -Wno-mismatched-tags -Wno-missing-field-initializers -Wno-reorder -Wno-reorder-ctor -Wno-sign-compare -Wno-tautological-pointer-compare -Wno-undefined-var-template -Wno-unknown-pragmas -Wno-unknown-warning-option -Wno-unused-function -Wno-unused-local-typedef -Wno-unused-parameter -Wno-self-assign -Wno-error=format -Wunused-variable -Wno-deprecated -fvisibility=hidden -Wreturn-type -fPIC -march=
 armv8.2-a+crc+simd -DHAVE_OPENSSL -DHAVE_OPENSSL_INIT_NO_AT_EXIT -w -std=gnu11 -MD -MT fdbrpc/CMakeFiles/coro.dir/libcoroutine/context.c.o -MF fdbrpc/CMakeFiles/coro.dir/libcoroutine/context.c.o.d -o fdbrpc/CMakeFiles/coro.dir/libcoroutine/context.c.o -c /wrkdirs/usr/ports/databases/foundationdb-devel/work/foundationdb-7.0.0/fdbrpc/libcoroutine/context.c
[  3% 27/824] : && /usr/local/bin/cmake -E rm -f lib/libcoro.a && /usr/bin/llvm-ar qc lib/libcoro.a  fdbrpc/CMakeFiles/coro.dir/libcoroutine/Common.c.o fdbrpc/CMakeFiles/coro.dir/libcoroutine/Coro.c.o fdbrpc/CMakeFiles/coro.dir/libcoroutine/context.c.o && /usr/bin/llvm-ranlib lib/libcoro.a && :
[  3% 28/824] cd /wrkdirs/usr/ports/databases/foundationdb-devel/work/.build/fdbrpc && /usr/local/bin/cmake -DFILE="/wrkdirs/usr/ports/databases/foundationdb-devel/work/foundationdb-7.0.0/versions.h" -P /wrkdirs/usr/ports/databases/foundationdb-devel/work/foundationdb-7.0.0/cmake/AssertFileDoesntExist.cmake
[  3% 29/824] cd /wrkdirs/usr/ports/databases/foundationdb-devel/work/.build/fdbrpc && /usr/local/bin/mono /wrkdirs/usr/ports/databases/foundationdb-devel/work/.build/actorcompiler.exe /wrkdirs/usr/ports/databases/foundationdb-devel/work/foundationdb-7.0.0/fdbrpc/AsyncFileCached.actor.h /wrkdirs/usr/ports/databases/foundationdb-devel/work/.build/fdbrpc/AsyncFileCached.actor.g.h --generate-probes > /dev/null
[  3% 30/824] cd /wrkdirs/usr/ports/databases/foundationdb-devel/work/.build/fdbrpc && /usr/local/bin/mono /wrkdirs/usr/ports/databases/foundationdb-devel/work/.build/actorcompiler.exe /wrkdirs/usr/ports/databases/foundationdb-devel/work/foundationdb-7.0.0/fdbrpc/AsyncFileEIO.actor.h /wrkdirs/usr/ports/databases/foundationdb-devel/work/.build/fdbrpc/AsyncFileEIO.actor.g.h --generate-probes > /dev/null
[  3% 31/824] cd /wrkdirs/usr/ports/databases/foundationdb-devel/work/foundationdb-7.0.0/flow && /usr/local/bin/mono /wrkdirs/usr/ports/databases/foundationdb-devel/work/.build/coveragetool.exe /wrkdirs/usr/ports/databases/foundationdb-devel/work/.build/lib/coverage.flow.xml ActorCollection.actor.cpp ActorCollection.h Arena.cpp Arena.h AsioReactor.h CompressedInt.actor.cpp CompressedInt.h Deque.cpp Deque.h DeterministicRandom.cpp DeterministicRandom.h Error.cpp Error.h EventTypes.actor.h FastAlloc.cpp FastAlloc.h FastRef.h FaultInjection.cpp FaultInjection.h FileTraceLogWriter.cpp FileTraceLogWriter.h Hash3.c Hash3.h Histogram.cpp Histogram.h IDispatched.h IRandom.h IThreadPoolTest.actor.cpp IThreadPool.cpp IThreadPool.h ITrace.h IndexedSet.actor.h IndexedSet.cpp IndexedSet.h JsonTraceLogFormatter.cpp JsonTraceLogFormatter.h Knobs.cpp Knobs.h MetricSample.h Net2.actor.cpp Net2Packet.cpp Net2Packet.h Platform.actor.cpp Platform.actor.h Platform.h Profiler.actor.cpp Profiler.h SendBuff
 erIterator.h SignalSafeUnwind.cpp SignalSafeUnwind.h SimpleOpt.h SystemMonitor.cpp SystemMonitor.h TDMetric.actor.h TDMetric.cpp TLSConfig.actor.cpp TLSConfig.actor.h ThreadHelper.actor.h ThreadHelper.cpp ThreadPrimitives.cpp ThreadPrimitives.h ThreadSafeQueue.h Trace.cpp Trace.h Tracing.h Tracing.actor.cpp TreeBenchmark.h UnitTest.cpp UnitTest.h XmlTraceLogFormatter.cpp XmlTraceLogFormatter.h actorcompiler.h crc32c.h crc32c.cpp error_definitions.h /wrkdirs/usr/ports/databases/foundationdb-devel/work/.build/flow/SourceVersion.h flat_buffers.cpp flat_buffers.h flow.cpp flow.h genericactors.actor.cpp genericactors.actor.h network.cpp network.h rte_memcpy.h serialize.cpp serialize.h stacktrace.h test_memcpy.cpp test_memcpy_perf.cpp version.cpp xxhash.c xxhash.h folly_memcpy.S aarch64/memcmp.S aarch64/memcpy.S
[  3% 32/824] cd /wrkdirs/usr/ports/databases/foundationdb-devel/work/.build/fdbrpc && /usr/local/bin/mono /wrkdirs/usr/ports/databases/foundationdb-devel/work/.build/actorcompiler.exe /wrkdirs/usr/ports/databases/foundationdb-devel/work/foundationdb-7.0.0/fdbrpc/AsyncFileKAIO.actor.h /wrkdirs/usr/ports/databases/foundationdb-devel/work/.build/fdbrpc/AsyncFileKAIO.actor.g.h --generate-probes > /dev/null
[  3% 33/824] /usr/bin/c++ -DBOOST_ALL_NO_LIB -DBOOST_ERROR_CODE_HEADER_ONLY -DBOOST_SYSTEM_NO_DEPRECATED -DNO_INTELLISENSE -I/wrkdirs/usr/ports/databases/foundationdb-devel/work/foundationdb-7.0.0 -I/wrkdirs/usr/ports/databases/foundationdb-devel/work/.build -isystem /usr/local/include -O2 -pipe -fstack-protector-strong -fno-strict-aliasing -O2 -pipe -fstack-protector-strong -fno-strict-aliasing -DCMAKE_BUILD -ggdb -fno-omit-frame-pointer -stdlib=libc++ -Wall -Wextra -Wredundant-move -Wpessimizing-move -Woverloaded-virtual -Wshift-sign-overflow -Wno-comment -Wno-dangling-else -Wno-delete-non-virtual-dtor -Wno-format -Wno-mismatched-tags -Wno-missing-field-initializers -Wno-reorder -Wno-reorder-ctor -Wno-sign-compare -Wno-tautological-pointer-compare -Wno-undefined-var-template -Wno-unknown-pragmas -Wno-unknown-warning-option -Wno-unused-function -Wno-unused-local-typedef -Wno-unused-parameter -Wno-self-assign -Wno-error=format -Wunused-variable -Wno-deprecated -fvisibility=hidden -W
 return-type -fPIC -march=armv8.2-a+crc+simd -DHAVE_OPENSSL -DHAVE_OPENSSL_INIT_NO_AT_EXIT -pthread -std=gnu++17 -MD -MT flow/CMakeFiles/flow.dir/ActorCollection.actor.g.cpp.o -MF flow/CMakeFiles/flow.dir/ActorCollection.actor.g.cpp.o.d -o flow/CMakeFiles/flow.dir/ActorCollection.actor.g.cpp.o -c /wrkdirs/usr/ports/databases/foundationdb-devel/work/.build/flow/ActorCollection.actor.g.cpp
FAILED: flow/CMakeFiles/flow.dir/ActorCollection.actor.g.cpp.o 
/usr/bin/c++ -DBOOST_ALL_NO_LIB -DBOOST_ERROR_CODE_HEADER_ONLY -DBOOST_SYSTEM_NO_DEPRECATED -DNO_INTELLISENSE -I/wrkdirs/usr/ports/databases/foundationdb-devel/work/foundationdb-7.0.0 -I/wrkdirs/usr/ports/databases/foundationdb-devel/work/.build -isystem /usr/local/include -O2 -pipe -fstack-protector-strong -fno-strict-aliasing -O2 -pipe -fstack-protector-strong -fno-strict-aliasing -DCMAKE_BUILD -ggdb -fno-omit-frame-pointer -stdlib=libc++ -Wall -Wextra -Wredundant-move -Wpessimizing-move -Woverloaded-virtual -Wshift-sign-overflow -Wno-comment -Wno-dangling-else -Wno-delete-non-virtual-dtor -Wno-format -Wno-mismatched-tags -Wno-missing-field-initializers -Wno-reorder -Wno-reorder-ctor -Wno-sign-compare -Wno-tautological-pointer-compare -Wno-undefined-var-template -Wno-unknown-pragmas -Wno-unknown-warning-option -Wno-unused-function -Wno-unused-local-typedef -Wno-unused-parameter -Wno-self-assign -Wno-error=format -Wunused-variable -Wno-deprecated -fvisibility=hidden -Wreturn-type -f
 PIC -march=armv8.2-a+crc+simd -DHAVE_OPENSSL -DHAVE_OPENSSL_INIT_NO_AT_EXIT -pthread -std=gnu++17 -MD -MT flow/CMakeFiles/flow.dir/ActorCollection.actor.g.cpp.o -MF flow/CMakeFiles/flow.dir/ActorCollection.actor.g.cpp.o.d -o flow/CMakeFiles/flow.dir/ActorCollection.actor.g.cpp.o -c /wrkdirs/usr/ports/databases/foundationdb-devel/work/.build/flow/ActorCollection.actor.g.cpp
In file included from /wrkdirs/usr/ports/databases/foundationdb-devel/work/foundationdb-7.0.0/flow/ActorCollection.actor.cpp:21:
In file included from /wrkdirs/usr/ports/databases/foundationdb-devel/work/foundationdb-7.0.0/flow/ActorCollection.h:25:
In file included from /wrkdirs/usr/ports/databases/foundationdb-devel/work/foundationdb-7.0.0/flow/flow.h:41:
/wrkdirs/usr/ports/databases/foundationdb-devel/work/foundationdb-7.0.0/flow/Platform.h:463:16: error: invalid output constraint '=a' in asm
        asm("rdtsc" : "=a"(lo), "=d"(hi));
                      ^
In file included from /wrkdirs/usr/ports/databases/foundationdb-devel/work/foundationdb-7.0.0/flow/ActorCollection.actor.cpp:21:
In file included from /wrkdirs/usr/ports/databases/foundationdb-devel/work/foundationdb-7.0.0/flow/ActorCollection.h:25:
In file included from /wrkdirs/usr/ports/databases/foundationdb-devel/work/foundationdb-7.0.0/flow/flow.h:1111:
In file included from /wrkdirs/usr/ports/databases/foundationdb-devel/work/foundationdb-7.0.0/flow/genericactors.actor.h:28:
In file included from /wrkdirs/usr/ports/databases/foundationdb-devel/work/foundationdb-7.0.0/flow/genericactors.actor.h:38:
In file included from /wrkdirs/usr/ports/databases/foundationdb-devel/work/foundationdb-7.0.0/flow/IndexedSet.h:1385:
In file included from /wrkdirs/usr/ports/databases/foundationdb-devel/work/foundationdb-7.0.0/flow/IndexedSet.actor.h:27:
/wrkdirs/usr/ports/databases/foundationdb-devel/work/foundationdb-7.0.0/flow/IndexedSet.actor.h:50:4: error: use of undeclared identifier '_mm_prefetch'
                        _mm_prefetch((const char*)toFree.back(), _MM_HINT_T0);
                        ^
2 errors generated.
[  4% 33/824] /usr/bin/c++ -DBOOST_ALL_NO_LIB -DBOOST_ERROR_CODE_HEADER_ONLY -DBOOST_SYSTEM_NO_DEPRECATED -DNO_INTELLISENSE -I/wrkdirs/usr/ports/databases/foundationdb-devel/work/foundationdb-7.0.0 -I/wrkdirs/usr/ports/databases/foundationdb-devel/work/.build -isystem /usr/local/include -O2 -pipe -fstack-protector-strong -fno-strict-aliasing -O2 -pipe -fstack-protector-strong -fno-strict-aliasing -DCMAKE_BUILD -ggdb -fno-omit-frame-pointer -stdlib=libc++ -Wall -Wextra -Wredundant-move -Wpessimizing-move -Woverloaded-virtual -Wshift-sign-overflow -Wno-comment -Wno-dangling-else -Wno-delete-non-virtual-dtor -Wno-format -Wno-mismatched-tags -Wno-missing-field-initializers -Wno-reorder -Wno-reorder-ctor -Wno-sign-compare -Wno-tautological-pointer-compare -Wno-undefined-var-template -Wno-unknown-pragmas -Wno-unknown-warning-option -Wno-unused-function -Wno-unused-local-typedef -Wno-unused-parameter -Wno-self-assign -Wno-error=format -Wunused-variable -Wno-deprecated -fvisibility=hidden -W
 return-type -fPIC -march=armv8.2-a+crc+simd -DHAVE_OPENSSL -DHAVE_OPENSSL_INIT_NO_AT_EXIT -pthread -std=gnu++17 -MD -MT flow/CMakeFiles/flow.dir/Arena.cpp.o -MF flow/CMakeFiles/flow.dir/Arena.cpp.o.d -o flow/CMakeFiles/flow.dir/Arena.cpp.o -c /wrkdirs/usr/ports/databases/foundationdb-devel/work/foundationdb-7.0.0/flow/Arena.cpp
FAILED: flow/CMakeFiles/flow.dir/Arena.cpp.o 
/usr/bin/c++ -DBOOST_ALL_NO_LIB -DBOOST_ERROR_CODE_HEADER_ONLY -DBOOST_SYSTEM_NO_DEPRECATED -DNO_INTELLISENSE -I/wrkdirs/usr/ports/databases/foundationdb-devel/work/foundationdb-7.0.0 -I/wrkdirs/usr/ports/databases/foundationdb-devel/work/.build -isystem /usr/local/include -O2 -pipe -fstack-protector-strong -fno-strict-aliasing -O2 -pipe -fstack-protector-strong -fno-strict-aliasing -DCMAKE_BUILD -ggdb -fno-omit-frame-pointer -stdlib=libc++ -Wall -Wextra -Wredundant-move -Wpessimizing-move -Woverloaded-virtual -Wshift-sign-overflow -Wno-comment -Wno-dangling-else -Wno-delete-non-virtual-dtor -Wno-format -Wno-mismatched-tags -Wno-missing-field-initializers -Wno-reorder -Wno-reorder-ctor -Wno-sign-compare -Wno-tautological-pointer-compare -Wno-undefined-var-template -Wno-unknown-pragmas -Wno-unknown-warning-option -Wno-unused-function -Wno-unused-local-typedef -Wno-unused-parameter -Wno-self-assign -Wno-error=format -Wunused-variable -Wno-deprecated -fvisibility=hidden -Wreturn-type -f
 PIC -march=armv8.2-a+crc+simd -DHAVE_OPENSSL -DHAVE_OPENSSL_INIT_NO_AT_EXIT -pthread -std=gnu++17 -MD -MT flow/CMakeFiles/flow.dir/Arena.cpp.o -MF flow/CMakeFiles/flow.dir/Arena.cpp.o.d -o flow/CMakeFiles/flow.dir/Arena.cpp.o -c /wrkdirs/usr/ports/databases/foundationdb-devel/work/foundationdb-7.0.0/flow/Arena.cpp
In file included from /wrkdirs/usr/ports/databases/foundationdb-devel/work/foundationdb-7.0.0/flow/Arena.cpp:21:
In file included from /wrkdirs/usr/ports/databases/foundationdb-devel/work/foundationdb-7.0.0/flow/Arena.h:27:
In file included from /wrkdirs/usr/ports/databases/foundationdb-devel/work/foundationdb-7.0.0/flow/FastAlloc.h:25:
In file included from /wrkdirs/usr/ports/databases/foundationdb-devel/work/foundationdb-7.0.0/flow/Error.h:30:
/wrkdirs/usr/ports/databases/foundationdb-devel/work/foundationdb-7.0.0/flow/Platform.h:463:16: error: invalid output constraint '=a' in asm
        asm("rdtsc" : "=a"(lo), "=d"(hi));
                      ^
In file included from /wrkdirs/usr/ports/databases/foundationdb-devel/work/foundationdb-7.0.0/flow/Arena.cpp:23:
In file included from /wrkdirs/usr/ports/databases/foundationdb-devel/work/foundationdb-7.0.0/flow/UnitTest.h:46:
In file included from /wrkdirs/usr/ports/databases/foundationdb-devel/work/foundationdb-7.0.0/flow/flow.h:1111:
In file included from /wrkdirs/usr/ports/databases/foundationdb-devel/work/foundationdb-7.0.0/flow/genericactors.actor.h:28:
In file included from /wrkdirs/usr/ports/databases/foundationdb-devel/work/foundationdb-7.0.0/flow/genericactors.actor.h:38:
In file included from /wrkdirs/usr/ports/databases/foundationdb-devel/work/foundationdb-7.0.0/flow/IndexedSet.h:1385:
In file included from /wrkdirs/usr/ports/databases/foundationdb-devel/work/foundationdb-7.0.0/flow/IndexedSet.actor.h:27:
/wrkdirs/usr/ports/databases/foundationdb-devel/work/foundationdb-7.0.0/flow/IndexedSet.actor.h:50:4: error: use of undeclared identifier '_mm_prefetch'
                        _mm_prefetch((const char*)toFree.back(), _MM_HINT_T0);
                        ^
2 errors generated.
ninja: build stopped: subcommand failed.
===> Compilation failed unexpectedly.
Try to set MAKE_JOBS_UNSAFE=yes and rebuild before reporting the failure to
the maintainer.
*** Error code 1

Stop.
make: stopped in /usr/ports/databases/foundationdb-devel
Received on Sun Jan 16 2022 - 14:30:33 UTC

Original text of this message