[package - 130arm64-default][graphics/dust3d] Failed for dust3d-1.0.0.r.6 in build

From: <pkg-fallout_at_FreeBSD.org>
Date: Sun, 16 Jan 2022 02:03:57 GMT
You are receiving this mail as a port that you maintain
is failing to build on the FreeBSD package build server.
Please investigate the failure and submit a PR to fix
build.

Maintainer:     danfe_at_FreeBSD.org
Log URL:        http://ampere1.nyi.freebsd.org/data/130arm64-default/a11d0355153c/logs/dust3d-1.0.0.r.6.log
Build URL:      http://ampere1.nyi.freebsd.org/build.html?mastername=130arm64-default&build=a11d0355153c
Log:

=>> Building graphics/dust3d
build started at Sun Jan 16 02:02:30 UTC 2022
port directory: /usr/ports/graphics/dust3d
package name: dust3d-1.0.0.r.6
building for: FreeBSD 130arm64-default-job-13 13.0-RELEASE-p5 FreeBSD 13.0-RELEASE-p5 arm64
maintained by: danfe_at_FreeBSD.org
Makefile ident: 
Poudriere version: 3.2.8-21-g883afb07
Host OSVERSION: 1400008
Jail OSVERSION: 1300139
Job Id: 13

---Begin Environment---
SHELL=/bin/csh
OSVERSION=1300139
UNAME_v=FreeBSD 13.0-RELEASE-p5
UNAME_r=13.0-RELEASE-p5
BLOCKSIZE=K
MAIL=/var/mail/root
MM_CHARSET=UTF-8
LANG=C.UTF-8
STATUS=1
HOME=/root
PATH=/sbin:/bin:/usr/sbin:/usr/bin:/usr/local/sbin:/usr/local/bin:/root/bin
LOCALBASE=/usr/local
USER=root
LIBEXECPREFIX=/usr/local/libexec/poudriere
POUDRIERE_VERSION=3.2.8-21-g883afb07
MASTERMNT=/usr/local/poudriere/data/.m/130arm64-default/ref
POUDRIERE_BUILD_TYPE=bulk
PACKAGE_BUILDING=yes
SAVED_TERM=
PWD=/usr/local/poudriere/data/.m/130arm64-default/ref/.p/pool
P_PORTS_FEATURES=FLAVORS SELECTED_OPTIONS
MASTERNAME=130arm64-default
SCRIPTPREFIX=/usr/local/share/poudriere
OLDPWD=/usr/local/poudriere/data/.m/130arm64-default/ref/.p
SCRIPTPATH=/usr/local/share/poudriere/bulk.sh
POUDRIEREPATH=/usr/local/bin/poudriere
---End Environment---

---Begin Poudriere Port Flags/Env---
PORT_FLAGS=
PKGENV=
FLAVOR=
DEPENDS_ARGS=
MAKE_ARGS=
---End Poudriere Port Flags/Env---

---Begin OPTIONS List---
---End OPTIONS List---

--MAINTAINER--
danfe_at_FreeBSD.org
--End MAINTAINER--

--CONFIGURE_ARGS--

--End CONFIGURE_ARGS--

--CONFIGURE_ENV--
MAKE=gmake QT_SELECT=qt5 QMAKEMODULES="/wrkdirs/usr/ports/graphics/dust3d/work/dust3d-1.0.0-rc.6/mkspecs/modules:/usr/local/lib/qt5/mkspecs/modules" XDG_DATA_HOME=/wrkdirs/usr/ports/graphics/dust3d/work  XDG_CONFIG_HOME=/wrkdirs/usr/ports/graphics/dust3d/work  XDG_CACHE_HOME=/wrkdirs/usr/ports/graphics/dust3d/work/.cache  HOME=/wrkdirs/usr/ports/graphics/dust3d/work TMPDIR="/tmp" PATH=/wrkdirs/usr/ports/graphics/dust3d/work/.bin:/sbin:/bin:/usr/sbin:/usr/bin:/usr/local/sbin:/usr/local/bin:/root/bin SHELL=/bin/sh CONFIG_SHELL=/bin/sh
--End CONFIGURE_ENV--

--MAKE_ENV--
QT_SELECT=qt5 QMAKEMODULES="/wrkdirs/usr/ports/graphics/dust3d/work/dust3d-1.0.0-rc.6/mkspecs/modules:/usr/local/lib/qt5/mkspecs/modules" XDG_DATA_HOME=/wrkdirs/usr/ports/graphics/dust3d/work  XDG_CONFIG_HOME=/wrkdirs/usr/ports/graphics/dust3d/work  XDG_CACHE_HOME=/wrkdirs/usr/ports/graphics/dust3d/work/.cache  HOME=/wrkdirs/usr/ports/graphics/dust3d/work TMPDIR="/tmp" PATH=/wrkdirs/usr/ports/graphics/dust3d/work/.bin:/sbin:/bin:/usr/sbin:/usr/bin:/usr/local/sbin:/usr/local/bin:/root/bin NO_PIE=yes MK_DEBUG_FILES=no MK_KERNEL_SYMBOLS=no SHELL=/bin/sh NO_LINT=YES PREFIX=/usr/local  LOCALBASE=/usr/local  CC="cc" CFLAGS="-O2 -pipe  -fstack-protector-strong -fno-strict-aliasing "  CPP="cpp" CPPFLAGS=""  LDFLAGS=" -fstack-protector-strong " LIBS=""  CXX="c++" CXXFLAGS="-O2 -pipe -fstack-protector-strong -fno-strict-aliasing  "  MANPREFIX="/usr/local" BSD_INSTALL_PROGRAM="install  -s -m 555"  BSD_INSTALL_LIB="install  -s -m 0644"  BSD_INSTALL_SCRIPT="install  -m 555"  BSD_INSTALL_DATA="ins
 tall  -m 0644"  BSD_INSTALL_MAN="install  -m 444"
--End MAKE_ENV--

--PLIST_SUB--
QT_BINDIR="lib/qt5/bin" QT_INCDIR="include/qt5" QT_LIBDIR="lib/qt5" QT_ARCHDIR="lib/qt5" QT_PLUGINDIR="lib/qt5/plugins" QT_LIBEXECDIR="libexec/qt5" QT_IMPORTDIR="lib/qt5/imports" QT_QMLDIR="lib/qt5/qml" QT_DATADIR="share/qt5" QT_DOCDIR="share/doc/qt5" QT_L10NDIR="share/qt5/translations" QT_EXAMPLEDIR="share/examples/qt5" QT_TESTDIR="share/qt5/tests" QT_MKSPECDIR="lib/qt5/mkspecs" OSREL=13.0 PREFIX=%D LOCALBASE=/usr/local  RESETPREFIX=/usr/local LIB32DIR=lib DOCSDIR="share/doc/dust3d"  EXAMPLESDIR="share/examples/dust3d"  DATADIR="share/dust3d"  WWWDIR="www/dust3d"  ETCDIR="etc/dust3d"
--End PLIST_SUB--

--SUB_LIST--
PREFIX=/usr/local LOCALBASE=/usr/local  DATADIR=/usr/local/share/dust3d DOCSDIR=/usr/local/share/doc/dust3d EXAMPLESDIR=/usr/local/share/examples/dust3d  WWWDIR=/usr/local/www/dust3d ETCDIR=/usr/local/etc/dust3d
--End SUB_LIST--

---Begin make.conf---
USE_PACKAGE_DEPENDS=yes
BATCH=yes
WRKDIRPREFIX=/wrkdirs
PORTSDIR=/usr/ports
PACKAGES=/packages
DISTDIR=/distfiles
PACKAGE_BUILDING=yes
PACKAGE_BUILDING_FLAVORS=yes
#### /usr/local/etc/poudriere.d/make.conf ####
# XXX: We really need this but cannot use it while 'make checksum' does not
# try the next mirror on checksum failure.  It currently retries the same
# failed mirror and then fails rather then trying another.  It *does*
# try the next if the size is mismatched though.
#MASTER_SITE_FREEBSD=yes
# Build ALLOW_MAKE_JOBS_PACKAGES with 2 jobs
MAKE_JOBS_NUMBER=2
#### /usr/ports/Mk/Scripts/ports_env.sh ####
_CCVERSION_921dbbb2=FreeBSD clang version 11.0.1 (git_at_github.com:llvm/llvm-project.git llvmorg-11.0.1-0-g43ff75f2c3fe) Target: aarch64-unknown-freebsd13.0 Thread model: posix InstalledDir: /usr/bin
_ALTCCVERSION_921dbbb2=none
_CXXINTERNAL_acaad9ca=FreeBSD clang version 11.0.1 (git_at_github.com:llvm/llvm-project.git llvmorg-11.0.1-0-g43ff75f2c3fe) Target: aarch64-unknown-freebsd13.0 Thread model: posix InstalledDir: /usr/bin "/usr/bin/ld" "--eh-frame-hdr" "-dynamic-linker" "/libexec/ld-elf.so.1" "--enable-new-dtags" "-o" "a.out" "/usr/lib/crt1.o" "/usr/lib/crti.o" "/usr/lib/crtbegin.o" "-L/usr/lib" "/dev/null" "-lc++" "-lm" "-lgcc" "--as-needed" "-lgcc_s" "--no-as-needed" "-lc" "-lgcc" "--as-needed" "-lgcc_s" "--no-as-needed" "/usr/lib/crtend.o" "/usr/lib/crtn.o"
CC_OUTPUT_921dbbb2_58173849=yes
CC_OUTPUT_921dbbb2_9bdba57c=yes
CC_OUTPUT_921dbbb2_6a4fe7f5=yes
CC_OUTPUT_921dbbb2_6bcac02b=yes
CC_OUTPUT_921dbbb2_67d20829=yes
CC_OUTPUT_921dbbb2_bfa62e83=yes
CC_OUTPUT_921dbbb2_f0b4d593=yes
CC_OUTPUT_921dbbb2_308abb44=yes
CC_OUTPUT_921dbbb2_f00456e5=yes
CC_OUTPUT_921dbbb2_65ad290d=yes
CC_OUTPUT_921dbbb2_f2776b26=yes
CC_OUTPUT_921dbbb2_b2657cc3=yes
CC_OUTPUT_921dbbb2_380987f7=yes
CC_OUTPUT_921dbbb2_160933ec=yes
CC_OUTPUT_921dbbb2_fb62803b=yes
_OBJC_CCVERSION_921dbbb2=FreeBSD clang version 11.0.1 (git_at_github.com:llvm/llvm-project.git llvmorg-11.0.1-0-g43ff75f2c3fe) Target: aarch64-unknown-freebsd13.0 Thread model: posix InstalledDir: /usr/bin
_OBJC_ALTCCVERSION_921dbbb2=none
ARCH=aarch64
OPSYS=FreeBSD
_OSRELEASE=13.0-RELEASE-p5
OSREL=13.0
OSVERSION=1300139
PYTHONBASE=/usr/local
CONFIGURE_MAX_CMD_LEN=524288
HAVE_PORTS_ENV=1
#### Misc Poudriere ####
GID=0
UID=0
---End make.conf---
--Resource limits--
cpu time               (seconds, -t)  unlimited
file size           (512-blocks, -f)  unlimited
data seg size           (kbytes, -d)  1048576
stack size              (kbytes, -s)  1048576
core file size      (512-blocks, -c)  unlimited
max memory size         (kbytes, -m)  unlimited
locked memory           (kbytes, -l)  unlimited
max user processes              (-u)  89999
open files                      (-n)  1024
virtual mem size        (kbytes, -v)  unlimited
swap limit              (kbytes, -w)  unlimited
socket buffer size       (bytes, -b)  unlimited
pseudo-terminals                (-p)  unlimited
kqueues                         (-k)  unlimited
umtx shared locks               (-o)  unlimited
--End resource limits--
=======================<phase: check-sanity   >============================
dust3d-1.0.0.r.6: Makefile warning: in desktop entry #1 (dust3d): category Application is not a valid desktop category
dust3d-1.0.0.r.6: Makefile warning: in desktop entry #1 (dust3d): field 5 (Categories) must contain at least one main desktop category (make -VDESKTOP_CATEGORIES_MAIN)
===>  License MIT accepted by the user
===========================================================================
=======================<phase: pkg-depends    >============================
===>   dust3d-1.0.0.r.6 depends on file: /usr/local/sbin/pkg - not found
===>   Installing existing package /packages/All/pkg-1.17.5.pkg
[130arm64-default-job-13] Installing pkg-1.17.5...
[130arm64-default-job-13] Extracting pkg-1.17.5: .......... done
===>   dust3d-1.0.0.r.6 depends on file: /usr/local/sbin/pkg - found
===>   Returning to build of dust3d-1.0.0.r.6
===========================================================================
=======================<phase: fetch-depends  >============================
===========================================================================
=======================<phase: fetch          >============================
dust3d-1.0.0.r.6: Makefile warning: in desktop entry #1 (dust3d): category Application is not a valid desktop category
dust3d-1.0.0.r.6: Makefile warning: in desktop entry #1 (dust3d): field 5 (Categories) must contain at least one main desktop category (make -VDESKTOP_CATEGORIES_MAIN)
===>  License MIT accepted by the user
===> Fetching all distfiles required by dust3d-1.0.0.r.6 for building
===========================================================================
=======================<phase: checksum       >============================
dust3d-1.0.0.r.6: Makefile warning: in desktop entry #1 (dust3d): category Application is not a valid desktop category
dust3d-1.0.0.r.6: Makefile warning: in desktop entry #1 (dust3d): field 5 (Categories) must contain at least one main desktop category (make -VDESKTOP_CATEGORIES_MAIN)
===>  License MIT accepted by the user
===> Fetching all distfiles required by dust3d-1.0.0.r.6 for building
=> SHA256 Checksum OK for huxingyi-dust3d-1.0.0-rc.6_GH0.tar.gz.
=> SHA256 Checksum OK for f8339d25ddb79f893413.diff.
=> SHA256 Checksum OK for 821285de824baf01ae99.diff.
===========================================================================
=======================<phase: extract-depends>============================
===========================================================================
=======================<phase: extract        >============================
dust3d-1.0.0.r.6: Makefile warning: in desktop entry #1 (dust3d): category Application is not a valid desktop category
dust3d-1.0.0.r.6: Makefile warning: in desktop entry #1 (dust3d): field 5 (Categories) must contain at least one main desktop category (make -VDESKTOP_CATEGORIES_MAIN)
===>  License MIT accepted by the user
===> Fetching all distfiles required by dust3d-1.0.0.r.6 for building
===>  Extracting for dust3d-1.0.0.r.6
=> SHA256 Checksum OK for huxingyi-dust3d-1.0.0-rc.6_GH0.tar.gz.
=> SHA256 Checksum OK for f8339d25ddb79f893413.diff.
=> SHA256 Checksum OK for 821285de824baf01ae99.diff.
===========================================================================
=======================<phase: patch-depends  >============================
===========================================================================
=======================<phase: patch          >============================
===>  Patching for dust3d-1.0.0.r.6
===>  Applying distribution patches for dust3d-1.0.0.r.6
===>  Applying FreeBSD patches for dust3d-1.0.0.r.6 from /usr/ports/graphics/dust3d/files
===========================================================================
=======================<phase: build-depends  >============================
===>   dust3d-1.0.0.r.6 depends on file: /usr/local/include/boost/config.hpp - not found
===>   Installing existing package /packages/All/boost-libs-1.72.0_6.pkg
[130arm64-default-job-13] Installing boost-libs-1.72.0_6...
[130arm64-default-job-13] `-- Installing icu-70.1_1,1...
[130arm64-default-job-13] `-- Extracting icu-70.1_1,1: .......... done
[130arm64-default-job-13] Extracting boost-libs-1.72.0_6: .......... done
<snip>
[130arm64-default-job-13] |   `-- Installing dejavu-2.37_1...
[130arm64-default-job-13] |   | `-- Installing mkfontscale-1.2.1...
[130arm64-default-job-13] |   |   `-- Installing libfontenc-1.1.4...
[130arm64-default-job-13] |   |   `-- Extracting libfontenc-1.1.4: ......... done
[130arm64-default-job-13] |   | `-- Extracting mkfontscale-1.2.1: ....... done
[130arm64-default-job-13] |   `-- Extracting dejavu-2.37_1: .......... done
[130arm64-default-job-13] |   `-- Installing font-bh-ttf-1.0.3_4...
[130arm64-default-job-13] |   `-- Extracting font-bh-ttf-1.0.3_4: .......... done
[130arm64-default-job-13] |   `-- Installing font-misc-ethiopic-1.0.4...
[130arm64-default-job-13] |   `-- Extracting font-misc-ethiopic-1.0.4: ...... done
[130arm64-default-job-13] |   `-- Installing font-misc-meltho-1.0.3_4...
[130arm64-default-job-13] |   `-- Extracting font-misc-meltho-1.0.3_4: .......... done
[130arm64-default-job-13] Extracting qt5-gui-5.15.2p263: .......... done
=====
Message from freetype2-2.11.1:

--
The 2.7.x series now uses the new subpixel hinting mode (V40 port's option) as
the default, emulating a modern version of ClearType. This change inevitably
leads to different rendering results, and you might change port's options to
adapt it to your taste (or use the new "FREETYPE_PROPERTIES" environment
variable).

The environment variable "FREETYPE_PROPERTIES" can be used to control the
driver properties. Example:

FREETYPE_PROPERTIES=truetype:interpreter-version=35 \
	cff:no-stem-darkening=1 \
	autofitter:warping=1

This allows to select, say, the subpixel hinting mode at runtime for a given
application.

If LONG_PCF_NAMES port's option was enabled, the PCF family names may include
the foundry and information whether they contain wide characters. For example,
"Sony Fixed" or "Misc Fixed Wide", instead of "Fixed". This can be disabled at
run time with using pcf:no-long-family-names property, if needed. Example:

FREETYPE_PROPERTIES=pcf:no-long-family-names=1

How to recreate fontconfig cache with using such environment variable,
if needed:
# env FREETYPE_PROPERTIES=pcf:no-long-family-names=1 fc-cache -fsv

The controllable properties are listed in the section "Controlling FreeType
Modules" in the reference's table of contents
(/usr/local/share/doc/freetype2/reference/index.html, if documentation was installed).
=====
Message from wayland-1.20.0:

--
Wayland requires XDG_RUNTIME_DIR to be defined to a path that will
contain "wayland-%d" unix(4) sockets. This is usually handled by
consolekit2 (via ck-launch-session) or pam_xdg (via login).
=====
Message from libxkbcommon-1.3.1:

--
If arrow keys don't work under X11 switch to legacy rules e.g.,

For sh/bash/ksh/zsh run and (optionally) add into ~/.profile:
  export XKB_DEFAULT_RULES=xorg

For csh/tcsh run and (optionally) add into ~/.login:
  setenv XKB_DEFAULT_RULES xorg
=====
Message from dejavu-2.37_1:

--
Make sure that the freetype module is loaded.  If it is not, add the following
line to the "Modules" section of your X Windows configuration file:

	Load "freetype"

Add the following line to the "Files" section of X Windows configuration file:

	FontPath "/usr/local/share/fonts/dejavu/"

Note: your X Windows configuration file is typically /etc/X11/XF86Config
if you are using XFree86, and /etc/X11/xorg.conf if you are using X.Org.
===>   dust3d-1.0.0.r.6 depends on shared library: libQt5Gui.so - found (/usr/local/lib/qt5/libQt5Gui.so)
===>   Returning to build of dust3d-1.0.0.r.6
===>   dust3d-1.0.0.r.6 depends on shared library: libQt5Network.so - found (/usr/local/lib/qt5/libQt5Network.so)
===>   dust3d-1.0.0.r.6 depends on shared library: libQt5OpenGL.so - not found
===>   Installing existing package /packages/All/qt5-opengl-5.15.2p263.pkg
[130arm64-default-job-13] Installing qt5-opengl-5.15.2p263...
[130arm64-default-job-13] `-- Installing qt5-widgets-5.15.2p263...
[130arm64-default-job-13] `-- Extracting qt5-widgets-5.15.2p263: .......... done
[130arm64-default-job-13] Extracting qt5-opengl-5.15.2p263: .......... done
===>   dust3d-1.0.0.r.6 depends on shared library: libQt5OpenGL.so - found (/usr/local/lib/qt5/libQt5OpenGL.so)
===>   Returning to build of dust3d-1.0.0.r.6
===>   dust3d-1.0.0.r.6 depends on shared library: libQt5Widgets.so - found (/usr/local/lib/qt5/libQt5Widgets.so)
===========================================================================
=======================<phase: configure      >============================
===>  Configuring for dust3d-1.0.0.r.6
cd /wrkdirs/usr/ports/graphics/dust3d/work/dust3d-1.0.0-rc.6 &&  /usr/local/lib/qt5/bin/qmake 
Info: creating stash file /wrkdirs/usr/ports/graphics/dust3d/work/dust3d-1.0.0-rc.6/.qmake.stash
Updating '/wrkdirs/usr/ports/graphics/dust3d/work/dust3d-1.0.0-rc.6/languages/dust3d_zh_CN.qm'...
Removing translations equal to source text in '/wrkdirs/usr/ports/graphics/dust3d/work/dust3d-1.0.0-rc.6/languages/dust3d_zh_CN.qm'...
    Generated 306 translation(s) (306 finished and 0 unfinished)
Updating '/wrkdirs/usr/ports/graphics/dust3d/work/dust3d-1.0.0-rc.6/languages/dust3d_es_AR.qm'...
Removing translations equal to source text in '/wrkdirs/usr/ports/graphics/dust3d/work/dust3d-1.0.0-rc.6/languages/dust3d_es_AR.qm'...
    Generated 297 translation(s) (297 finished and 0 unfinished)
    Ignored 12 untranslated source text(s)
Updating '/wrkdirs/usr/ports/graphics/dust3d/work/dust3d-1.0.0-rc.6/languages/dust3d_it_IT.qm'...
Removing translations equal to source text in '/wrkdirs/usr/ports/graphics/dust3d/work/dust3d-1.0.0-rc.6/languages/dust3d_it_IT.qm'...
    Generated 147 translation(s) (90 finished and 57 unfinished)
    Ignored 162 untranslated source text(s)
===========================================================================
=======================<phase: build          >============================
===>  Building for dust3d-1.0.0.r.6
cd /wrkdirs/usr/ports/graphics/dust3d/work/dust3d-1.0.0-rc.6/thirdparty/instant-meshes && cmake -B build
CMake Deprecation Warning at CMakeLists.txt:1 (cmake_minimum_required):
  Compatibility with CMake < 2.8.12 will be removed from a future version of
  CMake.

  Update the VERSION argument <min> value or use a ...<max> suffix to tell
  CMake that the project does not need compatibility with older versions.


-- The C compiler identification is Clang 11.0.1
-- The CXX compiler identification is Clang 11.0.1
-- Detecting C compiler ABI info
-- Detecting C compiler ABI info - done
-- Check for working C compiler: /usr/bin/cc - skipped
-- Detecting C compile features
-- Detecting C compile features - done
-- Detecting CXX compiler ABI info
-- Detecting CXX compiler ABI info - done
-- Check for working CXX compiler: /usr/bin/c++ - skipped
-- Detecting CXX compile features
-- Detecting CXX compile features - done
-- Setting build type to 'Release' as none was specified.
CMake Deprecation Warning at instant-meshes-dust3d/ext/tbb/CMakeLists.txt:1 (cmake_minimum_required):
  Compatibility with CMake < 2.8.12 will be removed from a future version of
  CMake.

  Update the VERSION argument <min> value or use a ...<max> suffix to tell
  CMake that the project does not need compatibility with older versions.


-- Performing Test SUPPORTS_STDCXX11
-- Performing Test SUPPORTS_STDCXX11 - Success
-- Performing Test SUPPORTS_MRTM
-- Performing Test SUPPORTS_MRTM - Success
-- Configuring done
-- Generating done
-- Build files have been written to: /wrkdirs/usr/ports/graphics/dust3d/work/dust3d-1.0.0-rc.6/thirdparty/instant-meshes/build
gmake -C /wrkdirs/usr/ports/graphics/dust3d/work/dust3d-1.0.0-rc.6/thirdparty/instant-meshes/build
gmake[1]: Entering directory '/wrkdirs/usr/ports/graphics/dust3d/work/dust3d-1.0.0-rc.6/thirdparty/instant-meshes/build'
gmake[2]: Entering directory '/wrkdirs/usr/ports/graphics/dust3d/work/dust3d-1.0.0-rc.6/thirdparty/instant-meshes/build'
gmake[3]: Entering directory '/wrkdirs/usr/ports/graphics/dust3d/work/dust3d-1.0.0-rc.6/thirdparty/instant-meshes/build'
gmake[3]: Leaving directory '/wrkdirs/usr/ports/graphics/dust3d/work/dust3d-1.0.0-rc.6/thirdparty/instant-meshes/build'
gmake[3]: Entering directory '/wrkdirs/usr/ports/graphics/dust3d/work/dust3d-1.0.0-rc.6/thirdparty/instant-meshes/build'
[  1%] Building CXX object ext_build/tbb/CMakeFiles/tbb_static.dir/src/old/concurrent_queue_v2.cpp.o
c++: warning: argument unused during compilation: '-mrtm' [-Wunused-command-line-argument]
[  3%] Building CXX object ext_build/tbb/CMakeFiles/tbb_static.dir/src/old/concurrent_vector_v2.cpp.o
c++: warning: argument unused during compilation: '-mrtm' [-Wunused-command-line-argument]
[  5%] Building CXX object ext_build/tbb/CMakeFiles/tbb_static.dir/src/old/spin_rw_mutex_v2.cpp.o
c++: warning: argument unused during compilation: '-mrtm' [-Wunused-command-line-argument]
[  7%] Building CXX object ext_build/tbb/CMakeFiles/tbb_static.dir/src/old/task_v2.cpp.o
c++: warning: argument unused during compilation: '-mrtm' [-Wunused-command-line-argument]
[  9%] Building CXX object ext_build/tbb/CMakeFiles/tbb_static.dir/src/tbb/arena.cpp.o
c++: warning: argument unused during compilation: '-mrtm' [-Wunused-command-line-argument]
[ 11%] Building CXX object ext_build/tbb/CMakeFiles/tbb_static.dir/src/tbb/cache_aligned_allocator.cpp.o
c++: warning: argument unused during compilation: '-mrtm' [-Wunused-command-line-argument]
[ 12%] Building CXX object ext_build/tbb/CMakeFiles/tbb_static.dir/src/tbb/concurrent_hash_map.cpp.o
c++: warning: argument unused during compilation: '-mrtm' [-Wunused-command-line-argument]
[ 14%] Building CXX object ext_build/tbb/CMakeFiles/tbb_static.dir/src/tbb/concurrent_monitor.cpp.o
c++: warning: argument unused during compilation: '-mrtm' [-Wunused-command-line-argument]
[ 16%] Building CXX object ext_build/tbb/CMakeFiles/tbb_static.dir/src/tbb/concurrent_queue.cpp.o
c++: warning: argument unused during compilation: '-mrtm' [-Wunused-command-line-argument]
[ 18%] Building CXX object ext_build/tbb/CMakeFiles/tbb_static.dir/src/tbb/concurrent_vector.cpp.o
c++: warning: argument unused during compilation: '-mrtm' [-Wunused-command-line-argument]
[ 20%] Building CXX object ext_build/tbb/CMakeFiles/tbb_static.dir/src/tbb/condition_variable.cpp.o
c++: warning: argument unused during compilation: '-mrtm' [-Wunused-command-line-argument]
[ 22%] Building CXX object ext_build/tbb/CMakeFiles/tbb_static.dir/src/tbb/critical_section.cpp.o
c++: warning: argument unused during compilation: '-mrtm' [-Wunused-command-line-argument]
[ 24%] Building CXX object ext_build/tbb/CMakeFiles/tbb_static.dir/src/tbb/dynamic_link.cpp.o
c++: warning: argument unused during compilation: '-mrtm' [-Wunused-command-line-argument]
[ 25%] Building CXX object ext_build/tbb/CMakeFiles/tbb_static.dir/src/tbb/governor.cpp.o
c++: warning: argument unused during compilation: '-mrtm' [-Wunused-command-line-argument]
[ 27%] Building CXX object ext_build/tbb/CMakeFiles/tbb_static.dir/src/tbb/itt_notify.cpp.o
c++: warning: argument unused during compilation: '-mrtm' [-Wunused-command-line-argument]
In file included from /wrkdirs/usr/ports/graphics/dust3d/work/dust3d-1.0.0-rc.6/thirdparty/instant-meshes/instant-meshes-dust3d/ext/tbb/src/tbb/itt_notify.cpp:47:
In file included from /wrkdirs/usr/ports/graphics/dust3d/work/dust3d-1.0.0-rc.6/thirdparty/instant-meshes/instant-meshes-dust3d/ext/tbb/src/tbb/tools_api/ittnotify_static.c:21:
/wrkdirs/usr/ports/graphics/dust3d/work/dust3d-1.0.0-rc.6/thirdparty/instant-meshes/instant-meshes-dust3d/ext/tbb/src/tbb/tools_api/ittnotify_config.h:329:12: error: use of undeclared identifier '__TBB_machine_fetchadd4'
    return __TBB_machine_fetchadd4(ptr, 1) + 1L;
           ^
1 error generated.
gmake[3]: *** [ext_build/tbb/CMakeFiles/tbb_static.dir/build.make:272: ext_build/tbb/CMakeFiles/tbb_static.dir/src/tbb/itt_notify.cpp.o] Error 1
gmake[3]: Leaving directory '/wrkdirs/usr/ports/graphics/dust3d/work/dust3d-1.0.0-rc.6/thirdparty/instant-meshes/build'
gmake[2]: *** [CMakeFiles/Makefile2:153: ext_build/tbb/CMakeFiles/tbb_static.dir/all] Error 2
gmake[2]: Leaving directory '/wrkdirs/usr/ports/graphics/dust3d/work/dust3d-1.0.0-rc.6/thirdparty/instant-meshes/build'
gmake[1]: *** [Makefile:136: all] Error 2
gmake[1]: Leaving directory '/wrkdirs/usr/ports/graphics/dust3d/work/dust3d-1.0.0-rc.6/thirdparty/instant-meshes/build'
*** Error code 2

Stop.
make: stopped in /usr/ports/graphics/dust3d
Received on Sun Jan 16 2022 - 02:03:57 UTC

Original text of this message