[package - 130releng-armv7-quarterly][databases/leofs] Failed for leofs-1.4.3_1 in build

From: <pkg-fallout_at_FreeBSD.org>
Date: Fri, 12 Aug 2022 23:07:44 UTC
You are receiving this mail as a port that you maintain
is failing to build on the FreeBSD package build server.
Please investigate the failure and submit a PR to fix
build.

Maintainer:     trociny@FreeBSD.org
Log URL:        http://ampere1.nyi.freebsd.org/data/130releng-armv7-quarterly/0d6afdedd754/logs/leofs-1.4.3_1.log
Build URL:      http://ampere1.nyi.freebsd.org/build.html?mastername=130releng-armv7-quarterly&build=0d6afdedd754
Log:

=>> Building databases/leofs
build started at Fri Aug 12 23:06:41 UTC 2022
port directory: /usr/ports/databases/leofs
package name: leofs-1.4.3_1
building for: FreeBSD 130releng-armv7-quarterly-job-09 13.0-RELEASE-p11 FreeBSD 13.0-RELEASE-p11 1300139 arm
maintained by: trociny@FreeBSD.org
Makefile ident: 
Poudriere version: 3.2.8-21-g883afb07
Host OSVERSION: 1400063
Jail OSVERSION: 1300139
Job Id: 09

---Begin Environment---
SHELL=/bin/csh
OSVERSION=1300139
UNAME_v=FreeBSD 13.0-RELEASE-p11 1300139
UNAME_r=13.0-RELEASE-p11
BLOCKSIZE=K
MAIL=/var/mail/root
MM_CHARSET=UTF-8
LANG=C.UTF-8
STATUS=1
HOME=/root
PATH=/sbin:/bin:/usr/sbin:/usr/bin:/usr/local/sbin:/usr/local/bin:/root/bin
LOCALBASE=/usr/local
USER=root
LIBEXECPREFIX=/usr/local/libexec/poudriere
POUDRIERE_VERSION=3.2.8-21-g883afb07
MASTERMNT=/usr/local/poudriere/data/.m/130releng-armv7-quarterly/ref
POUDRIERE_BUILD_TYPE=bulk
PACKAGE_BUILDING=yes
SAVED_TERM=
PWD=/usr/local/poudriere/data/.m/130releng-armv7-quarterly/ref/.p/pool
P_PORTS_FEATURES=FLAVORS SELECTED_OPTIONS
MASTERNAME=130releng-armv7-quarterly
SCRIPTPREFIX=/usr/local/share/poudriere
OLDPWD=/usr/local/poudriere/data/.m/130releng-armv7-quarterly/ref/.p
SCRIPTPATH=/usr/local/share/poudriere/bulk.sh
POUDRIEREPATH=/usr/local/bin/poudriere
---End Environment---

---Begin Poudriere Port Flags/Env---
PORT_FLAGS=
PKGENV=
FLAVOR=
DEPENDS_ARGS=
MAKE_ARGS=
---End Poudriere Port Flags/Env---

---Begin OPTIONS List---
---End OPTIONS List---

--MAINTAINER--
trociny@FreeBSD.org
--End MAINTAINER--

--CONFIGURE_ARGS--

--End CONFIGURE_ARGS--

--CONFIGURE_ENV--
MAKE=gmake PKG_CONFIG=pkgconf XDG_DATA_HOME=/wrkdirs/usr/ports/databases/leofs/work  XDG_CONFIG_HOME=/wrkdirs/usr/ports/databases/leofs/work  XDG_CACHE_HOME=/wrkdirs/usr/ports/databases/leofs/work/.cache  HOME=/wrkdirs/usr/ports/databases/leofs/work TMPDIR="/tmp" PKG_CONFIG_LIBDIR=/wrkdirs/usr/ports/databases/leofs/work/.pkgconfig:/usr/local/libdata/pkgconfig:/usr/libdata/pkgconfig SHELL=/bin/sh CONFIG_SHELL=/bin/sh
--End CONFIGURE_ENV--

--MAKE_ENV--
PATH=/usr/local/lib/erlang21/bin:/wrkdirs/usr/ports/databases/leofs/work/.bin:/sbin:/bin:/usr/sbin:/usr/bin:/usr/local/sbin:/usr/local/bin:/root/bin OPENSSLBASE=/usr OPENSSLDIR=/etc/ssl OPENSSLINC=/usr/include OPENSSLLIB=/usr/lib XDG_DATA_HOME=/wrkdirs/usr/ports/databases/leofs/work  XDG_CONFIG_HOME=/wrkdirs/usr/ports/databases/leofs/work  XDG_CACHE_HOME=/wrkdirs/usr/ports/databases/leofs/work/.cache  HOME=/wrkdirs/usr/ports/databases/leofs/work TMPDIR="/tmp" PKG_CONFIG_LIBDIR=/wrkdirs/usr/ports/databases/leofs/work/.pkgconfig:/usr/local/libdata/pkgconfig:/usr/libdata/pkgconfig NO_PIE=yes MK_DEBUG_FILES=no MK_KERNEL_SYMBOLS=no SHELL=/bin/sh NO_LINT=YES PREFIX=/usr/local  LOCALBASE=/usr/local  CC="cc" CFLAGS="-O2 -pipe  -fstack-protector-strong -fno-strict-aliasing "  CPP="cpp" CPPFLAGS=""  LDFLAGS="  -fstack-protector-strong " LIBS=""  CXX="c++" CXXFLAGS="-O2 -pipe -fstack-protector-strong -fno-strict-aliasing  "  MANPREFIX="/usr/local" BSD_INSTALL_PROGRAM="install  -s -m 555"  BSD_I
 NSTALL_LIB="install  -s -m 0644"  BSD_INSTALL_SCRIPT="install  -m 555"  BSD_INSTALL_DATA="install  -m 0644"  BSD_INSTALL_MAN="install  -m 444"
--End MAKE_ENV--

--PLIST_SUB--
LEOFS_USER=leofs  LEOFS_GROUP=leofs  LEOFS_DBDIR=/var/db/leofs  LEOFS_LOGDIR=/var/log/leofs  LEOFS_RUNDIR=/var/run/leofs OSREL=13.0 PREFIX=%D LOCALBASE=/usr/local  RESETPREFIX=/usr/local LIB32DIR=lib DOCSDIR="share/doc/leofs"  EXAMPLESDIR="share/examples/leofs"  DATADIR="share/leofs"  WWWDIR="www/leofs"  ETCDIR="etc/leofs"
--End PLIST_SUB--

--SUB_LIST--
LEOFS_USER=leofs  LEOFS_GROUP=leofs  LEOFS_ETCDIR=/usr/local/etc/leofs  LEOFS_BASEDIR=/usr/local/lib/leofs  LEOFS_DBDIR=/var/db/leofs  LEOFS_LOGDIR=/var/log/leofs  LEOFS_RUNDIR=/var/run/leofs PREFIX=/usr/local LOCALBASE=/usr/local  DATADIR=/usr/local/share/leofs DOCSDIR=/usr/local/share/doc/leofs EXAMPLESDIR=/usr/local/share/examples/leofs  WWWDIR=/usr/local/www/leofs ETCDIR=/usr/local/etc/leofs
--End SUB_LIST--

---Begin make.conf---
USE_PACKAGE_DEPENDS=yes
BATCH=yes
WRKDIRPREFIX=/wrkdirs
PORTSDIR=/usr/ports
PACKAGES=/packages
DISTDIR=/distfiles
PACKAGE_BUILDING=yes
PACKAGE_BUILDING_FLAVORS=yes
#### /usr/local/etc/poudriere.d/make.conf ####
# XXX: We really need this but cannot use it while 'make checksum' does not
# try the next mirror on checksum failure.  It currently retries the same
# failed mirror and then fails rather then trying another.  It *does*
# try the next if the size is mismatched though.
#MASTER_SITE_FREEBSD=yes
# Build ALLOW_MAKE_JOBS_PACKAGES with 2 jobs
MAKE_JOBS_NUMBER=2
#### /usr/ports/Mk/Scripts/ports_env.sh ####
_CCVERSION_921dbbb2=FreeBSD clang version 11.0.1 (git@github.com:llvm/llvm-project.git llvmorg-11.0.1-0-g43ff75f2c3fe) Target: armv7-unknown-freebsd13.0-gnueabihf Thread model: posix InstalledDir: /usr/bin
_ALTCCVERSION_921dbbb2=none
_CXXINTERNAL_acaad9ca=FreeBSD clang version 11.0.1 (git@github.com:llvm/llvm-project.git llvmorg-11.0.1-0-g43ff75f2c3fe) Target: armv7-unknown-freebsd13.0-gnueabihf Thread model: posix InstalledDir: /usr/bin "/usr/bin/ld" "--eh-frame-hdr" "-dynamic-linker" "/libexec/ld-elf.so.1" "--hash-style=both" "--enable-new-dtags" "-o" "a.out" "/usr/lib/crt1.o" "/usr/lib/crti.o" "/usr/lib/crtbegin.o" "-L/usr/lib" "/dev/null" "-lc++" "-lm" "-lgcc" "--as-needed" "-lgcc_s" "--no-as-needed" "-lc" "-lgcc" "--as-needed" "-lgcc_s" "--no-as-needed" "/usr/lib/crtend.o" "/usr/lib/crtn.o"
CC_OUTPUT_921dbbb2_58173849=yes
CC_OUTPUT_921dbbb2_9bdba57c=yes
CC_OUTPUT_921dbbb2_6a4fe7f5=yes
CC_OUTPUT_921dbbb2_6bcac02b=yes
CC_OUTPUT_921dbbb2_67d20829=yes
CC_OUTPUT_921dbbb2_bfa62e83=yes
CC_OUTPUT_921dbbb2_f0b4d593=yes
CC_OUTPUT_921dbbb2_308abb44=yes
CC_OUTPUT_921dbbb2_f00456e5=yes
CC_OUTPUT_921dbbb2_65ad290d=yes
CC_OUTPUT_921dbbb2_f2776b26=yes
CC_OUTPUT_921dbbb2_b2657cc3=yes
CC_OUTPUT_921dbbb2_380987f7=yes
CC_OUTPUT_921dbbb2_160933ec=yes
CC_OUTPUT_921dbbb2_fb62803b=yes
_OBJC_CCVERSION_921dbbb2=FreeBSD clang version 11.0.1 (git@github.com:llvm/llvm-project.git llvmorg-11.0.1-0-g43ff75f2c3fe) Target: armv7-unknown-freebsd13.0-gnueabihf Thread model: posix InstalledDir: /usr/bin
_OBJC_ALTCCVERSION_921dbbb2=none
ARCH=armv7
OPSYS=FreeBSD
_OSRELEASE=13.0-RELEASE-p11
OSREL=13.0
OSVERSION=1300139
PYTHONBASE=/usr/local
CONFIGURE_MAX_CMD_LEN=524288
HAVE_PORTS_ENV=1
#### Misc Poudriere ####
GID=0
UID=0
---End make.conf---
--Resource limits--
cpu time               (seconds, -t)  unlimited
file size           (512-blocks, -f)  unlimited
data seg size           (kbytes, -d)  1048576
stack size              (kbytes, -s)  1048576
core file size      (512-blocks, -c)  unlimited
max memory size         (kbytes, -m)  unlimited
locked memory           (kbytes, -l)  unlimited
max user processes              (-u)  89999
open files                      (-n)  1024
virtual mem size        (kbytes, -v)  unlimited
swap limit              (kbytes, -w)  unlimited
socket buffer size       (bytes, -b)  unlimited
pseudo-terminals                (-p)  unlimited
kqueues                         (-k)  unlimited
umtx shared locks               (-o)  unlimited
--End resource limits--
=======================<phase: check-sanity   >============================
===>  License APACHE20 accepted by the user
===========================================================================
=======================<phase: pkg-depends    >============================
===>   leofs-1.4.3_1 depends on file: /usr/local/sbin/pkg - not found
===>   Installing existing package /packages/All/pkg-1.18.3.pkg
[130releng-armv7-quarterly-job-09] Installing pkg-1.18.3...
[130releng-armv7-quarterly-job-09] Extracting pkg-1.18.3: .......... done
===>   leofs-1.4.3_1 depends on file: /usr/local/sbin/pkg - found
===>   Returning to build of leofs-1.4.3_1
===========================================================================
=======================<phase: fetch-depends  >============================
===========================================================================
=======================<phase: fetch          >============================
===>  License APACHE20 accepted by the user
===> Fetching all distfiles required by leofs-1.4.3_1 for building
===========================================================================
=======================<phase: checksum       >============================
===>  License APACHE20 accepted by the user
===> Fetching all distfiles required by leofs-1.4.3_1 for building
=> SHA256 Checksum OK for leofs/leo-project-leofs-1.4.3_GH0.tar.gz.
=> SHA256 Checksum OK for leofs/DeadZen-goldrush-0.1.9_GH0.tar.gz.
=> SHA256 Checksum OK for leofs/davisp-jiffy-0.15.2_GH0.tar.gz.
=> SHA256 Checksum OK for leofs/eproxus-meck-0.8.12_GH0.tar.gz.
=> SHA256 Checksum OK for leofs/erlangpack-bcrypt-1.0.1_GH0.tar.gz.
=> SHA256 Checksum OK for leofs/esl-elarm-5885c90_GH0.tar.gz.
=> SHA256 Checksum OK for leofs/ferd-recon-2.3.1_GH0.tar.gz.
=> SHA256 Checksum OK for leofs/leo-project-bear-0.8.2-for-leofs_GH0.tar.gz.
=> SHA256 Checksum OK for leofs/leo-project-cowboy-for-leofs-1.4_GH0.tar.gz.
=> SHA256 Checksum OK for leofs/leo-project-eleveldb-2.0.37_GH0.tar.gz.
=> SHA256 Checksum OK for leofs/leo-project-erlpass-612f487_GH0.tar.gz.
=> SHA256 Checksum OK for leofs/leo-project-erpcgen-0.2.7_GH0.tar.gz.
=> SHA256 Checksum OK for leofs/leo-project-folsom-0.8.2.3_GH0.tar.gz.
=> SHA256 Checksum OK for leofs/leo-project-lager-574d64a_GH0.tar.gz.
=> SHA256 Checksum OK for leofs/leo-project-leo_backend_db-1.2.31_GH0.tar.gz.
=> SHA256 Checksum OK for leofs/leo-project-leo_cache-0.8.12_GH0.tar.gz.
=> SHA256 Checksum OK for leofs/leo-project-leo_commons-1.2.1_GH0.tar.gz.
=> SHA256 Checksum OK for leofs/leo-project-leo_dcerl-0.4.11_GH0.tar.gz.
=> SHA256 Checksum OK for leofs/leo-project-leo_logger-1.3.8_GH0.tar.gz.
=> SHA256 Checksum OK for leofs/leo-project-leo_mcerl-0.6.9_GH0.tar.gz.
=> SHA256 Checksum OK for leofs/leo-project-leo_mq-1.5.19_GH0.tar.gz.
=> SHA256 Checksum OK for leofs/leo-project-leo_object_storage-1.3.38_GH0.tar.gz.
=> SHA256 Checksum OK for leofs/leo-project-leo_ordning_reda-1.2.11_GH0.tar.gz.
=> SHA256 Checksum OK for leofs/leo-project-leo_pod-0.6.10_GH0.tar.gz.
=> SHA256 Checksum OK for leofs/leo-project-leo_redundant_manager-1.9.64_GH0.tar.gz.
=> SHA256 Checksum OK for leofs/leo-project-leo_rpc-0.10.18_GH0.tar.gz.
=> SHA256 Checksum OK for leofs/leo-project-leo_s3_libs-1.2.21_GH0.tar.gz.
=> SHA256 Checksum OK for leofs/leo-project-leo_statistics-1.1.23_GH0.tar.gz.
=> SHA256 Checksum OK for leofs/leo-project-leo_tran-0.2.14_GH0.tar.gz.
=> SHA256 Checksum OK for leofs/leo-project-leo_watchdog-1.0.7_GH0.tar.gz.
=> SHA256 Checksum OK for leofs/leo-project-leveldb-a9327e8_GH0.tar.gz.
=> SHA256 Checksum OK for leofs/leo-project-libcutil-0.5.1_GH0.tar.gz.
=> SHA256 Checksum OK for leofs/leo-project-nfs_rpc_server-0.2.7_GH0.tar.gz.
=> SHA256 Checksum OK for leofs/leo-project-savanna_agent-0.4.26_GH0.tar.gz.
=> SHA256 Checksum OK for leofs/leo-project-savanna_commons-0.10.12_GH0.tar.gz.
=> SHA256 Checksum OK for leofs/manopapad-proper-f558989_GH0.tar.gz.
<snip>
In file included from ./port/port_posix.h:51:
./port/atomic_pointer.h:143:2: error: Please implement AtomicPointer for this platform.
#error Please implement AtomicPointer for this platform.
 ^
1 error generated.
cc -O2 -pipe  -fstack-protector-strong -fno-strict-aliasing  -Wall -O3 -fPIC -I /wrkdirs/usr/ports/databases/leofs/work/leofs-1.4.3/deps/eleveldb/c_src/system/include -I. -I./include -fno-builtin-memcmp -D_REENTRANT -DOS_FREEBSD -DLEVELDB_PLATFORM_POSIX -DSNAPPY  -O2 -g -DNDEBUG     -fPIC -MM -E -MT db/log_reader.d -MT db/log_reader.o -MF db/log_reader.d db/log_reader.cc
In file included from db/memtable.cc:5:
In file included from ./db/memtable.h:9:
In file included from ./include/leveldb/db.h:10:
In file included from ./include/leveldb/iterator.h:20:
In file included from ./include/leveldb/options.h:59:
In file included from ./include/leveldb/expiry.h:30:
In file included from ./util/refobject_base.h:33:
In file included from ./port/port.h:15:
In file included from ./port/port_posix.h:51:
./port/atomic_pointer.h:143:2: error: Please implement AtomicPointer for this platform.
#error Please implement AtomicPointer for this platform.
 ^
1 error generated.
cc -O2 -pipe  -fstack-protector-strong -fno-strict-aliasing  -Wall -O3 -fPIC -I /wrkdirs/usr/ports/databases/leofs/work/leofs-1.4.3/deps/eleveldb/c_src/system/include -I. -I./include -fno-builtin-memcmp -D_REENTRANT -DOS_FREEBSD -DLEVELDB_PLATFORM_POSIX -DSNAPPY  -O2 -g -DNDEBUG     -fPIC -MM -E -MT db/filename.d -MT db/filename.o -MF db/filename.d db/filename.cc
In file included from db/log_writer.cc:9:
In file included from ./util/coding.h:17:
In file included from ./port/port.h:15:
In file included from ./port/port_posix.h:51:
./port/atomic_pointer.h:143:2: error: Please implement AtomicPointer for this platform.
#error Please implement AtomicPointer for this platform.
 ^
1 error generated.
cc -O2 -pipe  -fstack-protector-strong -fno-strict-aliasing  -Wall -O3 -fPIC -I /wrkdirs/usr/ports/databases/leofs/work/leofs-1.4.3/deps/eleveldb/c_src/system/include -I. -I./include -fno-builtin-memcmp -D_REENTRANT -DOS_FREEBSD -DLEVELDB_PLATFORM_POSIX -DSNAPPY  -O2 -g -DNDEBUG     -fPIC -MM -E -MT db/dbformat.d -MT db/dbformat.o -MF db/dbformat.d db/dbformat.cc
In file included from db/log_reader.cc:9:
In file included from ./util/coding.h:17:
In file included from ./port/port.h:15:
In file included from ./port/port_posix.h:51:
./port/atomic_pointer.h:143:2: error: Please implement AtomicPointer for this platform.
#error Please implement AtomicPointer for this platform.
 ^
1 error generated.
cc -O2 -pipe  -fstack-protector-strong -fno-strict-aliasing  -Wall -O3 -fPIC -I /wrkdirs/usr/ports/databases/leofs/work/leofs-1.4.3/deps/eleveldb/c_src/system/include -I. -I./include -fno-builtin-memcmp -D_REENTRANT -DOS_FREEBSD -DLEVELDB_PLATFORM_POSIX -DSNAPPY  -O2 -g -DNDEBUG     -fPIC -MM -E -MT db/db_iter.d -MT db/db_iter.o -MF db/db_iter.d db/db_iter.cc
In file included from db/filename.cc:10:
In file included from ./db/filename.h:12:
In file included from ./include/leveldb/options.h:59:
In file included from ./include/leveldb/expiry.h:30:
In file included from ./util/refobject_base.h:33:
In file included from ./port/port.h:15:
In file included from ./port/port_posix.h:51:
./port/atomic_pointer.h:143:2: error: Please implement AtomicPointer for this platform.
#error Please implement AtomicPointer for this platform.
 ^
1 error generated.
cc -O2 -pipe  -fstack-protector-strong -fno-strict-aliasing  -Wall -O3 -fPIC -I /wrkdirs/usr/ports/databases/leofs/work/leofs-1.4.3/deps/eleveldb/c_src/system/include -I. -I./include -fno-builtin-memcmp -D_REENTRANT -DOS_FREEBSD -DLEVELDB_PLATFORM_POSIX -DSNAPPY  -O2 -g -DNDEBUG     -fPIC -MM -E -MT db/db_impl.d -MT db/db_impl.o -MF db/db_impl.d db/db_impl.cc
In file included from db/dbformat.cc:7:
In file included from ./db/dbformat.h:10:
In file included from ./include/leveldb/db.h:10:
In file included from ./include/leveldb/iterator.h:20:
In file included from ./include/leveldb/options.h:59:
In file included from ./include/leveldb/expiry.h:30:
In file included from ./util/refobject_base.h:33:
In file included from ./port/port.h:15:
In file included from ./port/port_posix.h:51:
./port/atomic_pointer.h:143:2: error: Please implement AtomicPointer for this platform.
#error Please implement AtomicPointer for this platform.
 ^
1 error generated.
cc -O2 -pipe  -fstack-protector-strong -fno-strict-aliasing  -Wall -O3 -fPIC -I /wrkdirs/usr/ports/databases/leofs/work/leofs-1.4.3/deps/eleveldb/c_src/system/include -I. -I./include -fno-builtin-memcmp -D_REENTRANT -DOS_FREEBSD -DLEVELDB_PLATFORM_POSIX -DSNAPPY  -O2 -g -DNDEBUG     -fPIC -MM -E -MT db/c.d -MT db/c.o -MF db/c.d db/c.cc
In file included from db/db_iter.cc:5:
In file included from ./db/db_iter.h:9:
In file included from ./include/leveldb/db.h:10:
In file included from ./include/leveldb/iterator.h:20:
In file included from ./include/leveldb/options.h:59:
In file included from ./include/leveldb/expiry.h:30:
In file included from ./util/refobject_base.h:33:
In file included from ./port/port.h:15:
In file included from ./port/port_posix.h:51:
./port/atomic_pointer.h:143:2: error: Please implement AtomicPointer for this platform.
#error Please implement AtomicPointer for this platform.
 ^
1 error generated.
cc -O2 -pipe  -fstack-protector-strong -fno-strict-aliasing  -Wall -O3 -fPIC -I /wrkdirs/usr/ports/databases/leofs/work/leofs-1.4.3/deps/eleveldb/c_src/system/include -I. -I./include -fno-builtin-memcmp -D_REENTRANT -DOS_FREEBSD -DLEVELDB_PLATFORM_POSIX -DSNAPPY  -O2 -g -DNDEBUG     -fPIC -MM -E -MT db/builder.d -MT db/builder.o -MF db/builder.d db/builder.cc
In file included from db/db_impl.cc:5:
In file included from ./db/db_impl.h:10:
In file included from ./db/dbformat.h:10:
In file included from ./include/leveldb/db.h:10:
In file included from ./include/leveldb/iterator.h:20:
In file included from ./include/leveldb/options.h:59:
In file included from ./include/leveldb/expiry.h:30:
In file included from ./util/refobject_base.h:33:
In file included from ./port/port.h:15:
In file included from ./port/port_posix.h:51:
./port/atomic_pointer.h:143:2: error: Please implement AtomicPointer for this platform.
#error Please implement AtomicPointer for this platform.
 ^
1 error generated.
In file included from db/c.cc:12:
In file included from ./include/leveldb/db.h:10:
In file included from ./include/leveldb/iterator.h:20:
In file included from ./include/leveldb/options.h:59:
In file included from ./include/leveldb/expiry.h:30:
In file included from ./util/refobject_base.h:33:
In file included from ./port/port.h:15:
In file included from ./port/port_posix.h:51:
./port/atomic_pointer.h:143:2: error: Please implement AtomicPointer for this platform.
#error Please implement AtomicPointer for this platform.
 ^
1 error generated.
In file included from db/builder.cc:8:
In file included from ./db/builder.h:9:
In file included from ./db/dbformat.h:10:
In file included from ./include/leveldb/db.h:10:
In file included from ./include/leveldb/iterator.h:20:
In file included from ./include/leveldb/options.h:59:
In file included from ./include/leveldb/expiry.h:30:
In file included from ./util/refobject_base.h:33:
In file included from ./port/port.h:15:
In file included from ./port/port_posix.h:51:
./port/atomic_pointer.h:143:2: error: Please implement AtomicPointer for this platform.
#error Please implement AtomicPointer for this platform.
 ^
1 error generated.
c++ -O2 -pipe -fstack-protector-strong -fno-strict-aliasing   -Wall -O3 -fPIC -I /wrkdirs/usr/ports/databases/leofs/work/leofs-1.4.3/deps/eleveldb/c_src/system/include -I. -I./include -fno-builtin-memcmp -D_REENTRANT -DOS_FREEBSD -DLEVELDB_PLATFORM_POSIX -DSNAPPY  -O2 -g -DNDEBUG     -fPIC -c db/builder.cc -o db/builder.o
c++ -O2 -pipe -fstack-protector-strong -fno-strict-aliasing   -Wall -O3 -fPIC -I /wrkdirs/usr/ports/databases/leofs/work/leofs-1.4.3/deps/eleveldb/c_src/system/include -I. -I./include -fno-builtin-memcmp -D_REENTRANT -DOS_FREEBSD -DLEVELDB_PLATFORM_POSIX -DSNAPPY  -O2 -g -DNDEBUG     -fPIC -c db/c.cc -o db/c.o
c++ -O2 -pipe -fstack-protector-strong -fno-strict-aliasing   -Wall -O3 -fPIC -I /wrkdirs/usr/ports/databases/leofs/work/leofs-1.4.3/deps/eleveldb/c_src/system/include -I. -I./include -fno-builtin-memcmp -D_REENTRANT -DOS_FREEBSD -DLEVELDB_PLATFORM_POSIX -DSNAPPY  -O2 -g -DNDEBUG     -fPIC -c db/db_impl.cc -o db/db_impl.o
In file included from db/c.cc:12:
In file included from ./include/leveldb/db.h:10:
In file included from ./include/leveldb/iterator.h:20:
In file included from ./include/leveldb/options.h:59:
In file included from ./include/leveldb/expiry.h:30:
In file included from ./util/refobject_base.h:33:
In file included from ./port/port.h:15:
In file included from ./port/port_posix.h:51:
./port/atomic_pointer.h:143:2: error: Please implement AtomicPointer for this platform.
#error Please implement AtomicPointer for this platform.
 ^
In file included from db/builder.cc:8:
In file included from ./db/builder.h:9:
In file included from ./db/dbformat.h:10:
In file included from ./include/leveldb/db.h:10:
In file included from ./include/leveldb/iterator.h:20:
In file included from ./include/leveldb/options.h:59:
In file included from ./include/leveldb/expiry.h:30:
In file included from ./util/refobject_base.h:33:
In file included from ./port/port.h:15:
In file included from ./port/port_posix.h:51:
./port/atomic_pointer.h:143:2: error: Please implement AtomicPointer for this platform.
#error Please implement AtomicPointer for this platform.
 ^
1 error generated.
gmake[2]: *** [Makefile:192: db/c.o] Error 1
gmake[2]: *** Waiting for unfinished jobs....
In file included from db/db_impl.cc:5:
In file included from ./db/db_impl.h:10:
In file included from ./db/dbformat.h:10:
In file included from ./include/leveldb/db.h:10:
In file included from ./include/leveldb/iterator.h:20:
In file included from ./include/leveldb/options.h:59:
In file included from ./include/leveldb/expiry.h:30:
In file included from ./util/refobject_base.h:33:
In file included from ./port/port.h:15:
In file included from ./port/port_posix.h:51:
./port/atomic_pointer.h:143:2: error: Please implement AtomicPointer for this platform.
#error Please implement AtomicPointer for this platform.
 ^
In file included from db/db_impl.cc:5:
./db/db_impl.h:169:9: error: no type named 'AtomicPointer' in namespace 'leveldb::port'
  port::AtomicPointer shutting_down_;
  ~~~~~~^
./db/db_impl.h:174:9: error: no type named 'AtomicPointer' in namespace 'leveldb::port'
  port::AtomicPointer has_imm_;  // So bg thread can detect non-NULL imm_
  ~~~~~~^
1 error generated.
gmake[2]: *** [Makefile:192: db/builder.o] Error 1
In file included from db/db_impl.cc:24:
In file included from ./db/memtable.h:11:
./db/skiplist.h:125:9: error: no type named 'AtomicPointer' in namespace 'leveldb::port'
  port::AtomicPointer max_height_;   // Height of the entire list
  ~~~~~~^
./db/skiplist.h:213:9: error: no type named 'AtomicPointer' in namespace 'leveldb::port'
  port::AtomicPointer next_[1];
  ~~~~~~^
./db/skiplist.h:220:35: error: no member named 'AtomicPointer' in namespace 'leveldb::port'
      sizeof(Node) + sizeof(port::AtomicPointer) * (height - 1));
                            ~~~~~~^
db/db_impl.cc:1793:14: error: cannot initialize object parameter of type 'leveldb::DB' with an expression of type 'leveldb::DBImpl'
  return DB::Put(o, key, val, meta);
             ^~~
db/db_impl.cc:1797:14: error: cannot initialize object parameter of type 'leveldb::DB' with an expression of type 'leveldb::DBImpl'
  return DB::Delete(options, key);
             ^~~~~~
db/db_impl.cc:2264:14: error: incompatible pointer types assigning to 'leveldb::DB *' from 'leveldb::DBImpl *'
    *dbptr = impl;
             ^~~~
9 errors generated.
gmake[2]: *** [Makefile:192: db/db_impl.o] Error 1
gmake[2]: Leaving directory '/wrkdirs/usr/ports/databases/leofs/work/leofs-1.4.3/deps/leveldb'
ERROR: Command [compile] failed!
gmake[1]: *** [Makefile:59: release] Error 1
gmake[1]: Leaving directory '/wrkdirs/usr/ports/databases/leofs/work/leofs-1.4.3'
*** Error code 1

Stop.
make: stopped in /usr/ports/databases/leofs