[package - main-arm64-default][sysutils/edk2] Failed for edk2-xen-x64-g202102 in build

From: <pkg-fallout_at_FreeBSD.org>
Date: Thu, 16 Sep 2021 17:21:32 GMT
You are receiving this mail as a port that you maintain
is failing to build on the FreeBSD package build server.
Please investigate the failure and submit a PR to fix
build.

Maintainer:     uboot_at_FreeBSD.org
Log URL:        http://ampere2.nyi.freebsd.org/data/main-arm64-default/pd1f850d50d64_s9ebe4b8c67/logs/edk2-xen-x64-g202102.log
Build URL:      http://ampere2.nyi.freebsd.org/build.html?mastername=main-arm64-default&build=pd1f850d50d64_s9ebe4b8c67
Log:

=>> Building sysutils/edk2
build started at Thu Sep 16 17:19:27 UTC 2021
port directory: /usr/ports/sysutils/edk2
package name: edk2-xen-x64-g202102
building for: FreeBSD main-arm64-default-job-14 14.0-CURRENT FreeBSD 14.0-CURRENT 1400033 arm64
maintained by: uboot_at_FreeBSD.org
Makefile ident: 
Poudriere version: 3.2.8-21-g883afb07
Host OSVERSION: 1400008
Jail OSVERSION: 1400033
Job Id: 14




!!! Jail is newer than host. (Jail: 1400033, Host: 1400008) !!!
!!! This is not supported. !!!
!!! Host kernel must be same or newer than jail. !!!
!!! Expect build failures. !!!



---Begin Environment---
SHELL=/bin/csh
OSVERSION=1400033
UNAME_v=FreeBSD 14.0-CURRENT 1400033
UNAME_r=14.0-CURRENT
BLOCKSIZE=K
MAIL=/var/mail/root
MM_CHARSET=UTF-8
LANG=C.UTF-8
STATUS=1
HOME=/root
PATH=/sbin:/bin:/usr/sbin:/usr/bin:/usr/local/sbin:/usr/local/bin:/root/bin
LOCALBASE=/usr/local
USER=root
LIBEXECPREFIX=/usr/local/libexec/poudriere
POUDRIERE_VERSION=3.2.8-21-g883afb07
MASTERMNT=/usr/local/poudriere/data/.m/main-arm64-default/ref
POUDRIERE_BUILD_TYPE=bulk
PACKAGE_BUILDING=yes
SAVED_TERM=
PWD=/usr/local/poudriere/data/.m/main-arm64-default/ref/.p/pool
P_PORTS_FEATURES=FLAVORS SELECTED_OPTIONS
MASTERNAME=main-arm64-default
SCRIPTPREFIX=/usr/local/share/poudriere
OLDPWD=/usr/local/poudriere/data/.m/main-arm64-default/ref/.p
SCRIPTPATH=/usr/local/share/poudriere/bulk.sh
POUDRIEREPATH=/usr/local/bin/poudriere
---End Environment---

---Begin Poudriere Port Flags/Env---
PORT_FLAGS=
PKGENV=
FLAVOR=xen_x64
DEPENDS_ARGS=
MAKE_ARGS= FLAVOR=xen_x64
---End Poudriere Port Flags/Env---

---Begin OPTIONS List---
---End OPTIONS List---

--MAINTAINER--
uboot_at_FreeBSD.org
--End MAINTAINER--

--CONFIGURE_ARGS--

--End CONFIGURE_ARGS--

--CONFIGURE_ENV--
MAKE=gmake PYTHON="/usr/local/bin/python3.8" XDG_DATA_HOME=/wrkdirs/usr/ports/sysutils/edk2/work-xen_x64  XDG_CONFIG_HOME=/wrkdirs/usr/ports/sysutils/edk2/work-xen_x64  HOME=/wrkdirs/usr/ports/sysutils/edk2/work-xen_x64 TMPDIR="/tmp" SHELL=/bin/sh CONFIG_SHELL=/bin/sh
--End CONFIGURE_ENV--

--MAKE_ENV--
WORKSPACE=/wrkdirs/usr/ports/sysutils/edk2/work-xen_x64  PACKAGES_PATH=/wrkdirs/usr/ports/sysutils/edk2/work-xen_x64/edk2-edk2-stable202102:/wrkdirs/usr/ports/sysutils/edk2/work-xen_x64/edk2-platforms-89f6170d:/wrkdirs/usr/ports/sysutils/edk2/work-xen_x64/edk2-non-osi-f9b9957d  CONF_PATH=/wrkdirs/usr/ports/sysutils/edk2/work-xen_x64/edk2-edk2-stable202102/Conf  EDK_TOOLS_PATH=/wrkdirs/usr/ports/sysutils/edk2/work-xen_x64/edk2-edk2-stable202102/BaseTools  PATH=/wrkdirs/usr/ports/sysutils/edk2/work-xen_x64/edk2-edk2-stable202102/BaseTools/BinWrappers/PosixLike:/wrkdirs/usr/ports/sysutils/edk2/work-xen_x64/.bin:/sbin:/bin:/usr/sbin:/usr/bin:/usr/local/sbin:/usr/local/bin:/root/bin  PYTHON_COMMAND=python3  PYTHONHASHSEED=1 XDG_DATA_HOME=/wrkdirs/usr/ports/sysutils/edk2/work-xen_x64  XDG_CONFIG_HOME=/wrkdirs/usr/ports/sysutils/edk2/work-xen_x64  HOME=/wrkdirs/usr/ports/sysutils/edk2/work-xen_x64 TMPDIR="/tmp" NO_PIE=yes MK_DEBUG_FILES=no MK_KERNEL_SYMBOLS=no SHELL=/bin/sh NO_LINT=YES ADDR
 2LINE="/usr/local/bin/addr2line" AR="/usr/local/bin/ar" AS="/usr/local/bin/as" CPPFILT="/usr/local/bin/c++filt" GPROF="/usr/local/bin/gprof" LD="/usr/local/bin/ld" NM="/usr/local/bin/nm" OBJCOPY="/usr/local/bin/objcopy" OBJDUMP="/usr/local/bin/objdump" RANLIB="/usr/local/bin/ranlib" READELF="/usr/local/bin/readelf" SIZE="/usr/local/bin/size" STRINGS="/usr/local/bin/strings" PREFIX=/usr/local  LOCALBASE=/usr/local  CC="gcc10" CFLAGS="-O2 -pipe  -fstack-protector-strong -Wl,-rpath=/usr/local/lib/gcc10 -fno-strict-aliasing "  CPP="cpp10" CPPFLAGS=""  LDFLAGS=" -fstack-protector-strong -Wl,-rpath=/usr/local/lib/gcc10 -L/usr/local/lib/gcc10 " LIBS=""  CXX="g++10" CXXFLAGS="-O2 -pipe  -fstack-protector-strong -Wl,-rpath=/usr/local/lib/gcc10  -Wl,-rpath=/usr/local/lib/gcc10 "  MANPREFIX="/usr/local" BSD_INSTALL_PROGRAM="install  -s -m 555"  BSD_INSTALL_LIB="install  -s -m 0644"  BSD_INSTALL_SCRIPT="install  -m 555"  BSD_INSTALL_DATA="install  -m 0644"  BSD_INSTALL_MAN="install  -m 444"
--End MAKE_ENV--

--PLIST_SUB--
PYTHON_INCLUDEDIR=include/python3.8  PYTHON_LIBDIR=lib/python3.8  PYTHON_PLATFORM=freebsd14  PYTHON_SITELIBDIR=lib/python3.8/site-packages  PYTHON_SUFFIX=38  PYTHON_EXT_SUFFIX=.cpython-38  PYTHON_VER=3.8  PYTHON_VERSION=python3.8 PYTHON2="_at_comment " PYTHON3="" OSREL=14.0 PREFIX=%D LOCALBASE=/usr/local  RESETPREFIX=/usr/local LIB32DIR=lib DOCSDIR="share/doc/edk2"  EXAMPLESDIR="share/examples/edk2"  DATADIR="share/edk2"  WWWDIR="www/edk2"  ETCDIR="etc/edk2"
--End PLIST_SUB--

--SUB_LIST--
PREFIX=/usr/local LOCALBASE=/usr/local  DATADIR=/usr/local/share/edk2 DOCSDIR=/usr/local/share/doc/edk2 EXAMPLESDIR=/usr/local/share/examples/edk2  WWWDIR=/usr/local/www/edk2 ETCDIR=/usr/local/etc/edk2
--End SUB_LIST--

---Begin make.conf---
USE_PACKAGE_DEPENDS=yes
BATCH=yes
WRKDIRPREFIX=/wrkdirs
PORTSDIR=/usr/ports
PACKAGES=/packages
DISTDIR=/distfiles
PACKAGE_BUILDING=yes
PACKAGE_BUILDING_FLAVORS=yes
#### /usr/local/etc/poudriere.d/make.conf ####
# XXX: We really need this but cannot use it while 'make checksum' does not
# try the next mirror on checksum failure.  It currently retries the same
# failed mirror and then fails rather then trying another.  It *does*
# try the next if the size is mismatched though.
#MASTER_SITE_FREEBSD=yes
# Build ALLOW_MAKE_JOBS_PACKAGES with 2 jobs
MAKE_JOBS_NUMBER=2
#### /usr/ports/Mk/Scripts/ports_env.sh ####
_CCVERSION_921dbbb2=FreeBSD clang version 12.0.1 (git_at_github.com:llvm/llvm-project.git llvmorg-12.0.1-0-gfed41342a82f) Target: aarch64-unknown-freebsd14.0 Thread model: posix InstalledDir: /usr/bin
_ALTCCVERSION_921dbbb2=none
_CXXINTERNAL_acaad9ca=FreeBSD clang version 12.0.1 (git_at_github.com:llvm/llvm-project.git llvmorg-12.0.1-0-gfed41342a82f) Target: aarch64-unknown-freebsd14.0 Thread model: posix InstalledDir: /usr/bin "/usr/bin/ld" "--eh-frame-hdr" "-dynamic-linker" "/libexec/ld-elf.so.1" "--enable-new-dtags" "-o" "a.out" "/usr/lib/crt1.o" "/usr/lib/crti.o" "/usr/lib/crtbegin.o" "-L/usr/lib" "/dev/null" "-lc++" "-lm" "-lgcc" "--as-needed" "-lgcc_s" "--no-as-needed" "-lc" "-lgcc" "--as-needed" "-lgcc_s" "--no-as-needed" "/usr/lib/crtend.o" "/usr/lib/crtn.o"
CC_OUTPUT_921dbbb2_58173849=yes
CC_OUTPUT_921dbbb2_9bdba57c=yes
CC_OUTPUT_921dbbb2_6a4fe7f5=yes
CC_OUTPUT_921dbbb2_6bcac02b=yes
CC_OUTPUT_921dbbb2_67d20829=yes
CC_OUTPUT_921dbbb2_bfa62e83=yes
CC_OUTPUT_921dbbb2_f0b4d593=yes
CC_OUTPUT_921dbbb2_308abb44=yes
CC_OUTPUT_921dbbb2_f00456e5=yes
CC_OUTPUT_921dbbb2_65ad290d=yes
CC_OUTPUT_921dbbb2_f2776b26=yes
CC_OUTPUT_921dbbb2_b2657cc3=yes
CC_OUTPUT_921dbbb2_380987f7=yes
CC_OUTPUT_921dbbb2_160933ec=yes
CC_OUTPUT_921dbbb2_fb62803b=yes
_OBJC_CCVERSION_921dbbb2=FreeBSD clang version 12.0.1 (git_at_github.com:llvm/llvm-project.git llvmorg-12.0.1-0-gfed41342a82f) Target: aarch64-unknown-freebsd14.0 Thread model: posix InstalledDir: /usr/bin
_OBJC_ALTCCVERSION_921dbbb2=none
ARCH=aarch64
OPSYS=FreeBSD
_OSRELEASE=14.0-CURRENT
OSREL=14.0
OSVERSION=1400033
PYTHONBASE=/usr/local
CONFIGURE_MAX_CMD_LEN=524288
HAVE_PORTS_ENV=1
#### Misc Poudriere ####
GID=0
UID=0
---End make.conf---
--Resource limits--
cpu time               (seconds, -t)  unlimited
file size           (512-blocks, -f)  unlimited
data seg size           (kbytes, -d)  1048576
stack size              (kbytes, -s)  1048576
core file size      (512-blocks, -c)  unlimited
max memory size         (kbytes, -m)  unlimited
locked memory           (kbytes, -l)  unlimited
max user processes              (-u)  89999
open files                      (-n)  1024
virtual mem size        (kbytes, -v)  unlimited
swap limit              (kbytes, -w)  unlimited
socket buffer size       (bytes, -b)  unlimited
pseudo-terminals                (-p)  unlimited
kqueues                         (-k)  unlimited
umtx shared locks               (-o)  unlimited
--End resource limits--
=======================<phase: check-sanity   >============================
===>  License BSD3CLAUSE accepted by the user
===========================================================================
=======================<phase: pkg-depends    >============================
===>   edk2-xen-x64-g202102 depends on file: /usr/local/sbin/pkg - not found
===>   Installing existing package /packages/All/pkg-1.17.1.pkg
[main-arm64-default-job-14] Installing pkg-1.17.1...
[main-arm64-default-job-14] Extracting pkg-1.17.1: .......... done
===>   edk2-xen-x64-g202102 depends on file: /usr/local/sbin/pkg - found
===>   Returning to build of edk2-xen-x64-g202102
===========================================================================
=======================<phase: fetch-depends  >============================
===========================================================================
=======================<phase: fetch          >============================
===>  License BSD3CLAUSE accepted by the user
===> Fetching all distfiles required by edk2-xen-x64-g202102 for building
===========================================================================
=======================<phase: checksum       >============================
===>  License BSD3CLAUSE accepted by the user
===> Fetching all distfiles required by edk2-xen-x64-g202102 for building
=> SHA256 Checksum OK for tianocore-edk2-g202102-edk2-stable202102_GH0.tar.gz.
=> SHA256 Checksum OK for tianocore-edk2-platforms-89f6170d_GH0.tar.gz.
=> SHA256 Checksum OK for tianocore-edk2-non-osi-f9b9957d_GH0.tar.gz.
=> SHA256 Checksum OK for openssl-openssl-OpenSSL_1_1_1g_GH0.tar.gz.
=> SHA256 Checksum OK for ucb-bar-berkeley-softfloat-3-master_GH0.tar.gz.
=> SHA256 Checksum OK for kkos-oniguruma-v6.9.4_mark1_GH0.tar.gz.
=> SHA256 Checksum OK for google-brotli-v1.0.7-17-g666c328_GH0.tar.gz.
===========================================================================
=======================<phase: extract-depends>============================
===========================================================================
=======================<phase: extract        >============================
===>  License BSD3CLAUSE accepted by the user
===> Fetching all distfiles required by edk2-xen-x64-g202102 for building
===>  Extracting for edk2-xen-x64-g202102
=> SHA256 Checksum OK for tianocore-edk2-g202102-edk2-stable202102_GH0.tar.gz.
=> SHA256 Checksum OK for tianocore-edk2-platforms-89f6170d_GH0.tar.gz.
=> SHA256 Checksum OK for tianocore-edk2-non-osi-f9b9957d_GH0.tar.gz.
=> SHA256 Checksum OK for openssl-openssl-OpenSSL_1_1_1g_GH0.tar.gz.
=> SHA256 Checksum OK for ucb-bar-berkeley-softfloat-3-master_GH0.tar.gz.
=> SHA256 Checksum OK for kkos-oniguruma-v6.9.4_mark1_GH0.tar.gz.
=> SHA256 Checksum OK for google-brotli-v1.0.7-17-g666c328_GH0.tar.gz.
(cd /wrkdirs/usr/ports/sysutils/edk2/work-xen_x64/edk2-edk2-stable202102/MdeModulePkg/Library/BrotliCustomDecompressLib/brotli && tar cf - * | tar xf - -C ../../../../BaseTools/Source/C/BrotliCompress/brotli)
===========================================================================
=======================<phase: patch-depends  >============================
===========================================================================
=======================<phase: patch          >============================
<snip>
test_Table_TableDataModel (CheckPythonSyntax.Tests) ... ok
test_Table_TableDec (CheckPythonSyntax.Tests) ... ok
test_Table_TableDsc (CheckPythonSyntax.Tests) ... ok
test_Table_TableEotReport (CheckPythonSyntax.Tests) ... ok
test_Table_TableFdf (CheckPythonSyntax.Tests) ... ok
test_Table_TableFile (CheckPythonSyntax.Tests) ... ok
test_Table_TableFunction (CheckPythonSyntax.Tests) ... ok
test_Table_TableIdentifier (CheckPythonSyntax.Tests) ... ok
test_Table_TableInf (CheckPythonSyntax.Tests) ... ok
test_Table_TablePcd (CheckPythonSyntax.Tests) ... ok
test_Table_TableQuery (CheckPythonSyntax.Tests) ... ok
test_Table_TableReport (CheckPythonSyntax.Tests) ... ok
test_Table___init__ (CheckPythonSyntax.Tests) ... ok
test_TargetTool_TargetTool (CheckPythonSyntax.Tests) ... ok
test_TargetTool___init__ (CheckPythonSyntax.Tests) ... ok
test_Trim_Trim (CheckPythonSyntax.Tests) ... ok
test_UPT_BuildVersion (CheckPythonSyntax.Tests) ... ok
test_UPT_Core_DependencyRules (CheckPythonSyntax.Tests) ... ok
test_UPT_Core_DistributionPackageClass (CheckPythonSyntax.Tests) ... ok
test_UPT_Core_FileHook (CheckPythonSyntax.Tests) ... ok
test_UPT_Core_IpiDb (CheckPythonSyntax.Tests) ... ok
test_UPT_Core_PackageFile (CheckPythonSyntax.Tests) ... ok
test_UPT_Core___init__ (CheckPythonSyntax.Tests) ... ok
test_UPT_GenMetaFile_GenDecFile (CheckPythonSyntax.Tests) ... ok
test_UPT_GenMetaFile_GenInfFile (CheckPythonSyntax.Tests) ... ok
test_UPT_GenMetaFile_GenMetaFileMisc (CheckPythonSyntax.Tests) ... ok
test_UPT_GenMetaFile_GenXmlFile (CheckPythonSyntax.Tests) ... ok
test_UPT_GenMetaFile___init__ (CheckPythonSyntax.Tests) ... ok
test_UPT_InstallPkg (CheckPythonSyntax.Tests) ... ok
test_UPT_InventoryWs (CheckPythonSyntax.Tests) ... ok
test_UPT_Library_CommentGenerating (CheckPythonSyntax.Tests) ... ok
test_UPT_Library_CommentParsing (CheckPythonSyntax.Tests) ... ok
test_UPT_Library_DataType (CheckPythonSyntax.Tests) ... ok
test_UPT_Library_ExpressionValidate (CheckPythonSyntax.Tests) ... ok
test_UPT_Library_GlobalData (CheckPythonSyntax.Tests) ... ok
test_UPT_Library_Misc (CheckPythonSyntax.Tests) ... ok
test_UPT_Library_ParserValidate (CheckPythonSyntax.Tests) ... ok
test_UPT_Library_Parsing (CheckPythonSyntax.Tests) ... ok
test_UPT_Library_StringUtils (CheckPythonSyntax.Tests) ... ok
test_UPT_Library_UniClassObject (CheckPythonSyntax.Tests) ... ok
test_UPT_Library_Xml_XmlRoutines (CheckPythonSyntax.Tests) ... ok
test_UPT_Library_Xml___init__ (CheckPythonSyntax.Tests) ... ok
test_UPT_Library___init__ (CheckPythonSyntax.Tests) ... ok
test_UPT_Logger_Log (CheckPythonSyntax.Tests) ... ok
test_UPT_Logger_StringTable (CheckPythonSyntax.Tests) ... ok
test_UPT_Logger_ToolError (CheckPythonSyntax.Tests) ... ok
test_UPT_Logger___init__ (CheckPythonSyntax.Tests) ... ok
test_UPT_MkPkg (CheckPythonSyntax.Tests) ... ok
test_UPT_Object_POM_CommonObject (CheckPythonSyntax.Tests) ... ok
test_UPT_Object_POM_ModuleObject (CheckPythonSyntax.Tests) ... ok
test_UPT_Object_POM_PackageObject (CheckPythonSyntax.Tests) ... ok
test_UPT_Object_POM___init__ (CheckPythonSyntax.Tests) ... ok
test_UPT_Object_Parser_DecObject (CheckPythonSyntax.Tests) ... ok
test_UPT_Object_Parser_InfBinaryObject (CheckPythonSyntax.Tests) ... ok
test_UPT_Object_Parser_InfBuildOptionObject (CheckPythonSyntax.Tests) ... ok
test_UPT_Object_Parser_InfCommonObject (CheckPythonSyntax.Tests) ... ok
test_UPT_Object_Parser_InfDefineCommonObject (CheckPythonSyntax.Tests) ... ok
test_UPT_Object_Parser_InfDefineObject (CheckPythonSyntax.Tests) ... ok
test_UPT_Object_Parser_InfDepexObject (CheckPythonSyntax.Tests) ... ok
test_UPT_Object_Parser_InfGuidObject (CheckPythonSyntax.Tests) ... ok
test_UPT_Object_Parser_InfHeaderObject (CheckPythonSyntax.Tests) ... ok
test_UPT_Object_Parser_InfLibraryClassesObject (CheckPythonSyntax.Tests) ... ok
test_UPT_Object_Parser_InfMisc (CheckPythonSyntax.Tests) ... ok
test_UPT_Object_Parser_InfPackagesObject (CheckPythonSyntax.Tests) ... ok
test_UPT_Object_Parser_InfPcdObject (CheckPythonSyntax.Tests) ... ok
test_UPT_Object_Parser_InfPpiObject (CheckPythonSyntax.Tests) ... ok
test_UPT_Object_Parser_InfProtocolObject (CheckPythonSyntax.Tests) ... ok
test_UPT_Object_Parser_InfSoucesObject (CheckPythonSyntax.Tests) ... ok
test_UPT_Object_Parser_InfUserExtensionObject (CheckPythonSyntax.Tests) ... ok
test_UPT_Object_Parser___init__ (CheckPythonSyntax.Tests) ... ok
test_UPT_Object___init__ (CheckPythonSyntax.Tests) ... ok
test_UPT_Parser_DecParser (CheckPythonSyntax.Tests) ... ok
test_UPT_Parser_DecParserMisc (CheckPythonSyntax.Tests) ... ok
test_UPT_Parser_InfAsBuiltProcess (CheckPythonSyntax.Tests) ... ok
test_UPT_Parser_InfBinarySectionParser (CheckPythonSyntax.Tests) ... ok
test_UPT_Parser_InfBuildOptionSectionParser (CheckPythonSyntax.Tests) ... ok
test_UPT_Parser_InfDefineSectionParser (CheckPythonSyntax.Tests) ... ok
test_UPT_Parser_InfDepexSectionParser (CheckPythonSyntax.Tests) ... ok
test_UPT_Parser_InfGuidPpiProtocolSectionParser (CheckPythonSyntax.Tests) ... ok
test_UPT_Parser_InfLibrarySectionParser (CheckPythonSyntax.Tests) ... ok
test_UPT_Parser_InfPackageSectionParser (CheckPythonSyntax.Tests) ... ok
test_UPT_Parser_InfParser (CheckPythonSyntax.Tests) ... ok
test_UPT_Parser_InfParserMisc (CheckPythonSyntax.Tests) ... ok
test_UPT_Parser_InfPcdSectionParser (CheckPythonSyntax.Tests) ... ok
test_UPT_Parser_InfSectionParser (CheckPythonSyntax.Tests) ... ok
test_UPT_Parser_InfSourceSectionParser (CheckPythonSyntax.Tests) ... ok
test_UPT_Parser___init__ (CheckPythonSyntax.Tests) ... ok
test_UPT_PomAdapter_DecPomAlignment (CheckPythonSyntax.Tests) ... ok
test_UPT_PomAdapter_InfPomAlignment (CheckPythonSyntax.Tests) ... ok
test_UPT_PomAdapter_InfPomAlignmentMisc (CheckPythonSyntax.Tests) ... ok
test_UPT_PomAdapter___init__ (CheckPythonSyntax.Tests) ... ok
test_UPT_ReplacePkg (CheckPythonSyntax.Tests) ... ok
test_UPT_RmPkg (CheckPythonSyntax.Tests) ... ok
test_UPT_TestInstall (CheckPythonSyntax.Tests) ... ok
test_UPT_UPT (CheckPythonSyntax.Tests) ... ok
test_UPT_UnitTest_CommentGeneratingUnitTest (CheckPythonSyntax.Tests) ... ok
test_UPT_UnitTest_CommentParsingUnitTest (CheckPythonSyntax.Tests) ... ok
test_UPT_UnitTest_DecParserTest (CheckPythonSyntax.Tests) ... ok
test_UPT_UnitTest_DecParserUnitTest (CheckPythonSyntax.Tests) ... ok
test_UPT_UnitTest_InfBinarySectionTest (CheckPythonSyntax.Tests) ... ok
test_UPT_Xml_CommonXml (CheckPythonSyntax.Tests) ... ok
test_UPT_Xml_GuidProtocolPpiXml (CheckPythonSyntax.Tests) ... ok
test_UPT_Xml_IniToXml (CheckPythonSyntax.Tests) ... ok
test_UPT_Xml_ModuleSurfaceAreaXml (CheckPythonSyntax.Tests) ... ok
test_UPT_Xml_PackageSurfaceAreaXml (CheckPythonSyntax.Tests) ... ok
test_UPT_Xml_PcdXml (CheckPythonSyntax.Tests) ... ok
test_UPT_Xml_XmlParser (CheckPythonSyntax.Tests) ... ok
test_UPT_Xml_XmlParserMisc (CheckPythonSyntax.Tests) ... ok
test_UPT_Xml___init__ (CheckPythonSyntax.Tests) ... ok
test_Workspace_BuildClassObject (CheckPythonSyntax.Tests) ... ok
test_Workspace_DecBuildData (CheckPythonSyntax.Tests) ... ok
test_Workspace_DscBuildData (CheckPythonSyntax.Tests) ... ok
test_Workspace_InfBuildData (CheckPythonSyntax.Tests) ... ok
test_Workspace_MetaDataTable (CheckPythonSyntax.Tests) ... ok
test_Workspace_MetaFileCommentParser (CheckPythonSyntax.Tests) ... ok
test_Workspace_MetaFileParser (CheckPythonSyntax.Tests) ... ok
test_Workspace_MetaFileTable (CheckPythonSyntax.Tests) ... ok
test_Workspace_WorkspaceCommon (CheckPythonSyntax.Tests) ... ok
test_Workspace_WorkspaceDatabase (CheckPythonSyntax.Tests) ... ok
test_Workspace___init__ (CheckPythonSyntax.Tests) ... ok
test_build_BuildReport (CheckPythonSyntax.Tests) ... ok
test_build___init__ (CheckPythonSyntax.Tests) ... ok
test_build_build (CheckPythonSyntax.Tests) ... ok
test_build_buildoptions (CheckPythonSyntax.Tests) ... ok
test_sitecustomize (CheckPythonSyntax.Tests) ... ok
test_tests_Split_test_split (CheckPythonSyntax.Tests) ... ok
test32bitUnicodeCharInUtf8Comment (CheckUnicodeSourceFiles.Tests) ... ok
test32bitUnicodeCharInUtf8File (CheckUnicodeSourceFiles.Tests) ... ok
testSupplementaryPlaneUnicodeCharInUtf16File (CheckUnicodeSourceFiles.Tests) ... ok
testSurrogatePairUnicodeCharInUtf16File (CheckUnicodeSourceFiles.Tests) ... ok
testSurrogatePairUnicodeCharInUtf8File (CheckUnicodeSourceFiles.Tests) ... ok
testSurrogatePairUnicodeCharInUtf8FileWithBom (CheckUnicodeSourceFiles.Tests) ... ok
testUtf16InUniFile (CheckUnicodeSourceFiles.Tests) ... ok
testValidUtf8File (CheckUnicodeSourceFiles.Tests) ... ok
testValidUtf8FileWithBom (CheckUnicodeSourceFiles.Tests) ... ok

----------------------------------------------------------------------
Ran 285 tests in 2.895s

OK
gmake[2]: Leaving directory '/wrkdirs/usr/ports/sysutils/edk2/work-xen_x64/edk2-edk2-stable202102/BaseTools/Tests'
gmake[1]: Leaving directory '/wrkdirs/usr/ports/sysutils/edk2/work-xen_x64/edk2-edk2-stable202102/BaseTools'
(cd /wrkdirs/usr/ports/sysutils/edk2/work-xen_x64/edk2-edk2-stable202102 && /usr/bin/env WORKSPACE=/wrkdirs/usr/ports/sysutils/edk2/work-xen_x64  PACKAGES_PATH=/wrkdirs/usr/ports/sysutils/edk2/work-xen_x64/edk2-edk2-stable202102:/wrkdirs/usr/ports/sysutils/edk2/work-xen_x64/edk2-platforms-89f6170d:/wrkdirs/usr/ports/sysutils/edk2/work-xen_x64/edk2-non-osi-f9b9957d  CONF_PATH=/wrkdirs/usr/ports/sysutils/edk2/work-xen_x64/edk2-edk2-stable202102/Conf  EDK_TOOLS_PATH=/wrkdirs/usr/ports/sysutils/edk2/work-xen_x64/edk2-edk2-stable202102/BaseTools  PATH=/wrkdirs/usr/ports/sysutils/edk2/work-xen_x64/edk2-edk2-stable202102/BaseTools/BinWrappers/PosixLike:/wrkdirs/usr/ports/sysutils/edk2/work-xen_x64/.bin:/sbin:/bin:/usr/sbin:/usr/bin:/usr/local/sbin:/usr/local/bin:/root/bin  PYTHON_COMMAND=python3  PYTHONHASHSEED=1 XDG_DATA_HOME=/wrkdirs/usr/ports/sysutils/edk2/work-xen_x64  XDG_CONFIG_HOME=/wrkdirs/usr/ports/sysutils/edk2/work-xen_x64  HOME=/wrkdirs/usr/ports/sysutils/edk2/work-xen_x64 TMPDI
 R="/tmp" NO_PIE=yes MK_DEBUG_FILES=no MK_KERNEL_SYMBOLS=no SHELL=/bin/sh NO_LINT=YES ADDR2LINE="/usr/local/bin/addr2line" AR="/usr/local/bin/ar" AS="/usr/local/bin/as" CPPFILT="/usr/local/bin/c++filt" GPROF="/usr/local/bin/gprof" LD="/usr/local/bin/ld" NM="/usr/local/bin/nm" OBJCOPY="/usr/local/bin/objcopy" OBJDUMP="/usr/local/bin/objdump" RANLIB="/usr/local/bin/ranlib" READELF="/usr/local/bin/readelf" SIZE="/usr/local/bin/size" STRINGS="/usr/local/bin/strings" PREFIX=/usr/local  LOCALBASE=/usr/local  CC="gcc10" CFLAGS="-O2 -pipe  -fstack-protector-strong -Wl,-rpath=/usr/local/lib/gcc10 -fno-strict-aliasing "  CPP="cpp10" CPPFLAGS=""  LDFLAGS=" -fstack-protector-strong -Wl,-rpath=/usr/local/lib/gcc10 -L/usr/local/lib/gcc10 " LIBS=""  CXX="g++10" CXXFLAGS="-O2 -pipe  -fstack-protector-strong -Wl,-rpath=/usr/local/lib/gcc10  -Wl,-rpath=/usr/local/lib/gcc10 "  MANPREFIX="/usr/local" BSD_INSTALL_PROGRAM="install  -s -m 555"  BSD_INSTALL_LIB="install  -s -m 0644"  BSD_INSTALL_SCRIPT="ins
 tall  -m 555"  BSD_INSTALL_DATA="install  -m!
  0644"  BSD_INSTALL_MAN="install  -m 444" BaseTools/BinWrappers/PosixLike/build -a X64 -p OvmfPkg/OvmfXen.dsc -n 2 -t GCC5 -b RELEASE )
Build environment: FreeBSD-14.0-CURRENT-arm64-aarch64-64bit-ELF
Build start time: 17:21:00, Sep.16 2021

WORKSPACE        = /wrkdirs/usr/ports/sysutils/edk2/work-xen_x64
PACKAGES_PATH    = /wrkdirs/usr/ports/sysutils/edk2/work-xen_x64/edk2-edk2-stable202102:/wrkdirs/usr/ports/sysutils/edk2/work-xen_x64/edk2-platforms-89f6170d:/wrkdirs/usr/ports/sysutils/edk2/work-xen_x64/edk2-non-osi-f9b9957d
EDK_TOOLS_PATH   = /wrkdirs/usr/ports/sysutils/edk2/work-xen_x64/edk2-edk2-stable202102/BaseTools
CONF_PATH        = /wrkdirs/usr/ports/sysutils/edk2/work-xen_x64/edk2-edk2-stable202102/Conf
PYTHON_COMMAND   = python3


Processing meta-data .
Architecture(s)  = X64
Build target     = RELEASE
Toolchain        = GCC5

Active Platform          = /wrkdirs/usr/ports/sysutils/edk2/work-xen_x64/edk2-edk2-stable202102/OvmfPkg/OvmfXen.dsc
...................... done!
Building ... /wrkdirs/usr/ports/sysutils/edk2/work-xen_x64/edk2-edk2-stable202102/NetworkPkg/Library/DxeDpcLib/DxeDpcLib.inf [X64]
Building ... /wrkdirs/usr/ports/sysutils/edk2/work-xen_x64/edk2-edk2-stable202102/NetworkPkg/Library/DxeNetLib/DxeNetLib.inf [X64]
make[1]: Entering directory '/wrkdirs/usr/ports/sysutils/edk2/work-xen_x64/Build/OvmfXen/RELEASE_GCC5/X64/NetworkPkg/Library/DxeDpcLib/DxeDpcLib'
"gcc" -MMD -MF /wrkdirs/usr/ports/sysutils/edk2/work-xen_x64/Build/OvmfXen/RELEASE_GCC5/X64/NetworkPkg/Library/DxeDpcLib/DxeDpcLib/OUTPUT/DpcLib.obj.deps -g -Os -fshort-wchar -fno-builtin -fno-strict-aliasing -Wall -Werror -Wno-array-bounds -include AutoGen.h -fno-common -ffunction-sections -fdata-sections -DSTRING_ARRAY_NAME=DxeDpcLibStrings -m64 -fno-stack-protector "-DEFIAPI=__attribute__((ms_abi))" -maccumulate-outgoing-args -mno-red-zone -Wno-address -mcmodel=small -fpie -fno-asynchronous-unwind-tables -Wno-address -flto -DUSING_LTO -Os -Wno-unused-but-set-variable -Wno-unused-const-variable -DMDEPKG_NDEBUG -mno-mmx -mno-sse -D DISABLE_NEW_DEPRECATED_INTERFACES -D ENABLE_MD5_DEPRECATED_INTERFACES -c -o /wrkdirs/usr/ports/sysutils/edk2/work-xen_x64/Build/OvmfXen/RELEASE_GCC5/X64/NetworkPkg/Library/DxeDpcLib/DxeDpcLib/OUTPUT/./DpcLib.obj -I/wrkdirs/usr/ports/sysutils/edk2/work-xen_x64/edk2-edk2-stable202102/NetworkPkg/Library/DxeDpcLib -I/wrkdirs/usr/ports/sysutils/edk2/work-xen_x
 64/Build/OvmfXen/RELEASE_GCC5/X64/NetworkPkg/Library/DxeDpcLib/DxeDpcLib/DEBUG -I/wrkdirs/usr/ports/sysutils/edk2/work-xen_x64/edk2-edk2-stable202102/MdePkg -I/wrkdirs/usr/ports/sysutils/edk2/work-xen_x64/edk2-edk2-stable202102/MdePkg/Include -I/wrkdirs/usr/ports/sysutils/edk2/work-xen_x64/edk2-edk2-stable202102/MdePkg/Test/UnitTest/Include -I/wrkdirs/usr/ports/sysutils/edk2/work-xen_x64/edk2-edk2-stable202102/MdePkg/Include/X64 -I/wrkdirs/usr/ports/sysutils/edk2/work-xen_x64/edk2-edk2-stable202102/NetworkPkg -I/wrkdirs/usr/ports/sysutils/edk2/work-xen_x64/edk2-edk2-stable202102/NetworkPkg/Include /wrkdirs/usr/ports/sysutils/edk2/work-xen_x64/edk2-edk2-stable202102/NetworkPkg/Library/DxeDpcLib/DpcLib.c
gcc: error: unrecognized command-line option '-m64'
gcc: error: unrecognized command-line option '-maccumulate-outgoing-args'
gcc: error: unrecognized command-line option '-mno-red-zone'
gcc: error: unrecognized command-line option '-mno-mmx'
gcc: error: unrecognized command-line option '-mno-sse'; did you mean '-fno-dse'?
make[1]: *** [GNUmakefile:302: /wrkdirs/usr/ports/sysutils/edk2/work-xen_x64/Build/OvmfXen/RELEASE_GCC5/X64/NetworkPkg/Library/DxeDpcLib/DxeDpcLib/OUTPUT/DpcLib.obj] Error 1
make[1]: Leaving directory '/wrkdirs/usr/ports/sysutils/edk2/work-xen_x64/Build/OvmfXen/RELEASE_GCC5/X64/NetworkPkg/Library/DxeDpcLib/DxeDpcLib'


build.py...
 : error 7000: Failed to execute command
	make tbuild [/wrkdirs/usr/ports/sysutils/edk2/work-xen_x64/Build/OvmfXen/RELEASE_GCC5/X64/NetworkPkg/Library/DxeDpcLib/DxeDpcLib]


build.py...
 : error 7000: Failed to execute command
	make tbuild [/wrkdirs/usr/ports/sysutils/edk2/work-xen_x64/Build/OvmfXen/RELEASE_GCC5/X64/NetworkPkg/Library/DxeNetLib/DxeNetLib]


build.py...
 : error 7000: Failed to execute command
	make tbuild [/wrkdirs/usr/ports/sysutils/edk2/work-xen_x64/Build/OvmfXen/RELEASE_GCC5/X64/MdePkg/Library/UefiDriverEntryPoint/UefiDriverEntryPoint]


build.py...
 : error F002: Failed to build module
	/wrkdirs/usr/ports/sysutils/edk2/work-xen_x64/edk2-edk2-stable202102/NetworkPkg/Library/DxeDpcLib/DxeDpcLib.inf [X64, GCC5, RELEASE]

- Failed -
Build end time: 17:21:25, Sep.16 2021
Build total time: 00:00:26

*** Error code 1

Stop.
make: stopped in /usr/ports/sysutils/edk2
Received on Thu Sep 16 2021 - 17:21:32 UTC

Original text of this message