[package - 122powerpc64-quarterly][sysutils/lnav] Failed for lnav-0.9.0 in build

From: <pkg-fallout_at_FreeBSD.org>
Date: Thu, 9 Sep 2021 03:52:52 GMT
You are receiving this mail as a port that you maintain
is failing to build on the FreeBSD package build server.
Please investigate the failure and submit a PR to fix
build.

Maintainer:     tom_at_hur.st
Log URL:        http://foul1.nyi.freebsd.org/data/122powerpc64-quarterly/2963f756953b/logs/lnav-0.9.0.log
Build URL:      http://foul1.nyi.freebsd.org/build.html?mastername=122powerpc64-quarterly&build=2963f756953b
Log:

=>> Building sysutils/lnav
build started at Thu Sep  9 03:51:02 UTC 2021
port directory: /usr/ports/sysutils/lnav
package name: lnav-0.9.0
building for: FreeBSD 122powerpc64-quarterly-job-13 12.2-RELEASE FreeBSD 12.2-RELEASE powerpc
maintained by: tom_at_hur.st
Makefile ident: 
Poudriere version: 3.2.8-21-g883afb07
Host OSVERSION: 1400008
Jail OSVERSION: 1202000
Job Id: 13

---Begin Environment---
SHELL=/bin/csh
OSVERSION=1202000
UNAME_v=FreeBSD 12.2-RELEASE
UNAME_r=12.2-RELEASE
BLOCKSIZE=K
MAIL=/var/mail/root
STATUS=1
HOME=/root
PATH=/sbin:/bin:/usr/sbin:/usr/bin:/usr/local/sbin:/usr/local/bin:/root/bin
LOCALBASE=/usr/local
USER=root
LIBEXECPREFIX=/usr/local/libexec/poudriere
POUDRIERE_VERSION=3.2.8-21-g883afb07
MASTERMNT=/usr/local/poudriere/data/.m/122powerpc64-quarterly/ref
POUDRIERE_BUILD_TYPE=bulk
PACKAGE_BUILDING=yes
SAVED_TERM=
PWD=/usr/local/poudriere/data/.m/122powerpc64-quarterly/ref/.p/pool
P_PORTS_FEATURES=FLAVORS SELECTED_OPTIONS
MASTERNAME=122powerpc64-quarterly
SCRIPTPREFIX=/usr/local/share/poudriere
OLDPWD=/usr/local/poudriere/data/.m/122powerpc64-quarterly/ref/.p
SCRIPTPATH=/usr/local/share/poudriere/bulk.sh
POUDRIEREPATH=/usr/local/bin/poudriere
---End Environment---

---Begin Poudriere Port Flags/Env---
PORT_FLAGS=
PKGENV=
FLAVOR=
DEPENDS_ARGS=
MAKE_ARGS=
---End Poudriere Port Flags/Env---

---Begin OPTIONS List---
===> The following configuration options are available for lnav-0.9.0:
     CURL=on: Use libcurl for remote log file support
===> Use 'make config' to modify these settings
---End OPTIONS List---

--MAINTAINER--
tom_at_hur.st
--End MAINTAINER--

--CONFIGURE_ARGS--
--disable-static --with-libcurl --prefix=/usr/local ${_LATE_CONFIGURE_ARGS}
--End CONFIGURE_ARGS--

--CONFIGURE_ENV--
MAKE=gmake XDG_DATA_HOME=/wrkdirs/usr/ports/sysutils/lnav/work  XDG_CONFIG_HOME=/wrkdirs/usr/ports/sysutils/lnav/work  HOME=/wrkdirs/usr/ports/sysutils/lnav/work TMPDIR="/tmp" PATH=/wrkdirs/usr/ports/sysutils/lnav/work/.bin:/sbin:/bin:/usr/sbin:/usr/bin:/usr/local/sbin:/usr/local/bin:/root/bin SHELL=/bin/sh CONFIG_SHELL=/bin/sh ADDR2LINE="/usr/local/bin/addr2line" AR="/usr/local/bin/ar" AS="/usr/local/bin/as" CPPFILT="/usr/local/bin/c++filt" GPROF="/usr/local/bin/gprof" LD="/usr/local/bin/ld" NM="/usr/local/bin/nm" OBJCOPY="/usr/local/bin/objcopy" OBJDUMP="/usr/local/bin/objdump" RANLIB="/usr/local/bin/ranlib" READELF="/usr/local/bin/readelf" SIZE="/usr/local/bin/size" STRINGS="/usr/local/bin/strings" CONFIG_SITE=/usr/ports/Templates/config.site lt_cv_sys_max_cmd_len=524288
--End CONFIGURE_ENV--

--MAKE_ENV--
XDG_DATA_HOME=/wrkdirs/usr/ports/sysutils/lnav/work  XDG_CONFIG_HOME=/wrkdirs/usr/ports/sysutils/lnav/work  HOME=/wrkdirs/usr/ports/sysutils/lnav/work TMPDIR="/tmp" PATH=/wrkdirs/usr/ports/sysutils/lnav/work/.bin:/sbin:/bin:/usr/sbin:/usr/bin:/usr/local/sbin:/usr/local/bin:/root/bin NO_PIE=yes MK_DEBUG_FILES=no MK_KERNEL_SYMBOLS=no SHELL=/bin/sh NO_LINT=YES ADDR2LINE="/usr/local/bin/addr2line" AR="/usr/local/bin/ar" AS="/usr/local/bin/as" CPPFILT="/usr/local/bin/c++filt" GPROF="/usr/local/bin/gprof" LD="/usr/local/bin/ld" NM="/usr/local/bin/nm" OBJCOPY="/usr/local/bin/objcopy" OBJDUMP="/usr/local/bin/objdump" RANLIB="/usr/local/bin/ranlib" READELF="/usr/local/bin/readelf" SIZE="/usr/local/bin/size" STRINGS="/usr/local/bin/strings" PREFIX=/usr/local  LOCALBASE=/usr/local  CC="gcc10" CFLAGS="-O2 -pipe  -fstack-protector-strong -Wl,-rpath=/usr/local/lib/gcc10 -fno-strict-aliasing "  CPP="cpp10" CPPFLAGS="-I/usr/local/include"  LDFLAGS=" -L/usr/local/lib -fstack-protector-strong -Wl,-rpa
 th=/usr/local/lib/gcc10 -L/usr/local/lib/gcc10 " LIBS=""  CXX="g++10" CXXFLAGS="-O2 -pipe  -fstack-protector-strong -Wl,-rpath=/usr/local/lib/gcc10  -Wl,-rpath=/usr/local/lib/gcc10 "  MANPREFIX="/usr/local" BSD_INSTALL_PROGRAM="install  -s -m 555"  BSD_INSTALL_LIB="install  -s -m 0644"  BSD_INSTALL_SCRIPT="install  -m 555"  BSD_INSTALL_DATA="install  -m 0644"  BSD_INSTALL_MAN="install  -m 444"
--End MAKE_ENV--

--PLIST_SUB--
OSREL=12.2 PREFIX=%D LOCALBASE=/usr/local  RESETPREFIX=/usr/local LIB32DIR=lib DOCSDIR="share/doc/lnav"  EXAMPLESDIR="share/examples/lnav"  DATADIR="share/lnav"  WWWDIR="www/lnav"  ETCDIR="etc/lnav"
--End PLIST_SUB--

--SUB_LIST--
PREFIX=/usr/local LOCALBASE=/usr/local  DATADIR=/usr/local/share/lnav DOCSDIR=/usr/local/share/doc/lnav EXAMPLESDIR=/usr/local/share/examples/lnav  WWWDIR=/usr/local/www/lnav ETCDIR=/usr/local/etc/lnav
--End SUB_LIST--

---Begin make.conf---
USE_PACKAGE_DEPENDS=yes
BATCH=yes
WRKDIRPREFIX=/wrkdirs
PORTSDIR=/usr/ports
PACKAGES=/packages
DISTDIR=/distfiles
PACKAGE_BUILDING=yes
PACKAGE_BUILDING_FLAVORS=yes
#### /usr/local/etc/poudriere.d/make.conf ####
# XXX: We really need this but cannot use it while 'make checksum' does not
# try the next mirror on checksum failure.  It currently retries the same
# failed mirror and then fails rather then trying another.  It *does*
# try the next if the size is mismatched though.
#MASTER_SITE_FREEBSD=yes
# Build ALLOW_MAKE_JOBS_PACKAGES with 2 jobs
MAKE_JOBS_NUMBER=2
#### /usr/ports/Mk/Scripts/ports_env.sh ####
_CCVERSION_921dbbb2=cc (GCC) 4.2.1 20070831 patched [FreeBSD] Copyright (C) 2007 Free Software Foundation, Inc. This is free software; see the source for copying conditions. There is NO warranty; not even for MERCHANTABILITY or FITNESS FOR A PARTICULAR PURPOSE.
_ALTCCVERSION_921dbbb2=none
_CXXINTERNAL_acaad9ca=Using built-in specs. Target: powerpc64-undermydesk-freebsd Configured with: FreeBSD/powerpc64 system compiler Thread model: posix gcc version 4.2.1 20070831 patched [FreeBSD] "/usr/bin/ld" "--eh-frame-hdr" "-Qy" "-melf64ppc_fbsd" "--enable-new-dtags" "-dynamic-linker" "/libexec/ld-elf.so.1" "/usr/lib/crt1.o" "/usr/lib/crti.o" "/usr/lib/crtbegin.o" "-L/usr/lib" "-L/usr/lib" "/dev/null" "-lstdc++" "-lm" "-lgcc_s" "-lgcc" "-lc" "-lgcc_s" "-lgcc" "/usr/lib/crtsavres.o" "/usr/lib/crtend.o" "/usr/lib/crtn.o"
CC_OUTPUT_921dbbb2_58173849=yes
CC_OUTPUT_921dbbb2_9bdba57c=yes
CC_OUTPUT_921dbbb2_6a4fe7f5=cc1: error: unrecognized command line option "-std=c11"
CC_OUTPUT_921dbbb2_6bcac02b=yes
CC_OUTPUT_921dbbb2_67d20829=yes
CC_OUTPUT_921dbbb2_bfa62e83=cc1: error: unrecognized command line option "-std=gnu11"
CC_OUTPUT_921dbbb2_f0b4d593=yes
CC_OUTPUT_921dbbb2_308abb44=cc1plus: error: unrecognized command line option "-std=c++0x"
CC_OUTPUT_921dbbb2_f00456e5=cc1plus: error: unrecognized command line option "-std=c++11"
CC_OUTPUT_921dbbb2_65ad290d=cc1plus: error: unrecognized command line option "-std=c++14"
CC_OUTPUT_921dbbb2_f2776b26=cc1plus: error: unrecognized command line option "-std=c++17"
CC_OUTPUT_921dbbb2_b2657cc3=yes
CC_OUTPUT_921dbbb2_380987f7=cc1plus: error: unrecognized command line option "-std=gnu++11"
CC_OUTPUT_921dbbb2_160933ec=cc1plus: error: unrecognized command line option "-std=gnu++14"
CC_OUTPUT_921dbbb2_fb62803b=cc1plus: error: unrecognized command line option "-std=gnu++17"
_OBJC_CCVERSION_921dbbb2=cc (GCC) 4.2.1 20070831 patched [FreeBSD] Copyright (C) 2007 Free Software Foundation, Inc. This is free software; see the source for copying conditions. There is NO warranty; not even for MERCHANTABILITY or FITNESS FOR A PARTICULAR PURPOSE.
_OBJC_ALTCCVERSION_921dbbb2=none
ARCH=powerpc64
PPC_ABI=ELFv1
OPSYS=FreeBSD
_OSRELEASE=12.2-RELEASE
OSREL=12.2
OSVERSION=1202000
PYTHONBASE=/usr/local
CONFIGURE_MAX_CMD_LEN=524288
HAVE_PORTS_ENV=1
#### Misc Poudriere ####
GID=0
UID=0
---End make.conf---
--Resource limits--
cpu time               (seconds, -t)  unlimited
file size           (512-blocks, -f)  unlimited
data seg size           (kbytes, -d)  33554432
stack size              (kbytes, -s)  524288
core file size      (512-blocks, -c)  unlimited
max memory size         (kbytes, -m)  unlimited
locked memory           (kbytes, -l)  unlimited
max user processes              (-u)  89999
open files                      (-n)  1024
virtual mem size        (kbytes, -v)  unlimited
swap limit              (kbytes, -w)  unlimited
socket buffer size       (bytes, -b)  unlimited
pseudo-terminals                (-p)  unlimited
kqueues                         (-k)  unlimited
umtx shared locks               (-o)  unlimited
--End resource limits--
=======================<phase: check-sanity   >============================
===>  License BSD2CLAUSE accepted by the user
===========================================================================
=======================<phase: pkg-depends    >============================
===>   lnav-0.9.0 depends on file: /usr/local/sbin/pkg - not found
===>   Installing existing package /packages/All/pkg-1.16.3.txz
[122powerpc64-quarterly-job-13] Installing pkg-1.16.3...
[122powerpc64-quarterly-job-13] Extracting pkg-1.16.3: .......... done
===>   lnav-0.9.0 depends on file: /usr/local/sbin/pkg - found
===>   Returning to build of lnav-0.9.0
===========================================================================
=======================<phase: fetch-depends  >============================
===========================================================================
=======================<phase: fetch          >============================
===>  License BSD2CLAUSE accepted by the user
===> Fetching all distfiles required by lnav-0.9.0 for building
===========================================================================
=======================<phase: checksum       >============================
===>  License BSD2CLAUSE accepted by the user
===> Fetching all distfiles required by lnav-0.9.0 for building
=> SHA256 Checksum OK for lnav-0.9.0.tar.bz2.
===========================================================================
=======================<phase: extract-depends>============================
===========================================================================
=======================<phase: extract        >============================
===>  License BSD2CLAUSE accepted by the user
===> Fetching all distfiles required by lnav-0.9.0 for building
===>  Extracting for lnav-0.9.0
=> SHA256 Checksum OK for lnav-0.9.0.tar.bz2.
===========================================================================
=======================<phase: patch-depends  >============================
===========================================================================
=======================<phase: patch          >============================
===>  Patching for lnav-0.9.0
===>  Applying FreeBSD patches for lnav-0.9.0 from /usr/ports/sysutils/lnav/files
===========================================================================
=======================<phase: build-depends  >============================
===>   lnav-0.9.0 depends on package: gmake>=4.3 - not found
===>   Installing existing package /packages/All/gmake-4.3_2.txz
[122powerpc64-quarterly-job-13] Installing gmake-4.3_2...
[122powerpc64-quarterly-job-13] `-- Installing gettext-runtime-0.21...
[122powerpc64-quarterly-job-13] |   `-- Installing indexinfo-0.3.1...
[122powerpc64-quarterly-job-13] |   `-- Extracting indexinfo-0.3.1: .... done
[122powerpc64-quarterly-job-13] `-- Extracting gettext-runtime-0.21: .......... done
[122powerpc64-quarterly-job-13] Extracting gmake-4.3_2: .......... done
===>   lnav-0.9.0 depends on package: gmake>=4.3 - found
===>   Returning to build of lnav-0.9.0
===>   lnav-0.9.0 depends on executable: gcc10 - not found
===>   Installing existing package /packages/All/gcc10-10.3.0.txz
[122powerpc64-quarterly-job-13] Installing gcc10-10.3.0...
[122powerpc64-quarterly-job-13] `-- Installing binutils-2.33.1_5,1...
[122powerpc64-quarterly-job-13] `-- Extracting binutils-2.33.1_5,1: .......... done
[122powerpc64-quarterly-job-13] `-- Installing gcc9-9.4.0...
[122powerpc64-quarterly-job-13] |   `-- Installing gmp-6.2.1...
<snip>
[122powerpc64-quarterly-job-13] `-- Installing libedit-3.1.20210216,1...
[122powerpc64-quarterly-job-13] `-- Extracting libedit-3.1.20210216,1: .......... done
[122powerpc64-quarterly-job-13] Extracting sqlite3-3.35.5_3,1: .......... done
===>   lnav-0.9.0 depends on shared library: libsqlite3.so - found (/usr/local/lib/libsqlite3.so)
===>   Returning to build of lnav-0.9.0
===========================================================================
=======================<phase: configure      >============================
===>  Configuring for lnav-0.9.0
configure: loading site script /usr/ports/Templates/config.site
checking for a BSD-compatible install... /usr/bin/install -c
checking whether build environment is sane... yes
checking for a thread-safe mkdir -p... (cached) /bin/mkdir -p
checking for gawk... (cached) /usr/bin/awk
checking whether gmake sets $(MAKE)... yes
checking whether gmake supports nested variables... yes
checking whether gmake supports nested variables... (cached) yes
checking build system type... powerpc64-portbld-freebsd12.2
checking host system type... powerpc64-portbld-freebsd12.2
checking whether gmake supports the include directive... yes (GNU style)
checking for gcc... gcc10
checking whether the C compiler works... yes
checking for C compiler default output file name... a.out
checking for suffix of executables... 
checking whether we are cross compiling... no
checking for suffix of object files... o
checking whether we are using the GNU C compiler... yes
checking whether gcc10 accepts -g... yes
checking for gcc10 option to accept ISO C89... none needed
checking whether gcc10 understands -c and -o together... yes
checking dependency style of gcc10... gcc3
checking how to run the C preprocessor... cpp10
checking for powerpc64-portbld-freebsd12.2-gcc... no
checking for gcc... gcc
checking whether we are using the GNU C compiler... (cached) yes
checking whether gcc accepts -g... yes
checking for gcc option to accept ISO C89... none needed
checking whether gcc understands -c and -o together... yes
checking dependency style of gcc... gcc3
checking whether the C compiler works... yes
checking for C compiler default output file name... a.out
checking for suffix of executables... 
checking whether we are cross compiling... no
checking for suffix of object files... o
checking how to run the C preprocessor... gcc -E
checking for a sed that does not truncate output... (cached) /usr/bin/sed
checking for grep that handles long lines and -e... (cached) /usr/bin/grep
checking for egrep... (cached) /usr/bin/egrep
checking whether gcc10 is Clang... no
checking whether pthreads work with "-pthread" and "-lpthread"... yes
checking for joinable pthread attribute... PTHREAD_CREATE_JOINABLE
checking whether more special flags are required for pthreads... no
checking for PTHREAD_PRIO_INHERIT... yes
checking whether we are using the GNU C++ compiler... yes
checking whether g++10 accepts -g... yes
checking dependency style of g++10... gcc3
checking whether g++10 supports C++14 features by default... yes
Adding include path: /usr/local/include
checking whether we are using the GNU C++ compiler... (cached) yes
checking whether g++10 accepts -g... (cached) yes
checking dependency style of g++10... (cached) gcc3
checking for ranlib... /usr/local/bin/ranlib
checking the archiver (/usr/local/bin/ar) interface... ar
checking whether ln -s works... yes
checking whether gmake sets $(MAKE)... (cached) yes
checking for bzip2... /usr/bin/bzip2
checking for re2c... no
checking how to run the C++ preprocessor... g++10 -E
checking for ANSI C header files... (cached) yes
checking for sys/types.h... (cached) yes
checking for sys/stat.h... (cached) yes
checking for stdlib.h... (cached) yes
checking for string.h... (cached) yes
checking for memory.h... (cached) yes
checking for strings.h... (cached) yes
checking for inttypes.h... (cached) yes
checking for stdint.h... (cached) yes
checking for unistd.h... (cached) yes
checking size of off_t... 8
checking size of size_t... 8
checking whether struct tm is in sys/time.h or time.h... time.h
checking for struct tm.tm_zone... yes
checking for library containing openpty... -lutil
checking for library containing gzseek... -lz
checking for library containing BZ2_bzopen... -lbz2
checking for library containing dlopen... none required
checking for library containing backtrace... -lexecinfo
checking for gawk... (cached) /usr/bin/awk
checking for curl-config... /usr/local/bin/curl-config
checking for the version of libcurl... 7.78.0
checking for libcurl >= version 7.23.0... yes
checking whether libcurl is usable... yes
checking for curl_free... yes
configure: Trying to link with tinfo
checking for library containing cur_term... -ltinfo
configure: Linking with tinfo
checking for library containing Gpm_Open... no
configure: WARNING: libgpm not found. If build fails later consider installing gpm dev package       
checking execinfo.h usability... yes
checking execinfo.h presence... yes
checking for execinfo.h... yes
checking pty.h usability... no
checking pty.h presence... no
checking for pty.h... no
checking util.h usability... no
checking util.h presence... no
checking for util.h... no
checking for zlib.h... (cached) yes
checking bzlib.h usability... yes
checking bzlib.h presence... yes
checking for bzlib.h... yes
checking for libutil.h... (cached) yes
checking sys/ttydefaults.h usability... yes
checking sys/ttydefaults.h presence... yes
checking for sys/ttydefaults.h... yes
configure: compiling with the included version of yajl
checking for NcursesW wide-character library... yes
checking for working ncursesw/curses.h... no
checking for working ncursesw.h... no
checking for working ncurses.h... yes
checking lib pcre... (testing)
checking for pcre_study in -lpcre... yes
checking libpcrecpp... yes
checking pcre.h usability... yes
checking pcre.h presence... yes
checking for pcre.h... yes
checking pcre/pcre.h usability... no
checking pcre/pcre.h presence... no
checking for pcre/pcre.h... no
checking lib pcre... -lpcre -lpcrecpp
checking lib readline... checking for library containing readline... -lreadline
checking for library containing history_set_history_state... none required
checking readline.h usability... no
checking readline.h presence... no
checking for readline.h... no
checking readline/readline.h usability... yes
checking readline/readline.h presence... yes
checking for readline/readline.h... yes
checking for library containing sqlite3_open... -lsqlite3
checking sqlite3.h usability... yes
checking sqlite3.h presence... yes
checking for sqlite3.h... yes
checking for SQLite3 library >= 3.9.0... yes
checking for sqlite3_stmt_readonly... yes
checking for sqlite3_value_subtype... yes
configure: Checking for libgpm dependency
checking for mousemask in -lncursesw... yes
checking that generated files are newer than configure... done
configure: creating ./config.status
config.status: creating Makefile
config.status: creating TESTS_ENVIRONMENT
config.status: creating src/Makefile
config.status: creating src/base/Makefile
config.status: creating src/fmtlib/Makefile
config.status: creating src/pcrepp/Makefile
config.status: creating src/yajl/Makefile
config.status: creating src/yajlpp/Makefile
config.status: creating test/Makefile
config.status: creating src/config.h
config.status: executing depfiles commands
===========================================================================
=======================<phase: build          >============================
===>  Building for lnav-0.9.0
gmake[1]: Entering directory '/wrkdirs/usr/ports/sysutils/lnav/work/lnav-0.9.0'
Making all in src
gmake[2]: Entering directory '/wrkdirs/usr/ports/sysutils/lnav/work/lnav-0.9.0/src'
gcc -o bin2c bin2c.c
gcc -o ptimec ptimec.c
bin2c.c: In function 'symname':
bin2c.c:41: error: 'for' loop initial declaration used outside C99 mode
bin2c.c: In function 'main':
bin2c.c:155: error: 'for' loop initial declaration used outside C99 mode
bin2c.c:161: error: redefinition of 'lpc'
bin2c.c:155: error: previous definition of 'lpc' was here
bin2c.c:161: error: 'for' loop initial declaration used outside C99 mode
ptimec.c: In function 'main':
ptimec.c:62: error: 'for' loop initial declaration used outside C99 mode
ptimec.c:67: error: 'for' loop initial declaration used outside C99 mode
ptimec.c:99: error: redefinition of 'lpc'
ptimec.c:62: error: previous definition of 'lpc' was here
ptimec.c:99: error: 'for' loop initial declaration used outside C99 mode
ptimec.c:104: error: 'for' loop initial declaration used outside C99 mode
ptimec.c:127: error: redefinition of 'lpc'
ptimec.c:99: error: previous definition of 'lpc' was here
ptimec.c:127: error: 'for' loop initial declaration used outside C99 mode
ptimec.c:135: error: redefinition of 'lpc'
ptimec.c:127: error: previous definition of 'lpc' was here
ptimec.c:135: error: 'for' loop initial declaration used outside C99 mode
gmake[2]: *** [Makefile:1694: bin2c] Error 1
gmake[2]: *** Waiting for unfinished jobs....
gmake[2]: *** [Makefile:1697: ptimec] Error 1
gmake[2]: Leaving directory '/wrkdirs/usr/ports/sysutils/lnav/work/lnav-0.9.0/src'
gmake[1]: *** [Makefile:488: all-recursive] Error 1
gmake[1]: Leaving directory '/wrkdirs/usr/ports/sysutils/lnav/work/lnav-0.9.0'
===> Compilation failed unexpectedly.
Try to set MAKE_JOBS_UNSAFE=yes and rebuild before reporting the failure to
the maintainer.
*** Error code 1

Stop.
make: stopped in /usr/ports/sysutils/lnav
Received on Thu Sep 09 2021 - 03:52:52 UTC

Original text of this message