[package - main-amd64-default][www/nspluginwrapper] Failed for nspluginwrapper-1.4.4_7 in build

From: <pkg-fallout_at_FreeBSD.org>
Date: Thu, 2 Sep 2021 12:10:46 GMT
You are receiving this mail as a port that you maintain
is failing to build on the FreeBSD package build server.
Please investigate the failure and submit a PR to fix
build.

Maintainer:     jkim_at_FreeBSD.org
Log URL:        http://beefy18.nyi.freebsd.org/data/main-amd64-default/p32835fdd312f_s7b529268a5/logs/nspluginwrapper-1.4.4_7.log
Build URL:      http://beefy18.nyi.freebsd.org/build.html?mastername=main-amd64-default&build=p32835fdd312f_s7b529268a5
Log:

=>> Building www/nspluginwrapper
build started at Thu Sep  2 12:10:20 UTC 2021
port directory: /usr/ports/www/nspluginwrapper
package name: nspluginwrapper-1.4.4_7
building for: FreeBSD main-amd64-default-job-11 14.0-CURRENT FreeBSD 14.0-CURRENT 1400032 amd64
maintained by: jkim_at_FreeBSD.org
Makefile ident: 
Poudriere version: 3.2.8-21-g883afb07
Host OSVERSION: 1400008
Jail OSVERSION: 1400032
Job Id: 11




!!! Jail is newer than host. (Jail: 1400032, Host: 1400008) !!!
!!! This is not supported. !!!
!!! Host kernel must be same or newer than jail. !!!
!!! Expect build failures. !!!



---Begin Environment---
SHELL=/bin/csh
OSVERSION=1400032
UNAME_v=FreeBSD 14.0-CURRENT 1400032
UNAME_r=14.0-CURRENT
BLOCKSIZE=K
MAIL=/var/mail/root
MM_CHARSET=UTF-8
LANG=C.UTF-8
STATUS=1
HOME=/root
PATH=/sbin:/bin:/usr/sbin:/usr/bin:/usr/local/sbin:/usr/local/bin:/root/bin
LOCALBASE=/usr/local
USER=root
LIBEXECPREFIX=/usr/local/libexec/poudriere
POUDRIERE_VERSION=3.2.8-21-g883afb07
MASTERMNT=/usr/local/poudriere/data/.m/main-amd64-default/ref
POUDRIERE_BUILD_TYPE=bulk
PACKAGE_BUILDING=yes
SAVED_TERM=
PWD=/usr/local/poudriere/data/.m/main-amd64-default/ref/.p/pool
P_PORTS_FEATURES=FLAVORS SELECTED_OPTIONS
MASTERNAME=main-amd64-default
SCRIPTPREFIX=/usr/local/share/poudriere
OLDPWD=/usr/local/poudriere/data/.m/main-amd64-default/ref/.p
SCRIPTPATH=/usr/local/share/poudriere/bulk.sh
POUDRIEREPATH=/usr/local/bin/poudriere
---End Environment---

---Begin Poudriere Port Flags/Env---
PORT_FLAGS=
PKGENV=
FLAVOR=
DEPENDS_ARGS=
MAKE_ARGS=
---End Poudriere Port Flags/Env---

---Begin OPTIONS List---
---End OPTIONS List---

--MAINTAINER--
jkim_at_FreeBSD.org
--End MAINTAINER--

--CONFIGURE_ARGS--
--enable-generic --enable-strip --prefix=/usr/local  --target-cpu=i386 --target-os=linux  --with-cc=cc --with-cxx=c++
--End CONFIGURE_ARGS--

--CONFIGURE_ENV--
MAKE=gmake PKG_CONFIG=pkgconf XDG_DATA_HOME=/wrkdirs/usr/ports/www/nspluginwrapper/work  XDG_CONFIG_HOME=/wrkdirs/usr/ports/www/nspluginwrapper/work  HOME=/wrkdirs/usr/ports/www/nspluginwrapper/work TMPDIR="/tmp" PATH=/wrkdirs/usr/ports/www/nspluginwrapper/work/.bin:/sbin:/bin:/usr/sbin:/usr/bin:/usr/local/sbin:/usr/local/bin:/root/bin SHELL=/bin/sh CONFIG_SHELL=/bin/sh LANG=en_US.UTF-8 LC_ALL=en_US.UTF-8
--End CONFIGURE_ENV--

--MAKE_ENV--
XDG_DATA_HOME=/wrkdirs/usr/ports/www/nspluginwrapper/work  XDG_CONFIG_HOME=/wrkdirs/usr/ports/www/nspluginwrapper/work  HOME=/wrkdirs/usr/ports/www/nspluginwrapper/work TMPDIR="/tmp" PATH=/wrkdirs/usr/ports/www/nspluginwrapper/work/.bin:/sbin:/bin:/usr/sbin:/usr/bin:/usr/local/sbin:/usr/local/bin:/root/bin NO_PIE=yes MK_DEBUG_FILES=no MK_KERNEL_SYMBOLS=no SHELL=/bin/sh NO_LINT=YES LANG=en_US.UTF-8 LC_ALL=en_US.UTF-8 PREFIX=/usr/local  LOCALBASE=/usr/local  CC="cc" CFLAGS="-O2 -pipe  -std=c99 -fstack-protector-strong -fno-strict-aliasing "  CPP="cpp" CPPFLAGS=""  LDFLAGS=" -fstack-protector-strong " LIBS=""  CXX="c++" CXXFLAGS="-O2 -pipe -fstack-protector-strong -fno-strict-aliasing  "  MANPREFIX="/usr/local" BSD_INSTALL_PROGRAM="install  -s -m 555"  BSD_INSTALL_LIB="install  -s -m 0644"  BSD_INSTALL_SCRIPT="install  -m 555"  BSD_INSTALL_DATA="install  -m 0644"  BSD_INSTALL_MAN="install  -m 444"
--End MAKE_ENV--

--PLIST_SUB--
HOST_ARCH="x86_64"  LIBDIR="lib/nspluginwrapper" GTK2_VERSION="2.10.0"  GTK3_VERSION="3.0.0"  GTK4_VERSION="4.0.0" OSREL=14.0 PREFIX=%D LOCALBASE=/usr/local  RESETPREFIX=/usr/local LIB32DIR=lib DOCSDIR="share/doc/nspluginwrapper"  EXAMPLESDIR="share/examples/nspluginwrapper"  DATADIR="share/nspluginwrapper"  WWWDIR="www/nspluginwrapper"  ETCDIR="etc/nspluginwrapper"
--End PLIST_SUB--

--SUB_LIST--
NSPLUGINWRAPPER="/usr/local/lib/nspluginwrapper" PREFIX=/usr/local LOCALBASE=/usr/local  DATADIR=/usr/local/share/nspluginwrapper DOCSDIR=/usr/local/share/doc/nspluginwrapper EXAMPLESDIR=/usr/local/share/examples/nspluginwrapper  WWWDIR=/usr/local/www/nspluginwrapper ETCDIR=/usr/local/etc/nspluginwrapper
--End SUB_LIST--

---Begin make.conf---
USE_PACKAGE_DEPENDS=yes
BATCH=yes
WRKDIRPREFIX=/wrkdirs
PORTSDIR=/usr/ports
PACKAGES=/packages
DISTDIR=/distfiles
PACKAGE_BUILDING=yes
PACKAGE_BUILDING_FLAVORS=yes
#### /usr/local/etc/poudriere.d/make.conf ####
# XXX: We really need this but cannot use it while 'make checksum' does not
# try the next mirror on checksum failure.  It currently retries the same
# failed mirror and then fails rather then trying another.  It *does*
# try the next if the size is mismatched though.
#MASTER_SITE_FREEBSD=yes
# Build ALLOW_MAKE_JOBS_PACKAGES with 2 jobs
MAKE_JOBS_NUMBER=2
#### /usr/ports/Mk/Scripts/ports_env.sh ####
_CCVERSION_921dbbb2=FreeBSD clang version 12.0.1 (git_at_github.com:llvm/llvm-project.git llvmorg-12.0.1-0-gfed41342a82f) Target: x86_64-unknown-freebsd14.0 Thread model: posix InstalledDir: /usr/bin
_ALTCCVERSION_921dbbb2=none
_CXXINTERNAL_acaad9ca=FreeBSD clang version 12.0.1 (git_at_github.com:llvm/llvm-project.git llvmorg-12.0.1-0-gfed41342a82f) Target: x86_64-unknown-freebsd14.0 Thread model: posix InstalledDir: /usr/bin "/usr/bin/ld" "--eh-frame-hdr" "-dynamic-linker" "/libexec/ld-elf.so.1" "--hash-style=both" "--enable-new-dtags" "-o" "a.out" "/usr/lib/crt1.o" "/usr/lib/crti.o" "/usr/lib/crtbegin.o" "-L/usr/lib" "/dev/null" "-lc++" "-lm" "-lgcc" "--as-needed" "-lgcc_s" "--no-as-needed" "-lc" "-lgcc" "--as-needed" "-lgcc_s" "--no-as-needed" "/usr/lib/crtend.o" "/usr/lib/crtn.o"
CC_OUTPUT_921dbbb2_58173849=yes
CC_OUTPUT_921dbbb2_9bdba57c=yes
CC_OUTPUT_921dbbb2_6a4fe7f5=yes
CC_OUTPUT_921dbbb2_6bcac02b=yes
CC_OUTPUT_921dbbb2_67d20829=yes
CC_OUTPUT_921dbbb2_bfa62e83=yes
CC_OUTPUT_921dbbb2_f0b4d593=yes
CC_OUTPUT_921dbbb2_308abb44=yes
CC_OUTPUT_921dbbb2_f00456e5=yes
CC_OUTPUT_921dbbb2_65ad290d=yes
CC_OUTPUT_921dbbb2_f2776b26=yes
CC_OUTPUT_921dbbb2_b2657cc3=yes
CC_OUTPUT_921dbbb2_380987f7=yes
CC_OUTPUT_921dbbb2_160933ec=yes
CC_OUTPUT_921dbbb2_fb62803b=yes
_OBJC_CCVERSION_921dbbb2=FreeBSD clang version 12.0.1 (git_at_github.com:llvm/llvm-project.git llvmorg-12.0.1-0-gfed41342a82f) Target: x86_64-unknown-freebsd14.0 Thread model: posix InstalledDir: /usr/bin
_OBJC_ALTCCVERSION_921dbbb2=none
ARCH=amd64
OPSYS=FreeBSD
_OSRELEASE=14.0-CURRENT
OSREL=14.0
OSVERSION=1400032
PYTHONBASE=/usr/local
HAVE_COMPAT_IA32_KERN=YES
CONFIGURE_MAX_CMD_LEN=524288
HAVE_PORTS_ENV=1
#### Misc Poudriere ####
GID=0
UID=0
---End make.conf---
--Resource limits--
cpu time               (seconds, -t)  unlimited
file size           (512-blocks, -f)  unlimited
data seg size           (kbytes, -d)  33554432
stack size              (kbytes, -s)  524288
core file size      (512-blocks, -c)  unlimited
max memory size         (kbytes, -m)  unlimited
locked memory           (kbytes, -l)  unlimited
max user processes              (-u)  89999
open files                      (-n)  1024
virtual mem size        (kbytes, -v)  unlimited
swap limit              (kbytes, -w)  unlimited
socket buffer size       (bytes, -b)  unlimited
pseudo-terminals                (-p)  unlimited
kqueues                         (-k)  unlimited
umtx shared locks               (-o)  unlimited
--End resource limits--
=======================<phase: check-sanity   >============================
===>  License GPLv2+ accepted by the user
===========================================================================
=======================<phase: pkg-depends    >============================
===>   nspluginwrapper-1.4.4_7 depends on file: /usr/local/sbin/pkg - not found
===>   Installing existing package /packages/All/pkg-1.17.1.pkg
[main-amd64-default-job-11] Installing pkg-1.17.1...
[main-amd64-default-job-11] Extracting pkg-1.17.1: .......... done
===>   nspluginwrapper-1.4.4_7 depends on file: /usr/local/sbin/pkg - found
===>   Returning to build of nspluginwrapper-1.4.4_7
===========================================================================
=======================<phase: fetch-depends  >============================
===========================================================================
=======================<phase: fetch          >============================
===>  License GPLv2+ accepted by the user
===> Fetching all distfiles required by nspluginwrapper-1.4.4_7 for building
===========================================================================
=======================<phase: checksum       >============================
===>  License GPLv2+ accepted by the user
===> Fetching all distfiles required by nspluginwrapper-1.4.4_7 for building
=> SHA256 Checksum OK for nspluginwrapper-1.4.4.tar.gz.
=> SHA256 Checksum OK for nspluginwrapper-i386-1.4.4-1.tar.gz.
===========================================================================
=======================<phase: extract-depends>============================
===========================================================================
=======================<phase: extract        >============================
===>  License GPLv2+ accepted by the user
===> Fetching all distfiles required by nspluginwrapper-1.4.4_7 for building
===>  Extracting for nspluginwrapper-1.4.4_7
=> SHA256 Checksum OK for nspluginwrapper-1.4.4.tar.gz.
=> SHA256 Checksum OK for nspluginwrapper-i386-1.4.4-1.tar.gz.
===========================================================================
=======================<phase: patch-depends  >============================
===========================================================================
=======================<phase: patch          >============================
===>  Patching for nspluginwrapper-1.4.4_7
===>  Applying FreeBSD patches for nspluginwrapper-1.4.4_7 from /usr/ports/www/nspluginwrapper/files
/usr/bin/sed -i.bak -e 's,%%LOCALBASE%%,/usr/local,g'  /wrkdirs/usr/ports/www/nspluginwrapper/work/nspluginwrapper-1.4.4/src/npw-config.c
/usr/bin/sed -i.bak -e 's,A-Z,:upper:,g; s,a-z,:lower:,g'  /wrkdirs/usr/ports/www/nspluginwrapper/work/nspluginwrapper-1.4.4/configure /wrkdirs/usr/ports/www/nspluginwrapper/work/nspluginwrapper-1.4.4/src/npw-viewer.sh
===========================================================================
=======================<phase: build-depends  >============================
===>   nspluginwrapper-1.4.4_7 depends on package: gmake>=4.3 - not found
===>   Installing existing package /packages/All/gmake-4.3_2.pkg
[main-amd64-default-job-11] Installing gmake-4.3_2...
[main-amd64-default-job-11] `-- Installing gettext-runtime-0.21...
<snip>
[main-amd64-default-job-11] |   `-- Installing encodings-1.0.5,1...
[main-amd64-default-job-11] |   `-- Extracting encodings-1.0.5,1: .......... done
[main-amd64-default-job-11] |   `-- Installing fribidi-1.0.10...
[main-amd64-default-job-11] |   `-- Extracting fribidi-1.0.10: .......... done
[main-amd64-default-job-11] |   `-- Installing harfbuzz-2.9.0...
[main-amd64-default-job-11] |   | `-- Installing graphite2-1.3.14...
[main-amd64-default-job-11] |   | `-- Extracting graphite2-1.3.14: .......... done
[main-amd64-default-job-11] |   `-- Extracting harfbuzz-2.9.0: .......... done
[main-amd64-default-job-11] |   `-- Installing libXft-2.3.3...
[main-amd64-default-job-11] |   `-- Extracting libXft-2.3.3: .......... done
[main-amd64-default-job-11] |   `-- Installing xorg-fonts-truetype-7.7_1...
[main-amd64-default-job-11] |   | `-- Installing dejavu-2.37_1...
[main-amd64-default-job-11] |   |   `-- Installing mkfontscale-1.2.1...
[main-amd64-default-job-11] |   |   | `-- Installing libfontenc-1.1.4...
[main-amd64-default-job-11] |   |   | `-- Extracting libfontenc-1.1.4: ......... done
[main-amd64-default-job-11] |   |   `-- Extracting mkfontscale-1.2.1: ....... done
[main-amd64-default-job-11] |   | `-- Extracting dejavu-2.37_1: .......... done
[main-amd64-default-job-11] |   | `-- Installing font-bh-ttf-1.0.3_4...
[main-amd64-default-job-11] |   | `-- Extracting font-bh-ttf-1.0.3_4: .......... done
[main-amd64-default-job-11] |   | `-- Installing font-misc-ethiopic-1.0.4...
[main-amd64-default-job-11] |   | `-- Extracting font-misc-ethiopic-1.0.4: ...... done
[main-amd64-default-job-11] |   | `-- Installing font-misc-meltho-1.0.3_4...
[main-amd64-default-job-11] |   | `-- Extracting font-misc-meltho-1.0.3_4: .......... done
[main-amd64-default-job-11] `-- Extracting pango-1.48.7: .......... done
[main-amd64-default-job-11] Extracting gtk2-2.24.33: .......... done
=====
Message from trousers-0.3.14_3:

--
To run tcsd automatically, add the following line to /etc/rc.conf:

tcsd_enable="YES"

You might want to edit /usr/local/etc/tcsd.conf to reflect your setup.

If you want to use tcsd with software TPM emulator, use the following
configuration in /etc/rc.conf:

tcsd_enable="YES"
tcsd_mode="emulator"
tpmd_enable="YES"

To use TPM, add your_account to '_tss' group like following:

# pw groupmod _tss -m your_account
=====
Message from freetype2-2.10.4:

--
The 2.7.x series now uses the new subpixel hinting mode (V40 port's option) as
the default, emulating a modern version of ClearType. This change inevitably
leads to different rendering results, and you might change port's options to
adapt it to your taste (or use the new "FREETYPE_PROPERTIES" environment
variable).

The environment variable "FREETYPE_PROPERTIES" can be used to control the
driver properties. Example:

FREETYPE_PROPERTIES=truetype:interpreter-version=35 \
	cff:no-stem-darkening=1 \
	autofitter:warping=1

This allows to select, say, the subpixel hinting mode at runtime for a given
application.

If LONG_PCF_NAMES port's option was enabled, the PCF family names may include
the foundry and information whether they contain wide characters. For example,
"Sony Fixed" or "Misc Fixed Wide", instead of "Fixed". This can be disabled at
run time with using pcf:no-long-family-names property, if needed. Example:

FREETYPE_PROPERTIES=pcf:no-long-family-names=1

How to recreate fontconfig cache with using such environment variable,
if needed:
# env FREETYPE_PROPERTIES=pcf:no-long-family-names=1 fc-cache -fsv

The controllable properties are listed in the section "Controlling FreeType
Modules" in the reference's table of contents
(/usr/local/share/doc/freetype2/reference/site/index.html, if documentation was installed).
=====
Message from dejavu-2.37_1:

--
Make sure that the freetype module is loaded.  If it is not, add the following
line to the "Modules" section of your X Windows configuration file:

	Load "freetype"

Add the following line to the "Files" section of X Windows configuration file:

	FontPath "/usr/local/share/fonts/dejavu/"

Note: your X Windows configuration file is typically /etc/X11/XF86Config
if you are using XFree86, and /etc/X11/xorg.conf if you are using X.Org.
===>   nspluginwrapper-1.4.4_7 depends on shared library: libgtk-x11-2.0.so - found (/usr/local/lib/libgtk-x11-2.0.so)
===>   Returning to build of nspluginwrapper-1.4.4_7
===>   nspluginwrapper-1.4.4_7 depends on shared library: libpango-1.0.so - found (/usr/local/lib/libpango-1.0.so)
===========================================================================
=======================<phase: configure      >============================
===>  Configuring for nspluginwrapper-1.4.4_7
WARNING: disabling glib memory hooks with --enable-generic
Source path               /wrkdirs/usr/ports/www/nspluginwrapper/work/nspluginwrapper-1.4.4
Install prefix            /usr/local
nspluginwrapper root dir  /usr/local/lib/nspluginwrapper
Viewer paths              /usr/local/lib/nspluginwrapper/%ARCH%/%OS%
Build viewer              no
Build standalone player   yes
Build 32-/64-bit at once  no
Build with generic APIs   yes
32-bit library dir name   lib
64-bit library dir name   lib
C compiler                cc -std=c99
C++ compiler              c++
Strip binaries            yes
Host OS                   freebsd
Host CPU                  x86_64
Host big endian           no
Target OS                 linux
Target CPU                i386
RPC init timeout          5 secs
Memory allocation hooks   libc
Use thread checks (DEBUG) no
Use malloc checks (DEBUG) no
===========================================================================
=======================<phase: build          >============================
===>  Building for nspluginwrapper-1.4.4_7
gmake[1]: Entering directory '/wrkdirs/usr/ports/www/nspluginwrapper/work/nspluginwrapper-1.4.4'
cc -std=c99 -O2 -pipe  -std=c99 -fstack-protector-strong -fno-strict-aliasing  -Wall -I/usr/local/include/glib-2.0 -I/usr/local/lib/glib-2.0/include -I/usr/local/include -pthread  -o npconfig-npw-config.o -c /wrkdirs/usr/ports/www/nspluginwrapper/work/nspluginwrapper-1.4.4/src/npw-config.c -I. -I/wrkdirs/usr/ports/www/nspluginwrapper/work/nspluginwrapper-1.4.4
sed -e 's|%NPW_VIEWER_DIR%|/usr/local/lib/nspluginwrapper/\$TARGET_ARCH/\$TARGET_OS|' /wrkdirs/usr/ports/www/nspluginwrapper/work/nspluginwrapper-1.4.4/src/npw-viewer.sh > npviewer.sh
chmod 755 npviewer.sh
cc -std=c99 -o npwrapper-npw-wrapper.os -c /wrkdirs/usr/ports/www/nspluginwrapper/work/nspluginwrapper-1.4.4/src/npw-wrapper.c -fPIC -I. -I/wrkdirs/usr/ports/www/nspluginwrapper/work/nspluginwrapper-1.4.4 -O2 -pipe  -std=c99 -fstack-protector-strong -fno-strict-aliasing  -Wall -I/usr/local/include -D_THREAD_SAFE -pthread  -I/wrkdirs/usr/ports/www/nspluginwrapper/work/nspluginwrapper-1.4.4/npapi -I/usr/local/include/glib-2.0 -I/usr/local/lib/glib-2.0/include -I/usr/local/include -pthread  -DBUILD_WRAPPER
/wrkdirs/usr/ports/www/nspluginwrapper/work/nspluginwrapper-1.4.4/src/npw-config.c:323:9: warning: 'ELF_CLASS' macro redefined [-Wmacro-redefined]
#define ELF_CLASS ELFCLASS32
        ^
/usr/include/sys/elf_generic.h:45:9: note: previous definition is here
#define ELF_CLASS       __CONCAT(ELFCLASS,__ELF_WORD_SIZE)
        ^
In file included from /wrkdirs/usr/ports/www/nspluginwrapper/work/nspluginwrapper-1.4.4/src/npw-config.c:324:
/wrkdirs/usr/ports/www/nspluginwrapper/work/nspluginwrapper-1.4.4/src/npw-config-template.h:36:17: error: function cannot return function type 'void (Elf64_Ehdr *)'
static void FUNC(elf_swap_ehdr)(ElfW(Ehdr) *hdr)
                ^
/wrkdirs/usr/ports/www/nspluginwrapper/work/nspluginwrapper-1.4.4/src/npw-config-template.h:38:3: error: use of undeclared identifier 'hdr'
  hdr->e_type                   = bswap_16(hdr->e_type);
  ^
/wrkdirs/usr/ports/www/nspluginwrapper/work/nspluginwrapper-1.4.4/src/npw-config-template.h:38:28: error: use of undeclared identifier 'hdr'
  hdr->e_type                   = bswap_16(hdr->e_type);
                                           ^
/wrkdirs/usr/ports/www/nspluginwrapper/work/nspluginwrapper-1.4.4/src/npw-config-template.h:38:28: error: use of undeclared identifier 'hdr'
/wrkdirs/usr/ports/www/nspluginwrapper/work/nspluginwrapper-1.4.4/src/npw-config-template.h:39:3: error: use of undeclared identifier 'hdr'
  hdr->e_machine                = bswap_16(hdr->e_machine);
  ^
/wrkdirs/usr/ports/www/nspluginwrapper/work/nspluginwrapper-1.4.4/src/npw-config-template.h:39:30: error: use of undeclared identifier 'hdr'
  hdr->e_machine                = bswap_16(hdr->e_machine);
                                           ^
/wrkdirs/usr/ports/www/nspluginwrapper/work/nspluginwrapper-1.4.4/src/npw-config-template.h:39:30: error: use of undeclared identifier 'hdr'
/wrkdirs/usr/ports/www/nspluginwrapper/work/nspluginwrapper-1.4.4/src/npw-config-template.h:40:3: error: use of undeclared identifier 'hdr'
  hdr->e_version                = bswap_32(hdr->e_version);
  ^
/wrkdirs/usr/ports/www/nspluginwrapper/work/nspluginwrapper-1.4.4/src/npw-config-template.h:40:30: error: use of undeclared identifier 'hdr'
  hdr->e_version                = bswap_32(hdr->e_version);
                                           ^
/wrkdirs/usr/ports/www/nspluginwrapper/work/nspluginwrapper-1.4.4/src/npw-config-template.h:40:30: error: use of undeclared identifier 'hdr'
/wrkdirs/usr/ports/www/nspluginwrapper/work/nspluginwrapper-1.4.4/src/npw-config-template.h:40:30: error: use of undeclared identifier 'hdr'
/wrkdirs/usr/ports/www/nspluginwrapper/work/nspluginwrapper-1.4.4/src/npw-config-template.h:40:30: error: use of undeclared identifier 'hdr'
/wrkdirs/usr/ports/www/nspluginwrapper/work/nspluginwrapper-1.4.4/src/npw-config-template.h:41:3: error: use of undeclared identifier 'hdr'
  hdr->e_entry                  = bswap_ad(hdr->e_entry);
  ^
/wrkdirs/usr/ports/www/nspluginwrapper/work/nspluginwrapper-1.4.4/src/npw-config-template.h:41:20: warning: implicit declaration of function 'bswap_ad' is invalid in C99 [-Wimplicit-function-declaration]
  hdr->e_entry                  = bswap_ad(hdr->e_entry);
                                  ^
/wrkdirs/usr/ports/www/nspluginwrapper/work/nspluginwrapper-1.4.4/src/npw-config-template.h:41:29: error: use of undeclared identifier 'hdr'
  hdr->e_entry                  = bswap_ad(hdr->e_entry);
                                           ^
/wrkdirs/usr/ports/www/nspluginwrapper/work/nspluginwrapper-1.4.4/src/npw-config-template.h:42:3: error: use of undeclared identifier 'hdr'
  hdr->e_phoff                  = bswap_ad(hdr->e_phoff);
  ^
/wrkdirs/usr/ports/www/nspluginwrapper/work/nspluginwrapper-1.4.4/src/npw-config-template.h:42:29: error: use of undeclared identifier 'hdr'
  hdr->e_phoff                  = bswap_ad(hdr->e_phoff);
                                           ^
/wrkdirs/usr/ports/www/nspluginwrapper/work/nspluginwrapper-1.4.4/src/npw-config-template.h:43:3: error: use of undeclared identifier 'hdr'
  hdr->e_shoff                  = bswap_ad(hdr->e_shoff);
  ^
/wrkdirs/usr/ports/www/nspluginwrapper/work/nspluginwrapper-1.4.4/src/npw-config-template.h:43:29: error: use of undeclared identifier 'hdr'
  hdr->e_shoff                  = bswap_ad(hdr->e_shoff);
                                           ^
/wrkdirs/usr/ports/www/nspluginwrapper/work/nspluginwrapper-1.4.4/src/npw-config-template.h:44:3: error: use of undeclared identifier 'hdr'
  hdr->e_flags                  = bswap_32(hdr->e_flags);
  ^
fatal error: too many errors emitted, stopping now [-ferror-limit=]
2 warnings and 20 errors generated.
gmake[1]: *** [Makefile:330: npconfig-npw-config.o] Error 1
gmake[1]: *** Waiting for unfinished jobs....
gmake[1]: Leaving directory '/wrkdirs/usr/ports/www/nspluginwrapper/work/nspluginwrapper-1.4.4'
===> Compilation failed unexpectedly.
Try to set MAKE_JOBS_UNSAFE=yes and rebuild before reporting the failure to
the maintainer.
*** Error code 1

Stop.
make: stopped in /usr/ports/www/nspluginwrapper
Received on Thu Sep 02 2021 - 12:10:46 UTC

Original text of this message