[package - main-amd64-default][lang/rust-bootstrap] Failed for powerpc-rust-bootstrap-1.54.0 in build

From: <pkg-fallout_at_FreeBSD.org>
Date: Thu, 2 Sep 2021 10:01:48 GMT
You are receiving this mail as a port that you maintain
is failing to build on the FreeBSD package build server.
Please investigate the failure and submit a PR to fix
build.

Maintainer:     rust_at_FreeBSD.org
Log URL:        http://beefy18.nyi.freebsd.org/data/main-amd64-default/p32835fdd312f_s7b529268a5/logs/powerpc-rust-bootstrap-1.54.0.log
Build URL:      http://beefy18.nyi.freebsd.org/build.html?mastername=main-amd64-default&build=p32835fdd312f_s7b529268a5
Log:

=>> Building lang/rust-bootstrap
build started at Thu Sep  2 07:22:48 UTC 2021
port directory: /usr/ports/lang/rust-bootstrap
package name: powerpc-rust-bootstrap-1.54.0
building for: FreeBSD main-amd64-default-job-05 14.0-CURRENT FreeBSD 14.0-CURRENT 1400032 amd64
maintained by: rust_at_FreeBSD.org
Makefile ident: 
Poudriere version: 3.2.8-21-g883afb07
Host OSVERSION: 1400008
Jail OSVERSION: 1400032
Job Id: 05




!!! Jail is newer than host. (Jail: 1400032, Host: 1400008) !!!
!!! This is not supported. !!!
!!! Host kernel must be same or newer than jail. !!!
!!! Expect build failures. !!!



---Begin Environment---
SHELL=/bin/csh
OSVERSION=1400032
UNAME_v=FreeBSD 14.0-CURRENT 1400032
UNAME_r=14.0-CURRENT
BLOCKSIZE=K
MAIL=/var/mail/root
MM_CHARSET=UTF-8
LANG=C.UTF-8
STATUS=1
HOME=/root
PATH=/sbin:/bin:/usr/sbin:/usr/bin:/usr/local/sbin:/usr/local/bin:/root/bin
LOCALBASE=/usr/local
USER=root
LIBEXECPREFIX=/usr/local/libexec/poudriere
POUDRIERE_VERSION=3.2.8-21-g883afb07
MASTERMNT=/usr/local/poudriere/data/.m/main-amd64-default/ref
POUDRIERE_BUILD_TYPE=bulk
PACKAGE_BUILDING=yes
SAVED_TERM=
PWD=/usr/local/poudriere/data/.m/main-amd64-default/ref/.p/pool
P_PORTS_FEATURES=FLAVORS SELECTED_OPTIONS
MASTERNAME=main-amd64-default
SCRIPTPREFIX=/usr/local/share/poudriere
OLDPWD=/usr/local/poudriere/data/.m/main-amd64-default/ref/.p
SCRIPTPATH=/usr/local/share/poudriere/bulk.sh
POUDRIEREPATH=/usr/local/bin/poudriere
---End Environment---

---Begin Poudriere Port Flags/Env---
PORT_FLAGS=
PKGENV=
FLAVOR=powerpc
DEPENDS_ARGS=
MAKE_ARGS= FLAVOR=powerpc
---End Poudriere Port Flags/Env---

---Begin OPTIONS List---
---End OPTIONS List---

--MAINTAINER--
rust_at_FreeBSD.org
--End MAINTAINER--

--CONFIGURE_ARGS--

--End CONFIGURE_ARGS--

--CONFIGURE_ENV--
ac_cv_path_PERL=/usr/local/bin/perl ac_cv_path_PERL_PATH=/usr/local/bin/perl  PERL_USE_UNSAFE_INC=1 PYTHON="/usr/local/bin/python3.8" XDG_DATA_HOME=/wrkdirs/usr/ports/lang/rust-bootstrap/work-powerpc  XDG_CONFIG_HOME=/wrkdirs/usr/ports/lang/rust-bootstrap/work-powerpc  HOME=/wrkdirs/usr/ports/lang/rust-bootstrap/work-powerpc TMPDIR="/tmp" PATH=/wrkdirs/usr/ports/lang/rust-bootstrap/work-powerpc/.bin:/sbin:/bin:/usr/sbin:/usr/bin:/usr/local/sbin:/usr/local/bin:/root/bin SHELL=/bin/sh CONFIG_SHELL=/bin/sh
--End CONFIGURE_ENV--

--MAKE_ENV--
NINJA_STATUS="[%p %s/%t] " PERL_USE_UNSAFE_INC=1 XDG_DATA_HOME=/wrkdirs/usr/ports/lang/rust-bootstrap/work-powerpc  XDG_CONFIG_HOME=/wrkdirs/usr/ports/lang/rust-bootstrap/work-powerpc  HOME=/wrkdirs/usr/ports/lang/rust-bootstrap/work-powerpc TMPDIR="/tmp" PATH=/wrkdirs/usr/ports/lang/rust-bootstrap/work-powerpc/.bin:/sbin:/bin:/usr/sbin:/usr/bin:/usr/local/sbin:/usr/local/bin:/root/bin NO_PIE=yes MK_DEBUG_FILES=no MK_KERNEL_SYMBOLS=no SHELL=/bin/sh NO_LINT=YES PREFIX=/usr/local  LOCALBASE=/usr/local  CC="cc" CFLAGS="-O2 -pipe  -fstack-protector-strong -fno-strict-aliasing "  CPP="cpp" CPPFLAGS=""  LDFLAGS=" -fstack-protector-strong " LIBS=""  CXX="c++" CXXFLAGS="-O2 -pipe -fstack-protector-strong -fno-strict-aliasing  "  MANPREFIX="/usr/local" BSD_INSTALL_PROGRAM="install  -s -m 555"  BSD_INSTALL_LIB="install  -s -m 0644"  BSD_INSTALL_SCRIPT="install  -m 555"  BSD_INSTALL_DATA="install  -m 0644"  BSD_INSTALL_MAN="install  -m 444"
--End MAKE_ENV--

--PLIST_SUB--
PYTHON_INCLUDEDIR=include/python3.8  PYTHON_LIBDIR=lib/python3.8  PYTHON_PLATFORM=freebsd14  PYTHON_SITELIBDIR=lib/python3.8/site-packages  PYTHON_SUFFIX=38  PYTHON_EXT_SUFFIX=.cpython-38  PYTHON_VER=3.8  PYTHON_VERSION=python3.8 PYTHON2="_at_comment " PYTHON3="" OSREL=14.0 PREFIX=%D LOCALBASE=/usr/local  RESETPREFIX=/usr/local LIB32DIR=lib PERL_VERSION=5.32.1  PERL_VER=5.32  PERL5_MAN1=lib/perl5/site_perl/man/man1  PERL5_MAN3=lib/perl5/site_perl/man/man3  SITE_PERL=lib/perl5/site_perl  SITE_ARCH=lib/perl5/site_perl/mach/5.32 DOCSDIR="share/doc/rust"  EXAMPLESDIR="share/examples/rust"  DATADIR="share/rust"  WWWDIR="www/rust"  ETCDIR="etc/rust"
--End PLIST_SUB--

--SUB_LIST--
PREFIX=/usr/local LOCALBASE=/usr/local  DATADIR=/usr/local/share/rust DOCSDIR=/usr/local/share/doc/rust EXAMPLESDIR=/usr/local/share/examples/rust  WWWDIR=/usr/local/www/rust ETCDIR=/usr/local/etc/rust
--End SUB_LIST--

---Begin make.conf---
USE_PACKAGE_DEPENDS=yes
BATCH=yes
WRKDIRPREFIX=/wrkdirs
PORTSDIR=/usr/ports
PACKAGES=/packages
DISTDIR=/distfiles
PACKAGE_BUILDING=yes
PACKAGE_BUILDING_FLAVORS=yes
#### /usr/local/etc/poudriere.d/make.conf ####
# XXX: We really need this but cannot use it while 'make checksum' does not
# try the next mirror on checksum failure.  It currently retries the same
# failed mirror and then fails rather then trying another.  It *does*
# try the next if the size is mismatched though.
#MASTER_SITE_FREEBSD=yes
# Build ALLOW_MAKE_JOBS_PACKAGES with 2 jobs
MAKE_JOBS_NUMBER=2
#### /usr/ports/Mk/Scripts/ports_env.sh ####
_CCVERSION_921dbbb2=FreeBSD clang version 12.0.1 (git_at_github.com:llvm/llvm-project.git llvmorg-12.0.1-0-gfed41342a82f) Target: x86_64-unknown-freebsd14.0 Thread model: posix InstalledDir: /usr/bin
_ALTCCVERSION_921dbbb2=none
_CXXINTERNAL_acaad9ca=FreeBSD clang version 12.0.1 (git_at_github.com:llvm/llvm-project.git llvmorg-12.0.1-0-gfed41342a82f) Target: x86_64-unknown-freebsd14.0 Thread model: posix InstalledDir: /usr/bin "/usr/bin/ld" "--eh-frame-hdr" "-dynamic-linker" "/libexec/ld-elf.so.1" "--hash-style=both" "--enable-new-dtags" "-o" "a.out" "/usr/lib/crt1.o" "/usr/lib/crti.o" "/usr/lib/crtbegin.o" "-L/usr/lib" "/dev/null" "-lc++" "-lm" "-lgcc" "--as-needed" "-lgcc_s" "--no-as-needed" "-lc" "-lgcc" "--as-needed" "-lgcc_s" "--no-as-needed" "/usr/lib/crtend.o" "/usr/lib/crtn.o"
CC_OUTPUT_921dbbb2_58173849=yes
CC_OUTPUT_921dbbb2_9bdba57c=yes
CC_OUTPUT_921dbbb2_6a4fe7f5=yes
CC_OUTPUT_921dbbb2_6bcac02b=yes
CC_OUTPUT_921dbbb2_67d20829=yes
CC_OUTPUT_921dbbb2_bfa62e83=yes
CC_OUTPUT_921dbbb2_f0b4d593=yes
CC_OUTPUT_921dbbb2_308abb44=yes
CC_OUTPUT_921dbbb2_f00456e5=yes
CC_OUTPUT_921dbbb2_65ad290d=yes
CC_OUTPUT_921dbbb2_f2776b26=yes
CC_OUTPUT_921dbbb2_b2657cc3=yes
CC_OUTPUT_921dbbb2_380987f7=yes
CC_OUTPUT_921dbbb2_160933ec=yes
CC_OUTPUT_921dbbb2_fb62803b=yes
_OBJC_CCVERSION_921dbbb2=FreeBSD clang version 12.0.1 (git_at_github.com:llvm/llvm-project.git llvmorg-12.0.1-0-gfed41342a82f) Target: x86_64-unknown-freebsd14.0 Thread model: posix InstalledDir: /usr/bin
_OBJC_ALTCCVERSION_921dbbb2=none
ARCH=amd64
OPSYS=FreeBSD
_OSRELEASE=14.0-CURRENT
OSREL=14.0
OSVERSION=1400032
PYTHONBASE=/usr/local
HAVE_COMPAT_IA32_KERN=YES
CONFIGURE_MAX_CMD_LEN=524288
HAVE_PORTS_ENV=1
#### Misc Poudriere ####
GID=0
UID=0
---End make.conf---
--Resource limits--
cpu time               (seconds, -t)  unlimited
file size           (512-blocks, -f)  unlimited
data seg size           (kbytes, -d)  33554432
stack size              (kbytes, -s)  524288
core file size      (512-blocks, -c)  unlimited
max memory size         (kbytes, -m)  unlimited
locked memory           (kbytes, -l)  unlimited
max user processes              (-u)  89999
open files                      (-n)  1024
virtual mem size        (kbytes, -v)  unlimited
swap limit              (kbytes, -w)  unlimited
socket buffer size       (bytes, -b)  unlimited
pseudo-terminals                (-p)  unlimited
kqueues                         (-k)  unlimited
umtx shared locks               (-o)  unlimited
--End resource limits--
=======================<phase: check-sanity   >============================
===>  License APACHE20 MIT accepted by the user
===========================================================================
=======================<phase: pkg-depends    >============================
===>   powerpc-rust-bootstrap-1.54.0 depends on file: /usr/local/sbin/pkg - not found
===>   Installing existing package /packages/All/pkg-1.17.1.pkg
[main-amd64-default-job-05] Installing pkg-1.17.1...
[main-amd64-default-job-05] Extracting pkg-1.17.1: .......... done
===>   powerpc-rust-bootstrap-1.54.0 depends on file: /usr/local/sbin/pkg - found
===>   Returning to build of powerpc-rust-bootstrap-1.54.0
===========================================================================
=======================<phase: fetch-depends  >============================
===========================================================================
=======================<phase: fetch          >============================
===>  License APACHE20 MIT accepted by the user
===> Fetching all distfiles required by powerpc-rust-bootstrap-1.54.0 for building
===========================================================================
=======================<phase: checksum       >============================
===>  License APACHE20 MIT accepted by the user
===> Fetching all distfiles required by powerpc-rust-bootstrap-1.54.0 for building
=> SHA256 Checksum OK for rust/rustc-1.54.0-src.tar.xz.
=> SHA256 Checksum OK for rust/bootstrap/FreeBSD-13.0-RELEASE-powerpc.tar.xz.
===========================================================================
=======================<phase: extract-depends>============================
===========================================================================
=======================<phase: extract        >============================
===>  License APACHE20 MIT accepted by the user
===> Fetching all distfiles required by powerpc-rust-bootstrap-1.54.0 for building
===>  Extracting for powerpc-rust-bootstrap-1.54.0
=> SHA256 Checksum OK for rust/rustc-1.54.0-src.tar.xz.
=> SHA256 Checksum OK for rust/bootstrap/FreeBSD-13.0-RELEASE-powerpc.tar.xz.
===========================================================================
=======================<phase: patch-depends  >============================
===========================================================================
=======================<phase: patch          >============================
===>  Patching for powerpc-rust-bootstrap-1.54.0
===>  Applying extra patch patches for powerpc-rust-bootstrap-1.54.0 from /usr/ports/lang/rust-bootstrap/../rust/files/powerpc
===>  Applying FreeBSD patches for powerpc-rust-bootstrap-1.54.0 from /usr/ports/lang/rust-bootstrap/../rust/files
===========================================================================
=======================<phase: build-depends  >============================
===>   powerpc-rust-bootstrap-1.54.0 depends on executable: cmake - not found
===>   Installing existing package /packages/All/cmake-3.21.0.pkg
[main-amd64-default-job-05] Installing cmake-3.21.0...
[main-amd64-default-job-05] `-- Installing curl-7.78.0...
[main-amd64-default-job-05] |   `-- Installing ca_root_nss-3.69...
<snip>
    --> /wrkdirs/usr/ports/lang/rust-bootstrap/work-powerpc/rustc-1.54.0-src/vendor/libc-0.2.93/src/unix/bsd/freebsdlike/freebsd/mod.rs:1433:24
     |
1433 |         file: *const ::c_char,
     |                        ^^^^^^ help: a type alias with a similar name exists: `c_schar`
     | 
    ::: /wrkdirs/usr/ports/lang/rust-bootstrap/work-powerpc/rustc-1.54.0-src/vendor/libc-0.2.93/src/unix/mod.rs:6:1
     |
6    | pub type c_schar = i8;
     | ---------------------- similarly named type alias `c_schar` defined here

error[E0412]: cannot find type `c_char` in the crate root
    --> /wrkdirs/usr/ports/lang/rust-bootstrap/work-powerpc/rustc-1.54.0-src/vendor/libc-0.2.93/src/unix/bsd/freebsdlike/freebsd/mod.rs:1436:29
     |
1436 |         argv: *const *mut ::c_char,
     |                             ^^^^^^ help: a type alias with a similar name exists: `c_schar`
     | 
    ::: /wrkdirs/usr/ports/lang/rust-bootstrap/work-powerpc/rustc-1.54.0-src/vendor/libc-0.2.93/src/unix/mod.rs:6:1
     |
6    | pub type c_schar = i8;
     | ---------------------- similarly named type alias `c_schar` defined here

error[E0412]: cannot find type `c_char` in the crate root
    --> /wrkdirs/usr/ports/lang/rust-bootstrap/work-powerpc/rustc-1.54.0-src/vendor/libc-0.2.93/src/unix/bsd/freebsdlike/freebsd/mod.rs:1437:29
     |
1437 |         envp: *const *mut ::c_char,
     |                             ^^^^^^ help: a type alias with a similar name exists: `c_schar`
     | 
    ::: /wrkdirs/usr/ports/lang/rust-bootstrap/work-powerpc/rustc-1.54.0-src/vendor/libc-0.2.93/src/unix/mod.rs:6:1
     |
6    | pub type c_schar = i8;
     | ---------------------- similarly named type alias `c_schar` defined here

error[E0412]: cannot find type `c_char` in the crate root
    --> /wrkdirs/usr/ports/lang/rust-bootstrap/work-powerpc/rustc-1.54.0-src/vendor/libc-0.2.93/src/unix/bsd/freebsdlike/freebsd/mod.rs:1486:24
     |
1486 |         path: *const ::c_char,
     |                        ^^^^^^ help: a type alias with a similar name exists: `c_schar`
     | 
    ::: /wrkdirs/usr/ports/lang/rust-bootstrap/work-powerpc/rustc-1.54.0-src/vendor/libc-0.2.93/src/unix/mod.rs:6:1
     |
6    | pub type c_schar = i8;
     | ---------------------- similarly named type alias `c_schar` defined here

error[E0412]: cannot find type `c_char` in the crate root
    --> /wrkdirs/usr/ports/lang/rust-bootstrap/work-powerpc/rustc-1.54.0-src/vendor/libc-0.2.93/src/unix/bsd/freebsdlike/freebsd/mod.rs:1501:34
     |
1501 |     pub fn statfs(path: *const ::c_char, buf: *mut statfs) -> ::c_int;
     |                                  ^^^^^^ help: a type alias with a similar name exists: `c_schar`
     | 
    ::: /wrkdirs/usr/ports/lang/rust-bootstrap/work-powerpc/rustc-1.54.0-src/vendor/libc-0.2.93/src/unix/mod.rs:6:1
     |
6    | pub type c_schar = i8;
     | ---------------------- similarly named type alias `c_schar` defined here

error[E0412]: cannot find type `c_char` in the crate root
    --> /wrkdirs/usr/ports/lang/rust-bootstrap/work-powerpc/rustc-1.54.0-src/vendor/libc-0.2.93/src/unix/bsd/freebsdlike/freebsd/mod.rs:1535:29
     |
1535 |         string: *mut *mut ::c_char,
     |                             ^^^^^^ help: a type alias with a similar name exists: `c_schar`
     | 
    ::: /wrkdirs/usr/ports/lang/rust-bootstrap/work-powerpc/rustc-1.54.0-src/vendor/libc-0.2.93/src/unix/mod.rs:6:1
     |
6    | pub type c_schar = i8;
     | ---------------------- similarly named type alias `c_schar` defined here

error[E0412]: cannot find type `c_char` in the crate root
    --> /wrkdirs/usr/ports/lang/rust-bootstrap/work-powerpc/rustc-1.54.0-src/vendor/libc-0.2.93/src/unix/bsd/freebsdlike/freebsd/mod.rs:1538:26
     |
1538 |         string: *const ::c_char,
     |                          ^^^^^^ help: a type alias with a similar name exists: `c_schar`
     | 
    ::: /wrkdirs/usr/ports/lang/rust-bootstrap/work-powerpc/rustc-1.54.0-src/vendor/libc-0.2.93/src/unix/mod.rs:6:1
     |
6    | pub type c_schar = i8;
     | ---------------------- similarly named type alias `c_schar` defined here

error[E0412]: cannot find type `time_t` in the crate root
  --> /wrkdirs/usr/ports/lang/rust-bootstrap/work-powerpc/rustc-1.54.0-src/vendor/libc-0.2.93/src/unix/bsd/freebsdlike/freebsd/freebsd11/mod.rs:28:26
   |
28 |         pub shm_atime: ::time_t,
   |                          ^^^^^^ help: a type alias with a similar name exists: `size_t`
   | 
  ::: /wrkdirs/usr/ports/lang/rust-bootstrap/work-powerpc/rustc-1.54.0-src/vendor/libc-0.2.93/src/unix/mod.rs:19:1
   |
19 | pub type size_t = usize;
   | ------------------------ similarly named type alias `size_t` defined here

error[E0412]: cannot find type `time_t` in the crate root
  --> /wrkdirs/usr/ports/lang/rust-bootstrap/work-powerpc/rustc-1.54.0-src/vendor/libc-0.2.93/src/unix/bsd/freebsdlike/freebsd/freebsd11/mod.rs:29:26
   |
29 |         pub shm_dtime: ::time_t,
   |                          ^^^^^^ help: a type alias with a similar name exists: `size_t`
   | 
  ::: /wrkdirs/usr/ports/lang/rust-bootstrap/work-powerpc/rustc-1.54.0-src/vendor/libc-0.2.93/src/unix/mod.rs:19:1
   |
19 | pub type size_t = usize;
   | ------------------------ similarly named type alias `size_t` defined here

error[E0412]: cannot find type `time_t` in the crate root
  --> /wrkdirs/usr/ports/lang/rust-bootstrap/work-powerpc/rustc-1.54.0-src/vendor/libc-0.2.93/src/unix/bsd/freebsdlike/freebsd/freebsd11/mod.rs:30:26
   |
30 |         pub shm_ctime: ::time_t,
   |                          ^^^^^^ help: a type alias with a similar name exists: `size_t`
   | 
  ::: /wrkdirs/usr/ports/lang/rust-bootstrap/work-powerpc/rustc-1.54.0-src/vendor/libc-0.2.93/src/unix/mod.rs:19:1
   |
19 | pub type size_t = usize;
   | ------------------------ similarly named type alias `size_t` defined here

error[E0412]: cannot find type `c_char` in the crate root
  --> /wrkdirs/usr/ports/lang/rust-bootstrap/work-powerpc/rustc-1.54.0-src/vendor/libc-0.2.93/src/unix/bsd/freebsdlike/freebsd/freebsd11/mod.rs:41:24
   |
41 |         pub d_name: [::c_char; 256],
   |                        ^^^^^^ help: a type alias with a similar name exists: `c_schar`
   | 
  ::: /wrkdirs/usr/ports/lang/rust-bootstrap/work-powerpc/rustc-1.54.0-src/vendor/libc-0.2.93/src/unix/mod.rs:6:1
   |
6  | pub type c_schar = i8;
   | ---------------------- similarly named type alias `c_schar` defined here

error[E0412]: cannot find type `c_char` in the crate root
  --> /wrkdirs/usr/ports/lang/rust-bootstrap/work-powerpc/rustc-1.54.0-src/vendor/libc-0.2.93/src/unix/bsd/freebsdlike/freebsd/freebsd11/mod.rs:63:25
   |
63 |         f_charspare: [::c_char; 80],
   |                         ^^^^^^ help: a type alias with a similar name exists: `c_schar`
   | 
  ::: /wrkdirs/usr/ports/lang/rust-bootstrap/work-powerpc/rustc-1.54.0-src/vendor/libc-0.2.93/src/unix/mod.rs:6:1
   |
6  | pub type c_schar = i8;
   | ---------------------- similarly named type alias `c_schar` defined here

error[E0412]: cannot find type `c_char` in the crate root
  --> /wrkdirs/usr/ports/lang/rust-bootstrap/work-powerpc/rustc-1.54.0-src/vendor/libc-0.2.93/src/unix/bsd/freebsdlike/freebsd/freebsd11/mod.rs:64:30
   |
64 |         pub f_fstypename: [::c_char; 16],
   |                              ^^^^^^ help: a type alias with a similar name exists: `c_schar`
   | 
  ::: /wrkdirs/usr/ports/lang/rust-bootstrap/work-powerpc/rustc-1.54.0-src/vendor/libc-0.2.93/src/unix/mod.rs:6:1
   |
6  | pub type c_schar = i8;
   | ---------------------- similarly named type alias `c_schar` defined here

error[E0412]: cannot find type `c_char` in the crate root
  --> /wrkdirs/usr/ports/lang/rust-bootstrap/work-powerpc/rustc-1.54.0-src/vendor/libc-0.2.93/src/unix/bsd/freebsdlike/freebsd/freebsd11/mod.rs:66:31
   |
66 |         pub f_mntfromname: [::c_char; 88],
   |                               ^^^^^^ help: a type alias with a similar name exists: `c_schar`
   | 
  ::: /wrkdirs/usr/ports/lang/rust-bootstrap/work-powerpc/rustc-1.54.0-src/vendor/libc-0.2.93/src/unix/mod.rs:6:1
   |
6  | pub type c_schar = i8;
   | ---------------------- similarly named type alias `c_schar` defined here

error[E0412]: cannot find type `c_char` in the crate root
  --> /wrkdirs/usr/ports/lang/rust-bootstrap/work-powerpc/rustc-1.54.0-src/vendor/libc-0.2.93/src/unix/bsd/freebsdlike/freebsd/freebsd11/mod.rs:68:29
   |
68 |         pub f_mntonname: [::c_char; 88],
   |                             ^^^^^^ help: a type alias with a similar name exists: `c_schar`
   | 
  ::: /wrkdirs/usr/ports/lang/rust-bootstrap/work-powerpc/rustc-1.54.0-src/vendor/libc-0.2.93/src/unix/mod.rs:6:1
   |
6  | pub type c_schar = i8;
   | ---------------------- similarly named type alias `c_schar` defined here

error[E0412]: cannot find type `c_long` in the crate root
   --> /wrkdirs/usr/ports/lang/rust-bootstrap/work-powerpc/rustc-1.54.0-src/vendor/libc-0.2.93/src/unix/bsd/freebsdlike/freebsd/freebsd11/mod.rs:211:19
    |
211 |         msgtyp: ::c_long,
    |                   ^^^^^^ not found in the crate root

error: aborting due to 543 previous errors

Some errors have detailed explanations: E0412, E0425, E0573.
For more information about an error, try `rustc --explain E0412`.

Did not run successfully: exit status: 1
"/wrkdirs/usr/ports/lang/rust-bootstrap/work-powerpc/rustc-1.54.0-src/build/x86_64-unknown-freebsd/stage1/bin/rustc" "--crate-name" "libc" "/wrkdirs/usr/ports/lang/rust-bootstrap/work-powerpc/rustc-1.54.0-src/vendor/libc-0.2.93/src/lib.rs" "--error-format=json" "--json=diagnostic-rendered-ansi,artifacts" "--crate-type" "lib" "--emit=dep-info,metadata,link" "-C" "opt-level=3" "-C" "embed-bitcode=no" "-C" "debuginfo=0" "--cfg" "feature=\"align\"" "--cfg" "feature=\"rustc-dep-of-std\"" "--cfg" "feature=\"rustc-std-workspace-core\"" "-C" "metadata=344cf26ba486c2c7" "-C" "extra-filename=-344cf26ba486c2c7" "--out-dir" "/wrkdirs/usr/ports/lang/rust-bootstrap/work-powerpc/rustc-1.54.0-src/build/x86_64-unknown-freebsd/stage1-std/powerpc-unknown-freebsd/release/deps" "--target" "powerpc-unknown-freebsd" "-C" "linker=/wrkdirs/usr/ports/lang/rust-bootstrap/work-powerpc/powerpc-unknown-freebsd-cc" "-L" "dependency=/wrkdirs/usr/ports/lang/rust-bootstrap/work-powerpc/rustc-1.54.0-src/build/x86_64-u
 nknown-freebsd/stage1-std/powerpc-unknown-freebsd/release/deps" "-L" "dependency=/wrkdirs/usr/ports/lang/rust-bootstrap/work-powerpc/rustc-1.54.0-src/build/x86_64-unknown-freebsd/stage1-std/release/deps" "--extern" "rustc_std_workspace_core=/wrkdirs/usr/ports/lang/rust-bootstrap/work-powerpc/rustc-1.54.0-src/build/x86_64-unknown-freebsd/stage1-std/powerpc-unknown-freebsd/release/deps/librustc_std_workspace_core-c0326c68e0ce0f9a.rmeta" "--cap-lints" "allow" "-Zmacro-backtrace" "-Clink-args=-Wl,-rpath,$ORIGIN/../lib" "-Cprefer-dynamic" "-Cembed-bitcode=yes" "-Zcrate-attr=doc(html_root_url=\"https://doc.rust-lang.org/1.54.0/\")" "-Z" "binary-dep-depinfo" "--cfg" "freebsd11" "--cfg" "libc_priv_mod_use" "--cfg" "libc_union" "--cfg" "libc_const_size_of" "--cfg" "libc_align" "--cfg" "libc_core_cvoid" "--cfg" "libc_packedN" "--cfg" "libc_cfg_target_vendor" "--cfg" "libc_thread_local" "-Wrust_2018_idioms" "-Wunused_lifetimes" "-Wsemicolon_in_expressions_from_macros" "--sysroot" "/wrkdirs/usr
 /ports/lang/rust-bootstrap/work-powerpc/rust!
 c-1.54.0-src/build/x86_64-unknown-freebsd/stage1" "-Z" "force-unstable-if-unmarked"
-------------
error: could not compile `libc`

Caused by:
  process didn't exit successfully: `/wrkdirs/usr/ports/lang/rust-bootstrap/work-powerpc/rustc-1.54.0-src/build/bootstrap/debug/rustc --crate-name libc /wrkdirs/usr/ports/lang/rust-bootstrap/work-powerpc/rustc-1.54.0-src/vendor/libc-0.2.93/src/lib.rs --error-format=json --json=diagnostic-rendered-ansi,artifacts --crate-type lib --emit=dep-info,metadata,link -C opt-level=3 -C embed-bitcode=no -C debuginfo=0 --cfg 'feature="align"' --cfg 'feature="rustc-dep-of-std"' --cfg 'feature="rustc-std-workspace-core"' -C metadata=344cf26ba486c2c7 -C extra-filename=-344cf26ba486c2c7 --out-dir /wrkdirs/usr/ports/lang/rust-bootstrap/work-powerpc/rustc-1.54.0-src/build/x86_64-unknown-freebsd/stage1-std/powerpc-unknown-freebsd/release/deps --target powerpc-unknown-freebsd -C linker=/wrkdirs/usr/ports/lang/rust-bootstrap/work-powerpc/powerpc-unknown-freebsd-cc -L dependency=/wrkdirs/usr/ports/lang/rust-bootstrap/work-powerpc/rustc-1.54.0-src/build/x86_64-unknown-freebsd/stage1-std/powerpc-unknown-free
 bsd/release/deps -L dependency=/wrkdirs/usr/ports/lang/rust-bootstrap/work-powerpc/rustc-1.54.0-src/build/x86_64-unknown-freebsd/stage1-std/release/deps --extern rustc_std_workspace_core=/wrkdirs/usr/ports/lang/rust-bootstrap/work-powerpc/rustc-1.54.0-src/build/x86_64-unknown-freebsd/stage1-std/powerpc-unknown-freebsd/release/deps/librustc_std_workspace_core-c0326c68e0ce0f9a.rmeta --cap-lints allow -Zmacro-backtrace '-Clink-args=-Wl,-rpath,$ORIGIN/../lib' -Cprefer-dynamic -Cembed-bitcode=yes '-Zcrate-attr=doc(html_root_url="https://doc.rust-lang.org/1.54.0/")' -Z binary-dep-depinfo --cfg freebsd11 --cfg libc_priv_mod_use --cfg libc_union --cfg libc_const_size_of --cfg libc_align --cfg libc_core_cvoid --cfg libc_packedN --cfg libc_cfg_target_vendor --cfg libc_thread_local` (exit status: 1)
warning: build failed, waiting for other jobs to finish...
error: build failed
command did not execute successfully: "/usr/local/bin/cargo" "build" "--target" "powerpc-unknown-freebsd" "-Zbinary-dep-depinfo" "-j" "2" "-v" "--release" "--frozen" "--features" "panic-unwind backtrace compiler-builtins-c" "--manifest-path" "/wrkdirs/usr/ports/lang/rust-bootstrap/work-powerpc/rustc-1.54.0-src/library/test/Cargo.toml" "--message-format" "json-render-diagnostics"
expected success, got: exit status: 101
Traceback (most recent call last):
  File "x.py", line 27, in <module>
    bootstrap.main()
  File "/wrkdirs/usr/ports/lang/rust-bootstrap/work-powerpc/rustc-1.54.0-src/src/bootstrap/bootstrap.py", line 1195, in main
    bootstrap(help_triggered)
  File "/wrkdirs/usr/ports/lang/rust-bootstrap/work-powerpc/rustc-1.54.0-src/src/bootstrap/bootstrap.py", line 1181, in bootstrap
    run(args, env=env, verbose=build.verbose)
  File "/wrkdirs/usr/ports/lang/rust-bootstrap/work-powerpc/rustc-1.54.0-src/src/bootstrap/bootstrap.py", line 153, in run
    raise RuntimeError(err)
RuntimeError: failed to run: /wrkdirs/usr/ports/lang/rust-bootstrap/work-powerpc/rustc-1.54.0-src/build/bootstrap/debug/bootstrap dist --jobs=2 cargo src/librustc library/std
*** Error code 1

Stop.
make: stopped in /usr/ports/lang/rust-bootstrap
Received on Thu Sep 02 2021 - 10:01:48 UTC

Original text of this message