[package - 122arm64-quarterly][devel/wasm3] Failed for wasm3-0.5.0 in build

From: <pkg-fallout_at_FreeBSD.org>
Date: Sun, 31 Oct 2021 02:42:53 GMT
You are receiving this mail as a port that you maintain
is failing to build on the FreeBSD package build server.
Please investigate the failure and submit a PR to fix
build.

Maintainer:     freebsd_at_sysctl.cz
Log URL:        http://ampere1.nyi.freebsd.org/data/122arm64-quarterly/5819edc42a83/logs/wasm3-0.5.0.log
Build URL:      http://ampere1.nyi.freebsd.org/build.html?mastername=122arm64-quarterly&build=5819edc42a83
Log:

=>> Building devel/wasm3
build started at Sun Oct 31 02:42:44 UTC 2021
port directory: /usr/ports/devel/wasm3
package name: wasm3-0.5.0
building for: FreeBSD 122arm64-quarterly-job-01 12.2-RELEASE FreeBSD 12.2-RELEASE arm64
maintained by: freebsd_at_sysctl.cz
Makefile ident: 
Poudriere version: 3.2.8-21-g883afb07
Host OSVERSION: 1400008
Jail OSVERSION: 1202000
Job Id: 01

---Begin Environment---
SHELL=/bin/csh
OSVERSION=1202000
UNAME_v=FreeBSD 12.2-RELEASE
UNAME_r=12.2-RELEASE
BLOCKSIZE=K
MAIL=/var/mail/root
STATUS=1
HOME=/root
PATH=/sbin:/bin:/usr/sbin:/usr/bin:/usr/local/sbin:/usr/local/bin:/root/bin
LOCALBASE=/usr/local
USER=root
LIBEXECPREFIX=/usr/local/libexec/poudriere
POUDRIERE_VERSION=3.2.8-21-g883afb07
MASTERMNT=/usr/local/poudriere/data/.m/122arm64-quarterly/ref
POUDRIERE_BUILD_TYPE=bulk
PACKAGE_BUILDING=yes
SAVED_TERM=
PWD=/usr/local/poudriere/data/.m/122arm64-quarterly/ref/.p/pool
P_PORTS_FEATURES=FLAVORS SELECTED_OPTIONS
MASTERNAME=122arm64-quarterly
SCRIPTPREFIX=/usr/local/share/poudriere
OLDPWD=/usr/local/poudriere/data/.m/122arm64-quarterly/ref/.p
SCRIPTPATH=/usr/local/share/poudriere/bulk.sh
POUDRIEREPATH=/usr/local/bin/poudriere
---End Environment---

---Begin Poudriere Port Flags/Env---
PORT_FLAGS=
PKGENV=
FLAVOR=
DEPENDS_ARGS=
MAKE_ARGS=
---End Poudriere Port Flags/Env---

---Begin OPTIONS List---
---End OPTIONS List---

--MAINTAINER--
freebsd_at_sysctl.cz
--End MAINTAINER--

--CONFIGURE_ARGS--

--End CONFIGURE_ARGS--

--CONFIGURE_ENV--
XDG_DATA_HOME=/wrkdirs/usr/ports/devel/wasm3/work  XDG_CONFIG_HOME=/wrkdirs/usr/ports/devel/wasm3/work  HOME=/wrkdirs/usr/ports/devel/wasm3/work TMPDIR="/tmp" PATH=/wrkdirs/usr/ports/devel/wasm3/work/.bin:/sbin:/bin:/usr/sbin:/usr/bin:/usr/local/sbin:/usr/local/bin:/root/bin SHELL=/bin/sh CONFIG_SHELL=/bin/sh CMAKE_PREFIX_PATH="/usr/local"
--End CONFIGURE_ENV--

--MAKE_ENV--
NINJA_STATUS="[%p %s/%t] " XDG_DATA_HOME=/wrkdirs/usr/ports/devel/wasm3/work  XDG_CONFIG_HOME=/wrkdirs/usr/ports/devel/wasm3/work  HOME=/wrkdirs/usr/ports/devel/wasm3/work TMPDIR="/tmp" PATH=/wrkdirs/usr/ports/devel/wasm3/work/.bin:/sbin:/bin:/usr/sbin:/usr/bin:/usr/local/sbin:/usr/local/bin:/root/bin NO_PIE=yes MK_DEBUG_FILES=no MK_KERNEL_SYMBOLS=no SHELL=/bin/sh NO_LINT=YES DESTDIR=/wrkdirs/usr/ports/devel/wasm3/work/stage PREFIX=/usr/local  LOCALBASE=/usr/local  CC="cc" CFLAGS="-O2 -pipe  -fstack-protector-strong -isystem /usr/local/include -fno-strict-aliasing "  CPP="cpp" CPPFLAGS="-isystem /usr/local/include"  LDFLAGS=" -fstack-protector-strong -L/usr/local/lib " LIBS=""  CXX="c++" CXXFLAGS="-O2 -pipe -fstack-protector-strong -isystem /usr/local/include -fno-strict-aliasing  -isystem /usr/local/include "  MANPREFIX="/usr/local" BSD_INSTALL_PROGRAM="install  -s -m 555"  BSD_INSTALL_LIB="install  -s -m 0644"  BSD_INSTALL_SCRIPT="install  -m 555"  BSD_INSTALL_DATA="install  -m 064
 4"  BSD_INSTALL_MAN="install  -m 444"
--End MAKE_ENV--

--PLIST_SUB--
CMAKE_BUILD_TYPE="release" OSREL=12.2 PREFIX=%D LOCALBASE=/usr/local  RESETPREFIX=/usr/local LIB32DIR=lib DOCSDIR="share/doc/wasm3"  EXAMPLESDIR="share/examples/wasm3"  DATADIR="share/wasm3"  WWWDIR="www/wasm3"  ETCDIR="etc/wasm3"
--End PLIST_SUB--

--SUB_LIST--
PREFIX=/usr/local LOCALBASE=/usr/local  DATADIR=/usr/local/share/wasm3 DOCSDIR=/usr/local/share/doc/wasm3 EXAMPLESDIR=/usr/local/share/examples/wasm3  WWWDIR=/usr/local/www/wasm3 ETCDIR=/usr/local/etc/wasm3
--End SUB_LIST--

---Begin make.conf---
USE_PACKAGE_DEPENDS=yes
BATCH=yes
WRKDIRPREFIX=/wrkdirs
PORTSDIR=/usr/ports
PACKAGES=/packages
DISTDIR=/distfiles
PACKAGE_BUILDING=yes
PACKAGE_BUILDING_FLAVORS=yes
#### /usr/local/etc/poudriere.d/make.conf ####
# XXX: We really need this but cannot use it while 'make checksum' does not
# try the next mirror on checksum failure.  It currently retries the same
# failed mirror and then fails rather then trying another.  It *does*
# try the next if the size is mismatched though.
#MASTER_SITE_FREEBSD=yes
# Build ALLOW_MAKE_JOBS_PACKAGES with 2 jobs
MAKE_JOBS_NUMBER=2
#### /usr/ports/Mk/Scripts/ports_env.sh ####
_CCVERSION_921dbbb2=FreeBSD clang version 10.0.1 (git_at_github.com:llvm/llvm-project.git llvmorg-10.0.1-0-gef32c611aa2) Target: aarch64-unknown-freebsd12.2 Thread model: posix InstalledDir: /usr/bin
_ALTCCVERSION_921dbbb2=none
_CXXINTERNAL_acaad9ca=FreeBSD clang version 10.0.1 (git_at_github.com:llvm/llvm-project.git llvmorg-10.0.1-0-gef32c611aa2) Target: aarch64-unknown-freebsd12.2 Thread model: posix InstalledDir: /usr/bin "/usr/bin/ld" "--eh-frame-hdr" "-dynamic-linker" "/libexec/ld-elf.so.1" "--enable-new-dtags" "-o" "a.out" "/usr/lib/crt1.o" "/usr/lib/crti.o" "/usr/lib/crtbegin.o" "-L/usr/lib" "/dev/null" "-lc++" "-lm" "-lgcc" "--as-needed" "-lgcc_s" "--no-as-needed" "-lc" "-lgcc" "--as-needed" "-lgcc_s" "--no-as-needed" "/usr/lib/crtend.o" "/usr/lib/crtn.o"
CC_OUTPUT_921dbbb2_58173849=yes
CC_OUTPUT_921dbbb2_9bdba57c=yes
CC_OUTPUT_921dbbb2_6a4fe7f5=yes
CC_OUTPUT_921dbbb2_6bcac02b=yes
CC_OUTPUT_921dbbb2_67d20829=yes
CC_OUTPUT_921dbbb2_bfa62e83=yes
CC_OUTPUT_921dbbb2_f0b4d593=yes
CC_OUTPUT_921dbbb2_308abb44=yes
CC_OUTPUT_921dbbb2_f00456e5=yes
CC_OUTPUT_921dbbb2_65ad290d=yes
CC_OUTPUT_921dbbb2_f2776b26=yes
CC_OUTPUT_921dbbb2_b2657cc3=yes
CC_OUTPUT_921dbbb2_380987f7=yes
CC_OUTPUT_921dbbb2_160933ec=yes
CC_OUTPUT_921dbbb2_fb62803b=yes
_OBJC_CCVERSION_921dbbb2=FreeBSD clang version 10.0.1 (git_at_github.com:llvm/llvm-project.git llvmorg-10.0.1-0-gef32c611aa2) Target: aarch64-unknown-freebsd12.2 Thread model: posix InstalledDir: /usr/bin
_OBJC_ALTCCVERSION_921dbbb2=none
ARCH=aarch64
OPSYS=FreeBSD
_OSRELEASE=12.2-RELEASE
OSREL=12.2
OSVERSION=1202000
PYTHONBASE=/usr/local
CONFIGURE_MAX_CMD_LEN=524288
HAVE_PORTS_ENV=1
#### Misc Poudriere ####
GID=0
UID=0
---End make.conf---
--Resource limits--
cpu time               (seconds, -t)  unlimited
file size           (512-blocks, -f)  unlimited
data seg size           (kbytes, -d)  1048576
stack size              (kbytes, -s)  1048576
core file size      (512-blocks, -c)  unlimited
max memory size         (kbytes, -m)  unlimited
locked memory           (kbytes, -l)  unlimited
max user processes              (-u)  89999
open files                      (-n)  1024
virtual mem size        (kbytes, -v)  unlimited
swap limit              (kbytes, -w)  unlimited
socket buffer size       (bytes, -b)  unlimited
pseudo-terminals                (-p)  unlimited
kqueues                         (-k)  unlimited
umtx shared locks               (-o)  unlimited
--End resource limits--
=======================<phase: check-sanity   >============================
===>  License MIT accepted by the user
===========================================================================
=======================<phase: pkg-depends    >============================
===>   wasm3-0.5.0 depends on file: /usr/local/sbin/pkg - not found
===>   Installing existing package /packages/All/pkg-1.17.2.pkg
[122arm64-quarterly-job-01] Installing pkg-1.17.2...
[122arm64-quarterly-job-01] Extracting pkg-1.17.2: .......... done
===>   wasm3-0.5.0 depends on file: /usr/local/sbin/pkg - found
===>   Returning to build of wasm3-0.5.0
===========================================================================
=======================<phase: fetch-depends  >============================
===========================================================================
=======================<phase: fetch          >============================
===>  License MIT accepted by the user
===> Fetching all distfiles required by wasm3-0.5.0 for building
===========================================================================
=======================<phase: checksum       >============================
===>  License MIT accepted by the user
===> Fetching all distfiles required by wasm3-0.5.0 for building
=> SHA256 Checksum OK for wasm3-wasm3-v0.5.0_GH0.tar.gz.
=> SHA256 Checksum OK for vshymanskyy-uvwasi-b063d686848_GH0.tar.gz.
===========================================================================
=======================<phase: extract-depends>============================
===========================================================================
=======================<phase: extract        >============================
===>  License MIT accepted by the user
===> Fetching all distfiles required by wasm3-0.5.0 for building
===>  Extracting for wasm3-0.5.0
=> SHA256 Checksum OK for wasm3-wasm3-v0.5.0_GH0.tar.gz.
=> SHA256 Checksum OK for vshymanskyy-uvwasi-b063d686848_GH0.tar.gz.
===========================================================================
=======================<phase: patch-depends  >============================
===========================================================================
=======================<phase: patch          >============================
===>  Patching for wasm3-0.5.0
===>  Applying FreeBSD patches for wasm3-0.5.0 from /usr/ports/devel/wasm3/files
===========================================================================
=======================<phase: build-depends  >============================
===>   wasm3-0.5.0 depends on file: /usr/local/bin/cmake - not found
===>   Installing existing package /packages/All/cmake-3.21.3.pkg
[122arm64-quarterly-job-01] Installing cmake-3.21.3...
[122arm64-quarterly-job-01] `-- Installing curl-7.79.1...
[122arm64-quarterly-job-01] |   `-- Installing ca_root_nss-3.69_1...
[122arm64-quarterly-job-01] |   `-- Extracting ca_root_nss-3.69_1: ........ done
[122arm64-quarterly-job-01] |   `-- Installing libnghttp2-1.44.0...
[122arm64-quarterly-job-01] |   `-- Extracting libnghttp2-1.44.0: .......... done
[122arm64-quarterly-job-01] |   `-- Installing libssh2-1.9.0_3,3...
[122arm64-quarterly-job-01] |   `-- Extracting libssh2-1.9.0_3,3: .......... done
[122arm64-quarterly-job-01] `-- Extracting curl-7.79.1: .......... done
[122arm64-quarterly-job-01] `-- Installing expat-2.4.1...
[122arm64-quarterly-job-01] `-- Extracting expat-2.4.1: .......... done
[122arm64-quarterly-job-01] `-- Installing jsoncpp-1.9.4...
[122arm64-quarterly-job-01] `-- Extracting jsoncpp-1.9.4: .......... done
[122arm64-quarterly-job-01] `-- Installing libarchive-3.5.1,1...
[122arm64-quarterly-job-01] |   `-- Installing liblz4-1.9.3,1...
[122arm64-quarterly-job-01] |   `-- Extracting liblz4-1.9.3,1: .......... done
[122arm64-quarterly-job-01] `-- Extracting libarchive-3.5.1,1: .......... done
[122arm64-quarterly-job-01] `-- Installing libuv-1.42.0...
[122arm64-quarterly-job-01] `-- Extracting libuv-1.42.0: .......... done
[122arm64-quarterly-job-01] `-- Installing rhash-1.4.2...
[122arm64-quarterly-job-01] |   `-- Installing gettext-runtime-0.21...
[122arm64-quarterly-job-01] |   | `-- Installing indexinfo-0.3.1...
[122arm64-quarterly-job-01] |   | `-- Extracting indexinfo-0.3.1: .... done
[122arm64-quarterly-job-01] |   `-- Extracting gettext-runtime-0.21: .......... done
[122arm64-quarterly-job-01] `-- Extracting rhash-1.4.2: .......... done
[122arm64-quarterly-job-01] Extracting cmake-3.21.3: .......... done
=====
Message from ca_root_nss-3.69_1:

--
FreeBSD does not, and can not warrant that the certification authorities
whose certificates are included in this package have in any way been
audited for trustworthiness or RFC 3647 compliance.

Assessment and verification of trust is the complete responsibility of the
system administrator.


This package installs symlinks to support root certificates discovery by
default for software that uses OpenSSL.

This enables SSL Certificate Verification by client software without manual
intervention.

If you prefer to do this manually, replace the following symlinks with
either an empty file or your site-local certificate bundle.

  * /etc/ssl/cert.pem
  * /usr/local/etc/ssl/cert.pem
  * /usr/local/openssl/cert.pem
===>   wasm3-0.5.0 depends on file: /usr/local/bin/cmake - found
===>   Returning to build of wasm3-0.5.0
===>   wasm3-0.5.0 depends on executable: ninja - not found
===>   Installing existing package /packages/All/ninja-1.10.2,2.pkg
[122arm64-quarterly-job-01] Installing ninja-1.10.2,2...
[122arm64-quarterly-job-01] `-- Installing python38-3.8.12...
[122arm64-quarterly-job-01] |   `-- Installing libffi-3.3_1...
[122arm64-quarterly-job-01] |   `-- Extracting libffi-3.3_1: .......... done
[122arm64-quarterly-job-01] |   `-- Installing mpdecimal-2.5.1...
[122arm64-quarterly-job-01] |   `-- Extracting mpdecimal-2.5.1: .......... done
[122arm64-quarterly-job-01] |   `-- Installing readline-8.1.1...
[122arm64-quarterly-job-01] |   `-- Extracting readline-8.1.1: .......... done
[122arm64-quarterly-job-01] `-- Extracting python38-3.8.12: .......... done
[122arm64-quarterly-job-01] Extracting ninja-1.10.2,2: ........ done
=====
Message from python38-3.8.12:

--
Note that some standard Python modules are provided as separate ports
as they require additional dependencies. They are available as:

py38-gdbm       databases/py-gdbm_at_py38
py38-sqlite3    databases/py-sqlite3_at_py38
py38-tkinter    x11-toolkits/py-tkinter_at_py38
===>   wasm3-0.5.0 depends on executable: ninja - found
===>   Returning to build of wasm3-0.5.0
===========================================================================
=======================<phase: lib-depends    >============================
===>   wasm3-0.5.0 depends on shared library: libuv.so - found (/usr/local/lib/libuv.so)
===========================================================================
=======================<phase: configure      >============================
===>  Configuring for wasm3-0.5.0
===>  Performing in-source build
/bin/mkdir -p /wrkdirs/usr/ports/devel/wasm3/work/wasm3-0.5.0
-- The C compiler identification is Clang 10.0.1
-- The CXX compiler identification is Clang 10.0.1
-- Detecting C compiler ABI info
-- Detecting C compiler ABI info - done
-- Check for working C compiler: /usr/bin/cc - skipped
-- Detecting C compile features
-- Detecting C compile features - done
-- Detecting CXX compiler ABI info
-- Detecting CXX compiler ABI info - done
-- Check for working CXX compiler: /usr/bin/c++ - skipped
-- Detecting CXX compile features
-- Detecting CXX compile features - done
----
Generator:  Ninja
Compiler:   Clang
Build Type: Release
-- summary of uvwasi build options:

    Install prefix:  /usr/local
    Target system:   FreeBSD
    Compiler:
      C compiler:    /usr/bin/cc
      CFLAGS:         -O2 -pipe  -fstack-protector-strong -isystem /usr/local/include -fno-strict-aliasing -Dd_m3HasTracer -Wall -Wextra -Wparentheses -Wundef -Wpointer-arith -Wstrict-aliasing=2 -Werror=implicit-function-declaration -Wno-unused-function -Wno-unused-variable -Wno-unused-parameter -Wno-missing-field-initializers
    Libuv version:   v1.40.0
    Libuv lib:       

LTO:        ON
Flags:         -O2 -pipe  -fstack-protector-strong -isystem /usr/local/include -fno-strict-aliasing -Dd_m3HasTracer -Wall -Wextra -Wparentheses -Wundef -Wpointer-arith -Wstrict-aliasing=2 -Werror=implicit-function-declaration -Wno-unused-function -Wno-unused-variable -Wno-unused-parameter -Wno-missing-field-initializers -Dd_m3HasUVWASI
Debug flags:   -O2 -pipe  -fstack-protector-strong -isystem /usr/local/include -fno-strict-aliasing -DDEBUG=1 -ggdb -O0
Release flags: -O3 -Wfatal-errors -fomit-frame-pointer -fno-stack-check -fno-stack-protector -march=native
----
-- Configuring done
-- Generating done
CMake Warning:
  Manually-specified variables were not used by the project:

    CMAKE_COLOR_MAKEFILE
    CMAKE_CXX_FLAGS_RELEASE
    CMAKE_MODULE_LINKER_FLAGS
    CMAKE_SHARED_LINKER_FLAGS
    CMAKE_VERBOSE_MAKEFILE
    THREADS_HAVE_PTHREAD_ARG


-- Build files have been written to: /wrkdirs/usr/ports/devel/wasm3/work/wasm3-0.5.0
===========================================================================
=======================<phase: build          >============================
===>  Building for wasm3-0.5.0
[  3% 2/28] /usr/bin/cc -Dd_m3HasUVWASI -I/wrkdirs/usr/ports/devel/wasm3/work/wasm3-0.5.0/_deps/uvwasi-src/include -I/wrkdirs/usr/ports/devel/wasm3/work/wasm3-0.5.0/source/. -O2 -pipe  -fstack-protector-strong -isystem /usr/local/include -fno-strict-aliasing -Dd_m3HasTracer -Wall -Wextra -Wparentheses -Wundef -Wpointer-arith -Wstrict-aliasing=2 -Werror=implicit-function-declaration -Wno-unused-function -Wno-unused-variable -Wno-unused-parameter -Wno-missing-field-initializers -Dd_m3HasUVWASI -O3 -Wfatal-errors -fomit-frame-pointer -fno-stack-check -fno-stack-protector -march=native -flto=thin -std=c99 -MD -MT CMakeFiles/wasm3.dir/platforms/app/main.c.o -MF CMakeFiles/wasm3.dir/platforms/app/main.c.o.d -o CMakeFiles/wasm3.dir/platforms/app/main.c.o -c /wrkdirs/usr/ports/devel/wasm3/work/wasm3-0.5.0/platforms/app/main.c
FAILED: CMakeFiles/wasm3.dir/platforms/app/main.c.o 
/usr/bin/cc -Dd_m3HasUVWASI -I/wrkdirs/usr/ports/devel/wasm3/work/wasm3-0.5.0/_deps/uvwasi-src/include -I/wrkdirs/usr/ports/devel/wasm3/work/wasm3-0.5.0/source/. -O2 -pipe  -fstack-protector-strong -isystem /usr/local/include -fno-strict-aliasing -Dd_m3HasTracer -Wall -Wextra -Wparentheses -Wundef -Wpointer-arith -Wstrict-aliasing=2 -Werror=implicit-function-declaration -Wno-unused-function -Wno-unused-variable -Wno-unused-parameter -Wno-missing-field-initializers -Dd_m3HasUVWASI -O3 -Wfatal-errors -fomit-frame-pointer -fno-stack-check -fno-stack-protector -march=native -flto=thin -std=c99 -MD -MT CMakeFiles/wasm3.dir/platforms/app/main.c.o -MF CMakeFiles/wasm3.dir/platforms/app/main.c.o.d -o CMakeFiles/wasm3.dir/platforms/app/main.c.o -c /wrkdirs/usr/ports/devel/wasm3/work/wasm3-0.5.0/platforms/app/main.c
cc: fatal error: the clang compiler does not support '-march=native'
[  7% 2/28] /usr/bin/cc  -I/wrkdirs/usr/ports/devel/wasm3/work/wasm3-0.5.0/_deps/uvwasi-src/include -O2 -pipe  -fstack-protector-strong -isystem /usr/local/include -fno-strict-aliasing -Dd_m3HasTracer -Wall -Wextra -Wparentheses -Wundef -Wpointer-arith -Wstrict-aliasing=2 -Werror=implicit-function-declaration -Wno-unused-function -Wno-unused-variable -Wno-unused-parameter -Wno-missing-field-initializers -O3 -Wfatal-errors -fomit-frame-pointer -fno-stack-check -fno-stack-protector -march=native -fvisibility=hidden --std=gnu89 -Wall -Wsign-compare -Wextra -Wstrict-prototypes -Wno-unused-parameter -std=c99 -MD -MT _deps/uvwasi-src/CMakeFiles/uvwasi_a.dir/src/clocks.c.o -MF _deps/uvwasi-src/CMakeFiles/uvwasi_a.dir/src/clocks.c.o.d -o _deps/uvwasi-src/CMakeFiles/uvwasi_a.dir/src/clocks.c.o -c /wrkdirs/usr/ports/devel/wasm3/work/wasm3-0.5.0/_deps/uvwasi-src/src/clocks.c
FAILED: _deps/uvwasi-src/CMakeFiles/uvwasi_a.dir/src/clocks.c.o 
/usr/bin/cc  -I/wrkdirs/usr/ports/devel/wasm3/work/wasm3-0.5.0/_deps/uvwasi-src/include -O2 -pipe  -fstack-protector-strong -isystem /usr/local/include -fno-strict-aliasing -Dd_m3HasTracer -Wall -Wextra -Wparentheses -Wundef -Wpointer-arith -Wstrict-aliasing=2 -Werror=implicit-function-declaration -Wno-unused-function -Wno-unused-variable -Wno-unused-parameter -Wno-missing-field-initializers -O3 -Wfatal-errors -fomit-frame-pointer -fno-stack-check -fno-stack-protector -march=native -fvisibility=hidden --std=gnu89 -Wall -Wsign-compare -Wextra -Wstrict-prototypes -Wno-unused-parameter -std=c99 -MD -MT _deps/uvwasi-src/CMakeFiles/uvwasi_a.dir/src/clocks.c.o -MF _deps/uvwasi-src/CMakeFiles/uvwasi_a.dir/src/clocks.c.o.d -o _deps/uvwasi-src/CMakeFiles/uvwasi_a.dir/src/clocks.c.o -c /wrkdirs/usr/ports/devel/wasm3/work/wasm3-0.5.0/_deps/uvwasi-src/src/clocks.c
cc: fatal error: the clang compiler does not support '-march=native'
ninja: build stopped: subcommand failed.
===> Compilation failed unexpectedly.
Try to set MAKE_JOBS_UNSAFE=yes and rebuild before reporting the failure to
the maintainer.
*** Error code 1

Stop.
make: stopped in /usr/ports/devel/wasm3
Received on Sun Oct 31 2021 - 02:42:53 UTC

Original text of this message