[package - 122arm64-quarterly][audio/ssr-lv2] Failed for ssr-lv2-g20210922 in build

From: <pkg-fallout_at_FreeBSD.org>
Date: Sat, 30 Oct 2021 01:47:26 GMT
You are receiving this mail as a port that you maintain
is failing to build on the FreeBSD package build server.
Please investigate the failure and submit a PR to fix
build.

Maintainer:     yuri_at_FreeBSD.org
Log URL:        http://ampere1.nyi.freebsd.org/data/122arm64-quarterly/f99a1f703656/logs/ssr-lv2-g20210922.log
Build URL:      http://ampere1.nyi.freebsd.org/build.html?mastername=122arm64-quarterly&build=f99a1f703656
Log:

=>> Building audio/ssr-lv2
build started at Sat Oct 30 01:46:27 UTC 2021
port directory: /usr/ports/audio/ssr-lv2
package name: ssr-lv2-g20210922
building for: FreeBSD 122arm64-quarterly-job-11 12.2-RELEASE FreeBSD 12.2-RELEASE arm64
maintained by: yuri_at_FreeBSD.org
Makefile ident: 
Poudriere version: 3.2.8-21-g883afb07
Host OSVERSION: 1400008
Jail OSVERSION: 1202000
Job Id: 11

---Begin Environment---
SHELL=/bin/csh
OSVERSION=1202000
UNAME_v=FreeBSD 12.2-RELEASE
UNAME_r=12.2-RELEASE
BLOCKSIZE=K
MAIL=/var/mail/root
STATUS=1
HOME=/root
PATH=/sbin:/bin:/usr/sbin:/usr/bin:/usr/local/sbin:/usr/local/bin:/root/bin
LOCALBASE=/usr/local
USER=root
LIBEXECPREFIX=/usr/local/libexec/poudriere
POUDRIERE_VERSION=3.2.8-21-g883afb07
MASTERMNT=/usr/local/poudriere/data/.m/122arm64-quarterly/ref
POUDRIERE_BUILD_TYPE=bulk
PACKAGE_BUILDING=yes
SAVED_TERM=
PWD=/usr/local/poudriere/data/.m/122arm64-quarterly/ref/.p/pool
P_PORTS_FEATURES=FLAVORS SELECTED_OPTIONS
MASTERNAME=122arm64-quarterly
SCRIPTPREFIX=/usr/local/share/poudriere
OLDPWD=/usr/local/poudriere/data/.m/122arm64-quarterly/ref/.p
SCRIPTPATH=/usr/local/share/poudriere/bulk.sh
POUDRIEREPATH=/usr/local/bin/poudriere
---End Environment---

---Begin Poudriere Port Flags/Env---
PORT_FLAGS=
PKGENV=
FLAVOR=
DEPENDS_ARGS=
MAKE_ARGS=
---End Poudriere Port Flags/Env---

---Begin OPTIONS List---
---End OPTIONS List---

--MAINTAINER--
yuri_at_FreeBSD.org
--End MAINTAINER--

--CONFIGURE_ARGS--

--End CONFIGURE_ARGS--

--CONFIGURE_ENV--
MAKE=gmake PKG_CONFIG=pkgconf XDG_DATA_HOME=/wrkdirs/usr/ports/audio/ssr-lv2/work  XDG_CONFIG_HOME=/wrkdirs/usr/ports/audio/ssr-lv2/work  HOME=/wrkdirs/usr/ports/audio/ssr-lv2/work TMPDIR="/tmp" PATH=/wrkdirs/usr/ports/audio/ssr-lv2/work/.bin:/sbin:/bin:/usr/sbin:/usr/bin:/usr/local/sbin:/usr/local/bin:/root/bin SHELL=/bin/sh CONFIG_SHELL=/bin/sh LANG=en_US.UTF-8 LC_ALL=en_US.UTF-8
--End CONFIGURE_ENV--

--MAKE_ENV--
XDG_DATA_HOME=/wrkdirs/usr/ports/audio/ssr-lv2/work  XDG_CONFIG_HOME=/wrkdirs/usr/ports/audio/ssr-lv2/work  HOME=/wrkdirs/usr/ports/audio/ssr-lv2/work TMPDIR="/tmp" PATH=/wrkdirs/usr/ports/audio/ssr-lv2/work/.bin:/sbin:/bin:/usr/sbin:/usr/bin:/usr/local/sbin:/usr/local/bin:/root/bin NO_PIE=yes MK_DEBUG_FILES=no MK_KERNEL_SYMBOLS=no SHELL=/bin/sh NO_LINT=YES LANG=en_US.UTF-8 LC_ALL=en_US.UTF-8 PREFIX=/usr/local  LOCALBASE=/usr/local  CC="cc" CFLAGS="-O2 -pipe  -I/usr/ports/audio/ssr-lv2/files -fstack-protector-strong -fno-strict-aliasing "  CPP="cpp" CPPFLAGS=""  LDFLAGS=" -fstack-protector-strong " LIBS=""  CXX="c++" CXXFLAGS="-O2 -pipe -I/usr/ports/audio/ssr-lv2/files -fstack-protector-strong -fno-strict-aliasing  "  MANPREFIX="/usr/local" BSD_INSTALL_PROGRAM="install  -s -m 555"  BSD_INSTALL_LIB="install  -s -m 0644"  BSD_INSTALL_SCRIPT="install  -m 555"  BSD_INSTALL_DATA="install  -m 0644"  BSD_INSTALL_MAN="install  -m 444"
--End MAKE_ENV--

--PLIST_SUB--
GTK2_VERSION="2.10.0"  GTK3_VERSION="3.0.0"  GTK4_VERSION="4.0.0" OSREL=12.2 PREFIX=%D LOCALBASE=/usr/local  RESETPREFIX=/usr/local LIB32DIR=lib DOCSDIR="share/doc/ssr"  EXAMPLESDIR="share/examples/ssr"  DATADIR="share/ssr"  WWWDIR="www/ssr"  ETCDIR="etc/ssr"
--End PLIST_SUB--

--SUB_LIST--
PREFIX=/usr/local LOCALBASE=/usr/local  DATADIR=/usr/local/share/ssr DOCSDIR=/usr/local/share/doc/ssr EXAMPLESDIR=/usr/local/share/examples/ssr  WWWDIR=/usr/local/www/ssr ETCDIR=/usr/local/etc/ssr
--End SUB_LIST--

---Begin make.conf---
USE_PACKAGE_DEPENDS=yes
BATCH=yes
WRKDIRPREFIX=/wrkdirs
PORTSDIR=/usr/ports
PACKAGES=/packages
DISTDIR=/distfiles
PACKAGE_BUILDING=yes
PACKAGE_BUILDING_FLAVORS=yes
#### /usr/local/etc/poudriere.d/make.conf ####
# XXX: We really need this but cannot use it while 'make checksum' does not
# try the next mirror on checksum failure.  It currently retries the same
# failed mirror and then fails rather then trying another.  It *does*
# try the next if the size is mismatched though.
#MASTER_SITE_FREEBSD=yes
# Build ALLOW_MAKE_JOBS_PACKAGES with 2 jobs
MAKE_JOBS_NUMBER=2
#### /usr/ports/Mk/Scripts/ports_env.sh ####
_CCVERSION_921dbbb2=FreeBSD clang version 10.0.1 (git_at_github.com:llvm/llvm-project.git llvmorg-10.0.1-0-gef32c611aa2) Target: aarch64-unknown-freebsd12.2 Thread model: posix InstalledDir: /usr/bin
_ALTCCVERSION_921dbbb2=none
_CXXINTERNAL_acaad9ca=FreeBSD clang version 10.0.1 (git_at_github.com:llvm/llvm-project.git llvmorg-10.0.1-0-gef32c611aa2) Target: aarch64-unknown-freebsd12.2 Thread model: posix InstalledDir: /usr/bin "/usr/bin/ld" "--eh-frame-hdr" "-dynamic-linker" "/libexec/ld-elf.so.1" "--enable-new-dtags" "-o" "a.out" "/usr/lib/crt1.o" "/usr/lib/crti.o" "/usr/lib/crtbegin.o" "-L/usr/lib" "/dev/null" "-lc++" "-lm" "-lgcc" "--as-needed" "-lgcc_s" "--no-as-needed" "-lc" "-lgcc" "--as-needed" "-lgcc_s" "--no-as-needed" "/usr/lib/crtend.o" "/usr/lib/crtn.o"
CC_OUTPUT_921dbbb2_58173849=yes
CC_OUTPUT_921dbbb2_9bdba57c=yes
CC_OUTPUT_921dbbb2_6a4fe7f5=yes
CC_OUTPUT_921dbbb2_6bcac02b=yes
CC_OUTPUT_921dbbb2_67d20829=yes
CC_OUTPUT_921dbbb2_bfa62e83=yes
CC_OUTPUT_921dbbb2_f0b4d593=yes
CC_OUTPUT_921dbbb2_308abb44=yes
CC_OUTPUT_921dbbb2_f00456e5=yes
CC_OUTPUT_921dbbb2_65ad290d=yes
CC_OUTPUT_921dbbb2_f2776b26=yes
CC_OUTPUT_921dbbb2_b2657cc3=yes
CC_OUTPUT_921dbbb2_380987f7=yes
CC_OUTPUT_921dbbb2_160933ec=yes
CC_OUTPUT_921dbbb2_fb62803b=yes
_OBJC_CCVERSION_921dbbb2=FreeBSD clang version 10.0.1 (git_at_github.com:llvm/llvm-project.git llvmorg-10.0.1-0-gef32c611aa2) Target: aarch64-unknown-freebsd12.2 Thread model: posix InstalledDir: /usr/bin
_OBJC_ALTCCVERSION_921dbbb2=none
ARCH=aarch64
OPSYS=FreeBSD
_OSRELEASE=12.2-RELEASE
OSREL=12.2
OSVERSION=1202000
PYTHONBASE=/usr/local
CONFIGURE_MAX_CMD_LEN=524288
HAVE_PORTS_ENV=1
#### Misc Poudriere ####
GID=0
UID=0
---End make.conf---
--Resource limits--
cpu time               (seconds, -t)  unlimited
file size           (512-blocks, -f)  unlimited
data seg size           (kbytes, -d)  1048576
stack size              (kbytes, -s)  1048576
core file size      (512-blocks, -c)  unlimited
max memory size         (kbytes, -m)  unlimited
locked memory           (kbytes, -l)  unlimited
max user processes              (-u)  89999
open files                      (-n)  1024
virtual mem size        (kbytes, -v)  unlimited
swap limit              (kbytes, -w)  unlimited
socket buffer size       (bytes, -b)  unlimited
pseudo-terminals                (-p)  unlimited
kqueues                         (-k)  unlimited
umtx shared locks               (-o)  unlimited
--End resource limits--
=======================<phase: check-sanity   >============================
===>  License MIT accepted by the user
===========================================================================
=======================<phase: pkg-depends    >============================
===>   ssr-lv2-g20210922 depends on file: /usr/local/sbin/pkg - not found
===>   Installing existing package /packages/All/pkg-1.17.2.pkg
[122arm64-quarterly-job-11] Installing pkg-1.17.2...
[122arm64-quarterly-job-11] Extracting pkg-1.17.2: .......... done
===>   ssr-lv2-g20210922 depends on file: /usr/local/sbin/pkg - found
===>   Returning to build of ssr-lv2-g20210922
===========================================================================
=======================<phase: fetch-depends  >============================
===========================================================================
=======================<phase: fetch          >============================
===>  License MIT accepted by the user
===> Fetching all distfiles required by ssr-lv2-g20210922 for building
===========================================================================
=======================<phase: checksum       >============================
===>  License MIT accepted by the user
===> Fetching all distfiles required by ssr-lv2-g20210922 for building
=> SHA256 Checksum OK for jpcima-ssr-g20210922-e1999da_GH0.tar.gz.
=> SHA256 Checksum OK for DISTRHO-DPF-220d364_GH0.tar.gz.
===========================================================================
=======================<phase: extract-depends>============================
===========================================================================
=======================<phase: extract        >============================
===>  License MIT accepted by the user
===> Fetching all distfiles required by ssr-lv2-g20210922 for building
===>  Extracting for ssr-lv2-g20210922
=> SHA256 Checksum OK for jpcima-ssr-g20210922-e1999da_GH0.tar.gz.
=> SHA256 Checksum OK for DISTRHO-DPF-220d364_GH0.tar.gz.
===========================================================================
=======================<phase: patch-depends  >============================
===========================================================================
=======================<phase: patch          >============================
===>  Patching for ssr-lv2-g20210922
===>  Applying FreeBSD patches for ssr-lv2-g20210922 from /usr/ports/audio/ssr-lv2/files
===========================================================================
=======================<phase: build-depends  >============================
===>   ssr-lv2-g20210922 depends on package: lv2>0 - not found
===>   Installing existing package /packages/All/lv2-1.18.2.pkg
[122arm64-quarterly-job-11] Installing lv2-1.18.2...
[122arm64-quarterly-job-11] `-- Installing atk-2.36.0...
[122arm64-quarterly-job-11] |   `-- Installing gettext-runtime-0.21...
[122arm64-quarterly-job-11] |   | `-- Installing indexinfo-0.3.1...
[122arm64-quarterly-job-11] |   | `-- Extracting indexinfo-0.3.1: .... done
[122arm64-quarterly-job-11] |   `-- Extracting gettext-runtime-0.21: .......... done
[122arm64-quarterly-job-11] |   `-- Installing glib-2.70.0_1,2...
[122arm64-quarterly-job-11] |   | `-- Installing libffi-3.3_1...
[122arm64-quarterly-job-11] |   | `-- Extracting libffi-3.3_1: .......... done
[122arm64-quarterly-job-11] |   | `-- Installing libiconv-1.16...
[122arm64-quarterly-job-11] |   | `-- Extracting libiconv-1.16: .......... done
[122arm64-quarterly-job-11] |   | `-- Installing libxml2-2.9.12...
[122arm64-quarterly-job-11] |   | `-- Extracting libxml2-2.9.12: .......... done
[122arm64-quarterly-job-11] |   | `-- Installing pcre-8.45...
[122arm64-quarterly-job-11] |   | `-- Extracting pcre-8.45: .......... done
[122arm64-quarterly-job-11] |   | `-- Installing python38-3.8.12...
[122arm64-quarterly-job-11] |   |   `-- Installing mpdecimal-2.5.1...
<snip>
Yet it may happen that there are still some consumers which don't explicitly
enable/disable certificate verification for HTTPS connections which could then
lead to errors (as is often the case with self-signed certificates).

In case of an error one should try first to temporarily disable certificate
verification of the problematic urllib3 consumer to see if that approach will
remedy the issue.
=====
Message from lv2-1.18.2:

--
===>   NOTICE:

The lv2 port currently does not have a maintainer. As a result, it is
more likely to have unresolved issues, not be up-to-date, or even be removed in
the future. To volunteer to maintain this port, please create an issue at:

https://bugs.freebsd.org/bugzilla

More information about port maintainership is available at:

https://docs.freebsd.org/en/articles/contributing/#ports-contributing
===>   ssr-lv2-g20210922 depends on package: lv2>0 - found
===>   Returning to build of ssr-lv2-g20210922
===>   ssr-lv2-g20210922 depends on executable: bash - not found
===>   Installing existing package /packages/All/bash-5.1.8.pkg
[122arm64-quarterly-job-11] Installing bash-5.1.8...
[122arm64-quarterly-job-11] Extracting bash-5.1.8: .......... done
===>   ssr-lv2-g20210922 depends on executable: bash - found
===>   Returning to build of ssr-lv2-g20210922
===>   ssr-lv2-g20210922 depends on package: gmake>=4.3 - not found
===>   Installing existing package /packages/All/gmake-4.3_2.pkg
[122arm64-quarterly-job-11] Installing gmake-4.3_2...
[122arm64-quarterly-job-11] Extracting gmake-4.3_2: .......... done
===>   ssr-lv2-g20210922 depends on package: gmake>=4.3 - found
===>   Returning to build of ssr-lv2-g20210922
===>   ssr-lv2-g20210922 depends on package: pkgconf>=1.3.0_1 - not found
===>   Installing existing package /packages/All/pkgconf-1.7.4,1.pkg
[122arm64-quarterly-job-11] Installing pkgconf-1.7.4,1...
[122arm64-quarterly-job-11] Extracting pkgconf-1.7.4,1: .......... done
===>   ssr-lv2-g20210922 depends on package: pkgconf>=1.3.0_1 - found
===>   Returning to build of ssr-lv2-g20210922
===>   ssr-lv2-g20210922 depends on file: /usr/local/libdata/pkgconfig/x11.pc - found
===========================================================================
=======================<phase: lib-depends    >============================
===>   ssr-lv2-g20210922 depends on shared library: libjack.so - not found
===>   Installing existing package /packages/All/jackit-1.9.16.pkg
[122arm64-quarterly-job-11] Installing jackit-1.9.16...
[122arm64-quarterly-job-11] `-- Installing celt-0.11.3_3...
[122arm64-quarterly-job-11] `-- Extracting celt-0.11.3_3: .......... done
[122arm64-quarterly-job-11] `-- Installing libsamplerate-0.2.2...
[122arm64-quarterly-job-11] `-- Extracting libsamplerate-0.2.2: .......... done
[122arm64-quarterly-job-11] `-- Installing libsysinfo-0.0.3_2...
[122arm64-quarterly-job-11] `-- Extracting libsysinfo-0.0.3_2: ......... done
[122arm64-quarterly-job-11] `-- Installing py38-dbus-1.2.18...
[122arm64-quarterly-job-11] |   `-- Installing pydbus-common-1.2.18...
[122arm64-quarterly-job-11] |   `-- Extracting pydbus-common-1.2.18: .......... done
[122arm64-quarterly-job-11] `-- Extracting py38-dbus-1.2.18: .......... done
[122arm64-quarterly-job-11] Extracting jackit-1.9.16: .......... done
=====
Message from celt-0.11.3_3:

--
===>   NOTICE:

This port is deprecated; you may wish to reconsider installing it:

Deprecated and considered obsolete by upstream in 2016 in favour of (lib)opus.

It is scheduled to be removed on or after 2021-12-31.
=====
Message from jackit-1.9.16:

--
======================================================================
It is recommended to run Jack with real-time priority. As FreeBSD doesn't
allow unprivileged users to set real-time priority, you should do it manually
with rtprio(1). As this port comes with jackd and jackdbus executables, note
that only one can be used.

Configure backend options using jack_control:
$ jack_control ds oss
$ jack_control eps realtime False
$ jack_control eps sync True

Configure memory locking editing either /etc/login.conf or ~/.login_conf with:
:memorylocked=unlimited:

After every change to login.conf, you should execute:
cap_mkdb /etc/login.conf

There are two ways to start jack:
* via dbus (new executable: jackdbus)
* as rc service (classic executable: jackd)

- Starting via DBUS:
$ jack_control start

- Starting as RC service:
add the following lines to /etc/rc.conf:
jackd_enable="YES"
jackd_user="{your-jack-user}"
jackd_rtprio="YES"
jackd_args="-R -doss -r{sample-rate} -p1024 -n3 -w16 \
            --capture /dev/dsp{N} --playback /dev/dsp{N}"

Where:
- your-jack-user: is the user who is going to use jack; currently
                  only one user is supported
- sample-rate: can be 44100, 48000, etc.
- /dev/dsp{N}: your OSS devices, usually /dev/dsp0
======================================================================
===>   ssr-lv2-g20210922 depends on shared library: libjack.so - found (/usr/local/lib/libjack.so)
===>   Returning to build of ssr-lv2-g20210922
===>   ssr-lv2-g20210922 depends on shared library: libcairo.so - found (/usr/local/lib/libcairo.so)
===========================================================================
=======================<phase: configure      >============================
===>  Configuring for ssr-lv2-g20210922
===========================================================================
=======================<phase: build          >============================
===>  Building for ssr-lv2-g20210922
gmake[1]: Entering directory '/wrkdirs/usr/ports/audio/ssr-lv2/work/ssr-e1999da'
gmake -C dpf/dgl
gmake res -C plugins/ssr
gmake[2]: Entering directory '/wrkdirs/usr/ports/audio/ssr-lv2/work/ssr-e1999da/dpf/dgl'
gmake[2]: Entering directory '/wrkdirs/usr/ports/audio/ssr-lv2/work/ssr-e1999da/plugins/ssr'
Compiling src/Application.cpp
mkdir -p ../../build/ssr/res/fonts/liberation/
zcat ../../resources/fonts/liberation/LiberationSans-Regular.ttf.gz | od -An -tx1 -v | awk '{for(i=1;i<=NF;i++){printf "0x%s,",$i}}' > ../../build/ssr/res/fonts/liberation/LiberationSans-Regular.ttf.h.tmp
mv -f ../../build/ssr/res/fonts/liberation/LiberationSans-Regular.ttf.h.tmp ../../build/ssr/res/fonts/liberation/LiberationSans-Regular.ttf.h
gmake[2]: Leaving directory '/wrkdirs/usr/ports/audio/ssr-lv2/work/ssr-e1999da/plugins/ssr'
gmake -C dpf/utils/lv2-ttl-generator
gmake[2]: Entering directory '/wrkdirs/usr/ports/audio/ssr-lv2/work/ssr-e1999da/dpf/utils/lv2-ttl-generator'
cc lv2_ttl_generator.c -O2 -pipe  -I/usr/ports/audio/ssr-lv2/files -fstack-protector-strong -fno-strict-aliasing  -o ../lv2_ttl_generator  -fstack-protector-strong  -ldl
gmake[2]: Leaving directory '/wrkdirs/usr/ports/audio/ssr-lv2/work/ssr-e1999da/dpf/utils/lv2-ttl-generator'
Compiling src/Color.cpp
Compiling src/Geometry.cpp
Compiling src/ImageBase.cpp
Compiling src/Resources.cpp
Compiling src/Widget.cpp
Compiling src/Cairo.cpp (Cairo variant)
Compiling src/WidgetPrivateData.cpp (Cairo variant)
Compiling src/Window.cpp (Cairo variant)
Compiling src/OpenGL.cpp (OpenGL variant)
Compiling src/Image.cpp (OpenGL variant)
Compiling src/ImageWidgets.cpp (OpenGL variant)
Compiling src/NanoVG.cpp (OpenGL variant)
Compiling src/WidgetPrivateData.cpp (OpenGL variant)
Compiling src/Window.cpp (OpenGL variant)
Creating libdgl-cairo.a
Creating libdgl-opengl.a
Symlinking libdgl.a
gmake[2]: Leaving directory '/wrkdirs/usr/ports/audio/ssr-lv2/work/ssr-e1999da/dpf/dgl'
gmake -C libs/strings
gmake[2]: Entering directory '/wrkdirs/usr/ports/audio/ssr-lv2/work/ssr-e1999da/libs/strings'
Compiling ResonantArrayAVX.cpp
Compiling ResonantArray.cpp
c++: warning: argument unused during compilation: '-mavx' [-Wunused-command-line-argument]
Compiling ResonantArraySSE.cpp
c++: warning: argument unused during compilation: '-msse' [-Wunused-command-line-argument]
Compiling ResonantStringAVX.cpp
c++: warning: argument unused during compilation: '-mavx' [-Wunused-command-line-argument]
Compiling ResonantString.cpp
Compiling ResonantStringSSE.cpp
c++: warning: argument unused during compilation: '-msse' [-Wunused-command-line-argument]
Creating ../../build/strings/libstrings.a
gmake[2]: Leaving directory '/wrkdirs/usr/ports/audio/ssr-lv2/work/ssr-e1999da/libs/strings'
gmake all -C plugins/ssr
gmake[2]: Entering directory '/wrkdirs/usr/ports/audio/ssr-lv2/work/ssr-e1999da/plugins/ssr'
Compiling Pluginssr.cpp
Compiling State.cpp
In file included from Pluginssr.cpp:2:
./State.h:7:1: warning: 'SsrState' defined as a struct here but previously declared as a class; this is valid, but may result in linker errors under the Microsoft C++ ABI [-Wmismatched-tags]
struct SsrState {
^
./Pluginssr.h:7:1: note: did you mean struct here?
class SsrState;
^~~~~
struct
Compiling StringIO.cpp
1 warning generated.
Compiling ../../thirdparty/cpuid/src/cpuid/cpuinfo.cpp
Compiling ../../thirdparty/cpuid/src/cpuid/version.cpp
In file included from ../../thirdparty/cpuid/src/cpuid/cpuinfo.cpp:20:
./../thirdparty/cpuid/src/cpuid/detail/init_linux_gcc_arm.hpp:14:10: fatal error: 'linux/auxvec.h' file not found
#include <linux/auxvec.h>
         ^~~~~~~~~~~~~~~~
1 error generated.
gmake[2]: *** [../../dpf/Makefile.plugins.mk:134: ../../build/ssr/../../thirdparty/cpuid/src/cpuid/cpuinfo.cpp.o] Error 1
gmake[2]: *** Waiting for unfinished jobs....
gmake[2]: Leaving directory '/wrkdirs/usr/ports/audio/ssr-lv2/work/ssr-e1999da/plugins/ssr'
gmake[1]: *** [Makefile:24: plugins] Error 2
gmake[1]: Leaving directory '/wrkdirs/usr/ports/audio/ssr-lv2/work/ssr-e1999da'
===> Compilation failed unexpectedly.
Try to set MAKE_JOBS_UNSAFE=yes and rebuild before reporting the failure to
the maintainer.
*** Error code 1

Stop.
make: stopped in /usr/ports/audio/ssr-lv2
Received on Sat Oct 30 2021 - 01:47:26 UTC

Original text of this message