[package - main-i386-default][lang/v8] Failed for v8-9.4.146.21 in build

From: <pkg-fallout_at_FreeBSD.org>
Date: Thu, 28 Oct 2021 07:59:41 GMT
You are receiving this mail as a port that you maintain
is failing to build on the FreeBSD package build server.
Please investigate the failure and submit a PR to fix
build.

Maintainer:     sunpoet_at_FreeBSD.org
Log URL:        http://beefy17.nyi.freebsd.org/data/main-i386-default/p8eed177e3d96_s63d24336fd/logs/v8-9.4.146.21.log
Build URL:      http://beefy17.nyi.freebsd.org/build.html?mastername=main-i386-default&build=p8eed177e3d96_s63d24336fd
Log:

=>> Building lang/v8
build started at Thu Oct 28 05:10:52 UTC 2021
port directory: /usr/ports/lang/v8
package name: v8-9.4.146.21
building for: FreeBSD main-i386-default-job-08 14.0-CURRENT FreeBSD 14.0-CURRENT 1400039 i386
maintained by: sunpoet_at_FreeBSD.org
Makefile ident: 
Poudriere version: 3.2.8-21-g883afb07
Host OSVERSION: 1400008
Jail OSVERSION: 1400039
Job Id: 08




!!! Jail is newer than host. (Jail: 1400039, Host: 1400008) !!!
!!! This is not supported. !!!
!!! Host kernel must be same or newer than jail. !!!
!!! Expect build failures. !!!



---Begin Environment---
SHELL=/bin/sh
UNAME_p=i386
UNAME_m=i386
OSVERSION=1400039
UNAME_v=FreeBSD 14.0-CURRENT 1400039
UNAME_r=14.0-CURRENT
BLOCKSIZE=K
MAIL=/var/mail/root
MM_CHARSET=UTF-8
LANG=C.UTF-8
STATUS=1
HOME=/root
PATH=/sbin:/bin:/usr/sbin:/usr/bin:/usr/local/sbin:/usr/local/bin:/root/bin
LOCALBASE=/usr/local
USER=root
LIBEXECPREFIX=/usr/local/libexec/poudriere
POUDRIERE_VERSION=3.2.8-21-g883afb07
MASTERMNT=/usr/local/poudriere/data/.m/main-i386-default/ref
POUDRIERE_BUILD_TYPE=bulk
PACKAGE_BUILDING=yes
SAVED_TERM=
PWD=/usr/local/poudriere/data/.m/main-i386-default/ref/.p/pool
P_PORTS_FEATURES=FLAVORS SELECTED_OPTIONS
MASTERNAME=main-i386-default
SCRIPTPREFIX=/usr/local/share/poudriere
OLDPWD=/usr/local/poudriere/data/.m/main-i386-default/ref/.p
SCRIPTPATH=/usr/local/share/poudriere/bulk.sh
POUDRIEREPATH=/usr/local/bin/poudriere
---End Environment---

---Begin Poudriere Port Flags/Env---
PORT_FLAGS=
PKGENV=
FLAVOR=
DEPENDS_ARGS=
MAKE_ARGS=
---End Poudriere Port Flags/Env---

---Begin OPTIONS List---
---End OPTIONS List---

--MAINTAINER--
sunpoet_at_FreeBSD.org
--End MAINTAINER--

--CONFIGURE_ARGS--

--End CONFIGURE_ARGS--

--CONFIGURE_ENV--
PKG_CONFIG=pkgconf PYTHON="/usr/local/bin/python3.8" XDG_DATA_HOME=/wrkdirs/usr/ports/lang/v8/work  XDG_CONFIG_HOME=/wrkdirs/usr/ports/lang/v8/work  XDG_CACHE_HOME=/wrkdirs/usr/ports/lang/v8/work/.cache  HOME=/wrkdirs/usr/ports/lang/v8/work TMPDIR="/tmp" PATH=/wrkdirs/usr/ports/lang/v8/work/.bin:/sbin:/bin:/usr/sbin:/usr/bin:/usr/local/sbin:/usr/local/bin:/root/bin SHELL=/bin/sh CONFIG_SHELL=/bin/sh LANG=en_US.UTF-8 LC_ALL=en_US.UTF-8
--End CONFIGURE_ENV--

--MAKE_ENV--
NINJA_STATUS="[%p %s/%t] " XDG_DATA_HOME=/wrkdirs/usr/ports/lang/v8/work  XDG_CONFIG_HOME=/wrkdirs/usr/ports/lang/v8/work  XDG_CACHE_HOME=/wrkdirs/usr/ports/lang/v8/work/.cache  HOME=/wrkdirs/usr/ports/lang/v8/work TMPDIR="/tmp" PATH=/wrkdirs/usr/ports/lang/v8/work/.bin:/sbin:/bin:/usr/sbin:/usr/bin:/usr/local/sbin:/usr/local/bin:/root/bin NO_PIE=yes MK_DEBUG_FILES=no MK_KERNEL_SYMBOLS=no SHELL=/bin/sh NO_LINT=YES DESTDIR=/wrkdirs/usr/ports/lang/v8/work/stage LANG=en_US.UTF-8 LC_ALL=en_US.UTF-8 PREFIX=/usr/local  LOCALBASE=/usr/local  CC="cc" CFLAGS="-O2 -pipe  -fstack-protector-strong -fno-strict-aliasing "  CPP="cpp" CPPFLAGS=""  LDFLAGS=" -fstack-protector-strong " LIBS=""  CXX="c++" CXXFLAGS="-O2 -pipe -fstack-protector-strong -fno-strict-aliasing  "  MANPREFIX="/usr/local" BSD_INSTALL_PROGRAM="install  -s -m 555"  BSD_INSTALL_LIB="install  -s -m 0644"  BSD_INSTALL_SCRIPT="install  -m 555"  BSD_INSTALL_DATA="install  -m 0644"  BSD_INSTALL_MAN="install  -m 444"
--End MAKE_ENV--

--PLIST_SUB--
GTK2_VERSION="2.10.0"  GTK3_VERSION="3.0.0"  GTK4_VERSION="4.0.0" PYTHON_INCLUDEDIR=include/python3.8  PYTHON_LIBDIR=lib/python3.8  PYTHON_PLATFORM=freebsd14  PYTHON_SITELIBDIR=lib/python3.8/site-packages  PYTHON_SUFFIX=38  PYTHON_EXT_SUFFIX=.cpython-38  PYTHON_VER=3.8  PYTHON_VERSION=python3.8 PYTHON2="_at_comment " PYTHON3="" OSREL=14.0 PREFIX=%D LOCALBASE=/usr/local  RESETPREFIX=/usr/local LIB32DIR=lib DOCSDIR="share/doc/v8"  EXAMPLESDIR="share/examples/v8"  DATADIR="share/v8"  WWWDIR="www/v8"  ETCDIR="etc/v8"
--End PLIST_SUB--

--SUB_LIST--
PREFIX=/usr/local LOCALBASE=/usr/local  DATADIR=/usr/local/share/v8 DOCSDIR=/usr/local/share/doc/v8 EXAMPLESDIR=/usr/local/share/examples/v8  WWWDIR=/usr/local/www/v8 ETCDIR=/usr/local/etc/v8
--End SUB_LIST--

---Begin make.conf---
USE_PACKAGE_DEPENDS=yes
BATCH=yes
WRKDIRPREFIX=/wrkdirs
PORTSDIR=/usr/ports
PACKAGES=/packages
DISTDIR=/distfiles
PACKAGE_BUILDING=yes
PACKAGE_BUILDING_FLAVORS=yes
MACHINE=i386
MACHINE_ARCH=i386
ARCH=${MACHINE_ARCH}
#### /usr/local/etc/poudriere.d/make.conf ####
# XXX: We really need this but cannot use it while 'make checksum' does not
# try the next mirror on checksum failure.  It currently retries the same
# failed mirror and then fails rather then trying another.  It *does*
# try the next if the size is mismatched though.
#MASTER_SITE_FREEBSD=yes
# Build ALLOW_MAKE_JOBS_PACKAGES with 2 jobs
MAKE_JOBS_NUMBER=2
#### /usr/ports/Mk/Scripts/ports_env.sh ####
_CCVERSION_921dbbb2=FreeBSD clang version 12.0.1 (git_at_github.com:llvm/llvm-project.git llvmorg-12.0.1-0-gfed41342a82f) Target: i386-unknown-freebsd14.0 Thread model: posix InstalledDir: /usr/bin
_ALTCCVERSION_921dbbb2=none
_CXXINTERNAL_acaad9ca=FreeBSD clang version 12.0.1 (git_at_github.com:llvm/llvm-project.git llvmorg-12.0.1-0-gfed41342a82f) Target: i386-unknown-freebsd14.0 Thread model: posix InstalledDir: /usr/bin "/usr/bin/ld" "--eh-frame-hdr" "-dynamic-linker" "/libexec/ld-elf.so.1" "--hash-style=both" "--enable-new-dtags" "-m" "elf_i386_fbsd" "-o" "a.out" "/usr/lib/crt1.o" "/usr/lib/crti.o" "/usr/lib/crtbegin.o" "-L/usr/lib" "/dev/null" "-lc++" "-lm" "-lgcc" "--as-needed" "-lgcc_s" "--no-as-needed" "-lc" "-lgcc" "--as-needed" "-lgcc_s" "--no-as-needed" "/usr/lib/crtend.o" "/usr/lib/crtn.o"
CC_OUTPUT_921dbbb2_58173849=yes
CC_OUTPUT_921dbbb2_9bdba57c=yes
CC_OUTPUT_921dbbb2_6a4fe7f5=yes
CC_OUTPUT_921dbbb2_6bcac02b=yes
CC_OUTPUT_921dbbb2_67d20829=yes
CC_OUTPUT_921dbbb2_bfa62e83=yes
CC_OUTPUT_921dbbb2_f0b4d593=yes
CC_OUTPUT_921dbbb2_308abb44=yes
CC_OUTPUT_921dbbb2_f00456e5=yes
CC_OUTPUT_921dbbb2_65ad290d=yes
CC_OUTPUT_921dbbb2_f2776b26=yes
CC_OUTPUT_921dbbb2_b2657cc3=yes
CC_OUTPUT_921dbbb2_380987f7=yes
CC_OUTPUT_921dbbb2_160933ec=yes
CC_OUTPUT_921dbbb2_fb62803b=yes
_OBJC_CCVERSION_921dbbb2=FreeBSD clang version 12.0.1 (git_at_github.com:llvm/llvm-project.git llvmorg-12.0.1-0-gfed41342a82f) Target: i386-unknown-freebsd14.0 Thread model: posix InstalledDir: /usr/bin
_OBJC_ALTCCVERSION_921dbbb2=none
ARCH=i386
OPSYS=FreeBSD
_OSRELEASE=14.0-CURRENT
OSREL=14.0
OSVERSION=1400039
PYTHONBASE=/usr/local
CONFIGURE_MAX_CMD_LEN=524288
HAVE_PORTS_ENV=1
#### Misc Poudriere ####
GID=0
UID=0
---End make.conf---
--Resource limits--
cpu time               (seconds, -t)  unlimited
file size           (512-blocks, -f)  unlimited
data seg size           (kbytes, -d)  524288
stack size              (kbytes, -s)  65536
core file size      (512-blocks, -c)  unlimited
max memory size         (kbytes, -m)  unlimited
locked memory           (kbytes, -l)  unlimited
max user processes              (-u)  89999
open files                      (-n)  1024
virtual mem size        (kbytes, -v)  unlimited
swap limit              (kbytes, -w)  unlimited
socket buffer size       (bytes, -b)  unlimited
pseudo-terminals                (-p)  unlimited
kqueues                         (-k)  unlimited
umtx shared locks               (-o)  unlimited
--End resource limits--
=======================<phase: check-sanity   >============================
===>  License BSD3CLAUSE accepted by the user
===========================================================================
=======================<phase: pkg-depends    >============================
===>   v8-9.4.146.21 depends on file: /usr/local/sbin/pkg - not found
===>   Installing existing package /packages/All/pkg-1.17.3.pkg
[main-i386-default-job-08] Installing pkg-1.17.3...
[main-i386-default-job-08] Extracting pkg-1.17.3: .......... done
===>   v8-9.4.146.21 depends on file: /usr/local/sbin/pkg - found
===>   Returning to build of v8-9.4.146.21
===========================================================================
=======================<phase: fetch-depends  >============================
===========================================================================
=======================<phase: fetch          >============================
===>  License BSD3CLAUSE accepted by the user
===> Fetching all distfiles required by v8-9.4.146.21 for building
===========================================================================
=======================<phase: checksum       >============================
===>  License BSD3CLAUSE accepted by the user
===> Fetching all distfiles required by v8-9.4.146.21 for building
=> SHA256 Checksum OK for v8/9.4/build-bbf7f0ed65548c4df862d2a2748e3a9b908a3217.tar.gz.
=> SHA256 Checksum OK for v8/9.4/buildtools-37dc929ecb351687006a61744b116cda601753d7.tar.gz.
=> SHA256 Checksum OK for v8/9.4/clang-6a8e571efd68de48d226950d1e10cb8982e71496.tar.gz.
=> SHA256 Checksum OK for v8/9.4/common-3da1e2fcf66acd5c7194497b4285ac163f32e239.tar.gz.
=> SHA256 Checksum OK for v8/9.4/googletest-47f819c3ca54fb602f432904443e00a0a1fe2f42.tar.gz.
=> SHA256 Checksum OK for v8/9.4/icu-75e34bcccea0be165c31fdb278b3712c516c5876.tar.gz.
=> SHA256 Checksum OK for v8/9.4/zlib-563140dd9c24f84bf40919196e9e7666d351cc0d.tar.gz.
=> SHA256 Checksum OK for v8/9.4/v8-v8-9.4.146.21_GH0.tar.gz.
===========================================================================
=======================<phase: extract-depends>============================
===========================================================================
=======================<phase: extract        >============================
===>  License BSD3CLAUSE accepted by the user
===> Fetching all distfiles required by v8-9.4.146.21 for building
===>  Extracting for v8-9.4.146.21
=> SHA256 Checksum OK for v8/9.4/build-bbf7f0ed65548c4df862d2a2748e3a9b908a3217.tar.gz.
=> SHA256 Checksum OK for v8/9.4/buildtools-37dc929ecb351687006a61744b116cda601753d7.tar.gz.
=> SHA256 Checksum OK for v8/9.4/clang-6a8e571efd68de48d226950d1e10cb8982e71496.tar.gz.
=> SHA256 Checksum OK for v8/9.4/common-3da1e2fcf66acd5c7194497b4285ac163f32e239.tar.gz.
=> SHA256 Checksum OK for v8/9.4/googletest-47f819c3ca54fb602f432904443e00a0a1fe2f42.tar.gz.
=> SHA256 Checksum OK for v8/9.4/icu-75e34bcccea0be165c31fdb278b3712c516c5876.tar.gz.
<snip>
In file included from ../../testing/gmock/include/gmock/gmock.h:10:
In file included from ../../third_party/googletest/src/googlemock/include/gmock/gmock.h:57:
In file included from ../../third_party/googletest/src/googlemock/include/gmock/gmock-actions.h:143:
In file included from ../../third_party/googletest/src/googlemock/include/gmock/internal/gmock-internal-utils.h:44:
In file included from ../../third_party/googletest/src/googlemock/include/gmock/internal/gmock-port.h:54:
./../third_party/googletest/src/googletest/include/gtest/internal/gtest-port.h:1652:3: warning: mutex 'mutex_' is still held at the end of function [-Wthread-safety-analysis]
  }
  ^
./../third_party/googletest/src/googletest/include/gtest/internal/gtest-port.h:1649:32: note: mutex acquired here
    GTEST_CHECK_POSIX_SUCCESS_(pthread_mutex_lock(&mutex_));
                               ^
./../third_party/googletest/src/googletest/include/gtest/internal/gtest-port.h:1661:32: warning: releasing mutex 'mutex_' that was not held [-Wthread-safety-analysis]
    GTEST_CHECK_POSIX_SUCCESS_(pthread_mutex_unlock(&mutex_));
                               ^
2 warnings generated.
[ 83% 1808/2170] c++ -MMD -MF obj/third_party/inspector_protocol/crdtp_test/serializable_test.o.d -DUSE_AURA=1 -DUSE_GLIB=1 -DUSE_NSS_CERTS=1 -DUSE_OZONE=1 -DUSE_X11=1 -D_FILE_OFFSET_BITS=64 -D_LARGEFILE_SOURCE -D_LARGEFILE64_SOURCE -D_GNU_SOURCE -DCR_CLANG_REVISION=\"llvmorg-14-init-591-g7d9d926a-1\" -D__STDC_CONSTANT_MACROS -D__STDC_FORMAT_MACROS -DCOMPONENT_BUILD -D_DEBUG -DDYNAMIC_ANNOTATIONS_ENABLED=1 -DENABLE_DISASSEMBLER -DV8_TYPED_ARRAY_MAX_SIZE_IN_HEAP=64 -DENABLE_GDB_JIT_INTERFACE -DENABLE_MINOR_MC -DOBJECT_PRINT -DVERIFY_HEAP -DV8_TRACE_MAPS -DV8_ENABLE_ALLOCATION_TIMEOUT -DV8_ENABLE_FORCE_SLOW_PATH -DV8_ENABLE_DOUBLE_CONST_STORE_CHECK -DV8_INTL_SUPPORT -DENABLE_HANDLE_ZAPPING -DV8_CODE_COMMENTS -DV8_ENABLE_DEBUG_CODE -DV8_SNAPSHOT_NATIVE_CODE_COUNTERS -DV8_ATOMIC_OBJECT_FIELD_WRITES -DV8_ATOMIC_MARKING_STATE -DV8_ENABLE_LAZY_SOURCE_POSITIONS -DV8_SHARED_RO_HEAP -DV8_WIN64_UNWINDING_INFO -DV8_ENABLE_REGEXP_INTERPRETER_THREADED_DISPATCH -DV8_SNAPSHOT_COMPRESSION -DV8_ENABLE
 _WEBASSEMBLY -DV8_ALLOCATION_FOLDING -DV8_ALLOCATION_SITE_TRACKING -DV8_ADVANCED_BIGINT_ALGORITHMS -DV8_ENABLE_CHECKS -DV8_DEPRECATION_WARNINGS -DV8_IMMINENT_DEPRECATION_WARNINGS -DV8_TARGET_ARCH_IA32 -DDEBUG -DV8_RUNTIME_CALL_STATS -DDISABLE_UNTRUSTED_CODE_MITIGATIONS -DBUILDING_V8_SHARED -DV8_ENABLE_CHECKS -DV8_DEPRECATION_WARNINGS -DV8_IMMINENT_DEPRECATION_WARNINGS -DGTEST_API_= -DGTEST_HAS_POSIX_RE=0 -DGTEST_LANG_CXX11=1 -DGTEST_HAS_TR1_TUPLE=0 -DUSING_V8_BASE_SHARED -DUNIT_TEST -I../.. -Igen -I../../include -I../.. -I../../include -Igen -Igen/include -Igen/shim_headers/icui18n_shim -Igen/shim_headers/icuuc_shim -I../../third_party/googletest/custom -I../../third_party/googletest/src/googletest/include -Igen/include -I../../third_party/googletest/src/googlemock/include -fno-delete-null-pointer-checks -fno-ident -fno-strict-aliasing --param=ssp-buffer-size=4 -fstack-protector -funwind-tables -fPIC -pthread -fcolor-diagnostics -fmerge-all-constants -m32 -mfpmath=sse -msse3 -Wno-bu
 iltin-macro-redefined -D__DATE__= -D__TIME__!
 = -D__TIMESTAMP__= -Xclang -fdebug-compilation-dir -Xclang . -no-canonical-prefixes -Wall -Wextra -Wimplicit-fallthrough -Wunreachable-code -Wthread-safety -Wextra-semi -Wno-missing-field-initializers -Wno-unused-parameter -Wloop-analysis -Wno-unneeded-internal-declaration -fno-omit-frame-pointer -momit-leaf-frame-pointer -g0 -gsplit-dwarf -Xclang -debug-info-kind=limited -fvisibility=hidden -Wheader-hygiene -Wstring-conversion -Wtautological-overlap-compare -Wmissing-field-initializers -Wunreachable-code -O3 -fdata-sections -ffunction-sections -fno-unique-section-names -Wexit-time-destructors -Wno-undefined-bool-conversion -Wno-tautological-undefined-compare -std=c++14 -fno-trigraphs -Wno-trigraphs -fno-exceptions -fno-rtti -fvisibility-inlines-hidden -O2 -pipe -fstack-protector-strong -fno-strict-aliasing   -c ../../third_party/inspector_protocol/crdtp/serializable_test.cc -o obj/third_party/inspector_protocol/crdtp_test/serializable_test.o
In file included from ../../third_party/inspector_protocol/crdtp/serializable_test.cc:9:
In file included from ../../third_party/inspector_protocol/crdtp/test_platform.h:15:
In file included from ../../testing/gmock/include/gmock/gmock.h:10:
In file included from ../../third_party/googletest/src/googlemock/include/gmock/gmock.h:57:
In file included from ../../third_party/googletest/src/googlemock/include/gmock/gmock-actions.h:143:
In file included from ../../third_party/googletest/src/googlemock/include/gmock/internal/gmock-internal-utils.h:44:
In file included from ../../third_party/googletest/src/googlemock/include/gmock/internal/gmock-port.h:54:
./../third_party/googletest/src/googletest/include/gtest/internal/gtest-port.h:1652:3: warning: mutex 'mutex_' is still held at the end of function [-Wthread-safety-analysis]
  }
  ^
./../third_party/googletest/src/googletest/include/gtest/internal/gtest-port.h:1649:32: note: mutex acquired here
    GTEST_CHECK_POSIX_SUCCESS_(pthread_mutex_lock(&mutex_));
                               ^
./../third_party/googletest/src/googletest/include/gtest/internal/gtest-port.h:1661:32: warning: releasing mutex 'mutex_' that was not held [-Wthread-safety-analysis]
    GTEST_CHECK_POSIX_SUCCESS_(pthread_mutex_unlock(&mutex_));
                               ^
2 warnings generated.
[ 83% 1809/2170] c++ -MMD -MF obj/third_party/inspector_protocol/crdtp_test/span_test.o.d -DUSE_AURA=1 -DUSE_GLIB=1 -DUSE_NSS_CERTS=1 -DUSE_OZONE=1 -DUSE_X11=1 -D_FILE_OFFSET_BITS=64 -D_LARGEFILE_SOURCE -D_LARGEFILE64_SOURCE -D_GNU_SOURCE -DCR_CLANG_REVISION=\"llvmorg-14-init-591-g7d9d926a-1\" -D__STDC_CONSTANT_MACROS -D__STDC_FORMAT_MACROS -DCOMPONENT_BUILD -D_DEBUG -DDYNAMIC_ANNOTATIONS_ENABLED=1 -DENABLE_DISASSEMBLER -DV8_TYPED_ARRAY_MAX_SIZE_IN_HEAP=64 -DENABLE_GDB_JIT_INTERFACE -DENABLE_MINOR_MC -DOBJECT_PRINT -DVERIFY_HEAP -DV8_TRACE_MAPS -DV8_ENABLE_ALLOCATION_TIMEOUT -DV8_ENABLE_FORCE_SLOW_PATH -DV8_ENABLE_DOUBLE_CONST_STORE_CHECK -DV8_INTL_SUPPORT -DENABLE_HANDLE_ZAPPING -DV8_CODE_COMMENTS -DV8_ENABLE_DEBUG_CODE -DV8_SNAPSHOT_NATIVE_CODE_COUNTERS -DV8_ATOMIC_OBJECT_FIELD_WRITES -DV8_ATOMIC_MARKING_STATE -DV8_ENABLE_LAZY_SOURCE_POSITIONS -DV8_SHARED_RO_HEAP -DV8_WIN64_UNWINDING_INFO -DV8_ENABLE_REGEXP_INTERPRETER_THREADED_DISPATCH -DV8_SNAPSHOT_COMPRESSION -DV8_ENABLE_WEBASSE
 MBLY -DV8_ALLOCATION_FOLDING -DV8_ALLOCATION_SITE_TRACKING -DV8_ADVANCED_BIGINT_ALGORITHMS -DV8_ENABLE_CHECKS -DV8_DEPRECATION_WARNINGS -DV8_IMMINENT_DEPRECATION_WARNINGS -DV8_TARGET_ARCH_IA32 -DDEBUG -DV8_RUNTIME_CALL_STATS -DDISABLE_UNTRUSTED_CODE_MITIGATIONS -DBUILDING_V8_SHARED -DV8_ENABLE_CHECKS -DV8_DEPRECATION_WARNINGS -DV8_IMMINENT_DEPRECATION_WARNINGS -DGTEST_API_= -DGTEST_HAS_POSIX_RE=0 -DGTEST_LANG_CXX11=1 -DGTEST_HAS_TR1_TUPLE=0 -DUSING_V8_BASE_SHARED -DUNIT_TEST -I../.. -Igen -I../../include -I../.. -I../../include -Igen -Igen/include -Igen/shim_headers/icui18n_shim -Igen/shim_headers/icuuc_shim -I../../third_party/googletest/custom -I../../third_party/googletest/src/googletest/include -Igen/include -I../../third_party/googletest/src/googlemock/include -fno-delete-null-pointer-checks -fno-ident -fno-strict-aliasing --param=ssp-buffer-size=4 -fstack-protector -funwind-tables -fPIC -pthread -fcolor-diagnostics -fmerge-all-constants -m32 -mfpmath=sse -msse3 -Wno-builtin-ma
 cro-redefined -D__DATE__= -D__TIME__= -D__TI!
 MESTAMP__= -Xclang -fdebug-compilation-dir -Xclang . -no-canonical-prefixes -Wall -Wextra -Wimplicit-fallthrough -Wunreachable-code -Wthread-safety -Wextra-semi -Wno-missing-field-initializers -Wno-unused-parameter -Wloop-analysis -Wno-unneeded-internal-declaration -fno-omit-frame-pointer -momit-leaf-frame-pointer -g0 -gsplit-dwarf -Xclang -debug-info-kind=limited -fvisibility=hidden -Wheader-hygiene -Wstring-conversion -Wtautological-overlap-compare -Wmissing-field-initializers -Wunreachable-code -O3 -fdata-sections -ffunction-sections -fno-unique-section-names -Wexit-time-destructors -Wno-undefined-bool-conversion -Wno-tautological-undefined-compare -std=c++14 -fno-trigraphs -Wno-trigraphs -fno-exceptions -fno-rtti -fvisibility-inlines-hidden -O2 -pipe -fstack-protector-strong -fno-strict-aliasing   -c ../../third_party/inspector_protocol/crdtp/span_test.cc -o obj/third_party/inspector_protocol/crdtp_test/span_test.o
In file included from ../../third_party/inspector_protocol/crdtp/span_test.cc:9:
In file included from ../../third_party/inspector_protocol/crdtp/test_platform.h:15:
In file included from ../../testing/gmock/include/gmock/gmock.h:10:
In file included from ../../third_party/googletest/src/googlemock/include/gmock/gmock.h:57:
In file included from ../../third_party/googletest/src/googlemock/include/gmock/gmock-actions.h:143:
In file included from ../../third_party/googletest/src/googlemock/include/gmock/internal/gmock-internal-utils.h:44:
In file included from ../../third_party/googletest/src/googlemock/include/gmock/internal/gmock-port.h:54:
./../third_party/googletest/src/googletest/include/gtest/internal/gtest-port.h:1652:3: warning: mutex 'mutex_' is still held at the end of function [-Wthread-safety-analysis]
  }
  ^
./../third_party/googletest/src/googletest/include/gtest/internal/gtest-port.h:1649:32: note: mutex acquired here
    GTEST_CHECK_POSIX_SUCCESS_(pthread_mutex_lock(&mutex_));
                               ^
./../third_party/googletest/src/googletest/include/gtest/internal/gtest-port.h:1661:32: warning: releasing mutex 'mutex_' that was not held [-Wthread-safety-analysis]
    GTEST_CHECK_POSIX_SUCCESS_(pthread_mutex_unlock(&mutex_));
                               ^
2 warnings generated.
[ 83% 1810/2170] c++ -MMD -MF obj/third_party/inspector_protocol/crdtp_test/json_test.o.d -DUSE_AURA=1 -DUSE_GLIB=1 -DUSE_NSS_CERTS=1 -DUSE_OZONE=1 -DUSE_X11=1 -D_FILE_OFFSET_BITS=64 -D_LARGEFILE_SOURCE -D_LARGEFILE64_SOURCE -D_GNU_SOURCE -DCR_CLANG_REVISION=\"llvmorg-14-init-591-g7d9d926a-1\" -D__STDC_CONSTANT_MACROS -D__STDC_FORMAT_MACROS -DCOMPONENT_BUILD -D_DEBUG -DDYNAMIC_ANNOTATIONS_ENABLED=1 -DENABLE_DISASSEMBLER -DV8_TYPED_ARRAY_MAX_SIZE_IN_HEAP=64 -DENABLE_GDB_JIT_INTERFACE -DENABLE_MINOR_MC -DOBJECT_PRINT -DVERIFY_HEAP -DV8_TRACE_MAPS -DV8_ENABLE_ALLOCATION_TIMEOUT -DV8_ENABLE_FORCE_SLOW_PATH -DV8_ENABLE_DOUBLE_CONST_STORE_CHECK -DV8_INTL_SUPPORT -DENABLE_HANDLE_ZAPPING -DV8_CODE_COMMENTS -DV8_ENABLE_DEBUG_CODE -DV8_SNAPSHOT_NATIVE_CODE_COUNTERS -DV8_ATOMIC_OBJECT_FIELD_WRITES -DV8_ATOMIC_MARKING_STATE -DV8_ENABLE_LAZY_SOURCE_POSITIONS -DV8_SHARED_RO_HEAP -DV8_WIN64_UNWINDING_INFO -DV8_ENABLE_REGEXP_INTERPRETER_THREADED_DISPATCH -DV8_SNAPSHOT_COMPRESSION -DV8_ENABLE_WEBASSE
 MBLY -DV8_ALLOCATION_FOLDING -DV8_ALLOCATION_SITE_TRACKING -DV8_ADVANCED_BIGINT_ALGORITHMS -DV8_ENABLE_CHECKS -DV8_DEPRECATION_WARNINGS -DV8_IMMINENT_DEPRECATION_WARNINGS -DV8_TARGET_ARCH_IA32 -DDEBUG -DV8_RUNTIME_CALL_STATS -DDISABLE_UNTRUSTED_CODE_MITIGATIONS -DBUILDING_V8_SHARED -DV8_ENABLE_CHECKS -DV8_DEPRECATION_WARNINGS -DV8_IMMINENT_DEPRECATION_WARNINGS -DGTEST_API_= -DGTEST_HAS_POSIX_RE=0 -DGTEST_LANG_CXX11=1 -DGTEST_HAS_TR1_TUPLE=0 -DUSING_V8_BASE_SHARED -DUNIT_TEST -I../.. -Igen -I../../include -I../.. -I../../include -Igen -Igen/include -Igen/shim_headers/icui18n_shim -Igen/shim_headers/icuuc_shim -I../../third_party/googletest/custom -I../../third_party/googletest/src/googletest/include -Igen/include -I../../third_party/googletest/src/googlemock/include -fno-delete-null-pointer-checks -fno-ident -fno-strict-aliasing --param=ssp-buffer-size=4 -fstack-protector -funwind-tables -fPIC -pthread -fcolor-diagnostics -fmerge-all-constants -m32 -mfpmath=sse -msse3 -Wno-builtin-ma
 cro-redefined -D__DATE__= -D__TIME__= -D__TI!
 MESTAMP__= -Xclang -fdebug-compilation-dir -Xclang . -no-canonical-prefixes -Wall -Wextra -Wimplicit-fallthrough -Wunreachable-code -Wthread-safety -Wextra-semi -Wno-missing-field-initializers -Wno-unused-parameter -Wloop-analysis -Wno-unneeded-internal-declaration -fno-omit-frame-pointer -momit-leaf-frame-pointer -g0 -gsplit-dwarf -Xclang -debug-info-kind=limited -fvisibility=hidden -Wheader-hygiene -Wstring-conversion -Wtautological-overlap-compare -Wmissing-field-initializers -Wunreachable-code -O3 -fdata-sections -ffunction-sections -fno-unique-section-names -Wexit-time-destructors -Wno-undefined-bool-conversion -Wno-tautological-undefined-compare -std=c++14 -fno-trigraphs -Wno-trigraphs -fno-exceptions -fno-rtti -fvisibility-inlines-hidden -O2 -pipe -fstack-protector-strong -fno-strict-aliasing   -c ../../third_party/inspector_protocol/crdtp/json_test.cc -o obj/third_party/inspector_protocol/crdtp_test/json_test.o
In file included from ../../third_party/inspector_protocol/crdtp/json_test.cc:21:
In file included from ../../third_party/inspector_protocol/crdtp/status_test_support.h:10:
In file included from ../../third_party/inspector_protocol/crdtp/test_platform.h:15:
In file included from ../../testing/gmock/include/gmock/gmock.h:10:
In file included from ../../third_party/googletest/src/googlemock/include/gmock/gmock.h:57:
In file included from ../../third_party/googletest/src/googlemock/include/gmock/gmock-actions.h:143:
In file included from ../../third_party/googletest/src/googlemock/include/gmock/internal/gmock-internal-utils.h:44:
In file included from ../../third_party/googletest/src/googlemock/include/gmock/internal/gmock-port.h:54:
./../third_party/googletest/src/googletest/include/gtest/internal/gtest-port.h:1652:3: warning: mutex 'mutex_' is still held at the end of function [-Wthread-safety-analysis]
  }
  ^
./../third_party/googletest/src/googletest/include/gtest/internal/gtest-port.h:1649:32: note: mutex acquired here
    GTEST_CHECK_POSIX_SUCCESS_(pthread_mutex_lock(&mutex_));
                               ^
./../third_party/googletest/src/googletest/include/gtest/internal/gtest-port.h:1661:32: warning: releasing mutex 'mutex_' that was not held [-Wthread-safety-analysis]
    GTEST_CHECK_POSIX_SUCCESS_(pthread_mutex_unlock(&mutex_));
                               ^
2 warnings generated.
[ 83% 1811/2170] c++ -MMD -MF obj/third_party/inspector_protocol/crdtp_test/status_test_support.o.d -DUSE_AURA=1 -DUSE_GLIB=1 -DUSE_NSS_CERTS=1 -DUSE_OZONE=1 -DUSE_X11=1 -D_FILE_OFFSET_BITS=64 -D_LARGEFILE_SOURCE -D_LARGEFILE64_SOURCE -D_GNU_SOURCE -DCR_CLANG_REVISION=\"llvmorg-14-init-591-g7d9d926a-1\" -D__STDC_CONSTANT_MACROS -D__STDC_FORMAT_MACROS -DCOMPONENT_BUILD -D_DEBUG -DDYNAMIC_ANNOTATIONS_ENABLED=1 -DENABLE_DISASSEMBLER -DV8_TYPED_ARRAY_MAX_SIZE_IN_HEAP=64 -DENABLE_GDB_JIT_INTERFACE -DENABLE_MINOR_MC -DOBJECT_PRINT -DVERIFY_HEAP -DV8_TRACE_MAPS -DV8_ENABLE_ALLOCATION_TIMEOUT -DV8_ENABLE_FORCE_SLOW_PATH -DV8_ENABLE_DOUBLE_CONST_STORE_CHECK -DV8_INTL_SUPPORT -DENABLE_HANDLE_ZAPPING -DV8_CODE_COMMENTS -DV8_ENABLE_DEBUG_CODE -DV8_SNAPSHOT_NATIVE_CODE_COUNTERS -DV8_ATOMIC_OBJECT_FIELD_WRITES -DV8_ATOMIC_MARKING_STATE -DV8_ENABLE_LAZY_SOURCE_POSITIONS -DV8_SHARED_RO_HEAP -DV8_WIN64_UNWINDING_INFO -DV8_ENABLE_REGEXP_INTERPRETER_THREADED_DISPATCH -DV8_SNAPSHOT_COMPRESSION -DV8_ENAB
 LE_WEBASSEMBLY -DV8_ALLOCATION_FOLDING -DV8_ALLOCATION_SITE_TRACKING -DV8_ADVANCED_BIGINT_ALGORITHMS -DV8_ENABLE_CHECKS -DV8_DEPRECATION_WARNINGS -DV8_IMMINENT_DEPRECATION_WARNINGS -DV8_TARGET_ARCH_IA32 -DDEBUG -DV8_RUNTIME_CALL_STATS -DDISABLE_UNTRUSTED_CODE_MITIGATIONS -DBUILDING_V8_SHARED -DV8_ENABLE_CHECKS -DV8_DEPRECATION_WARNINGS -DV8_IMMINENT_DEPRECATION_WARNINGS -DGTEST_API_= -DGTEST_HAS_POSIX_RE=0 -DGTEST_LANG_CXX11=1 -DGTEST_HAS_TR1_TUPLE=0 -DUSING_V8_BASE_SHARED -DUNIT_TEST -I../.. -Igen -I../../include -I../.. -I../../include -Igen -Igen/include -Igen/shim_headers/icui18n_shim -Igen/shim_headers/icuuc_shim -I../../third_party/googletest/custom -I../../third_party/googletest/src/googletest/include -Igen/include -I../../third_party/googletest/src/googlemock/include -fno-delete-null-pointer-checks -fno-ident -fno-strict-aliasing --param=ssp-buffer-size=4 -fstack-protector -funwind-tables -fPIC -pthread -fcolor-diagnostics -fmerge-all-constants -m32 -mfpmath=sse -msse3 -Wno-
 builtin-macro-redefined -D__DATE__= -D__TIME!
 __= -D__TIMESTAMP__= -Xclang -fdebug-compilation-dir -Xclang . -no-canonical-prefixes -Wall -Wextra -Wimplicit-fallthrough -Wunreachable-code -Wthread-safety -Wextra-semi -Wno-missing-field-initializers -Wno-unused-parameter -Wloop-analysis -Wno-unneeded-internal-declaration -fno-omit-frame-pointer -momit-leaf-frame-pointer -g0 -gsplit-dwarf -Xclang -debug-info-kind=limited -fvisibility=hidden -Wheader-hygiene -Wstring-conversion -Wtautological-overlap-compare -Wmissing-field-initializers -Wunreachable-code -O3 -fdata-sections -ffunction-sections -fno-unique-section-names -Wexit-time-destructors -Wno-undefined-bool-conversion -Wno-tautological-undefined-compare -std=c++14 -fno-trigraphs -Wno-trigraphs -fno-exceptions -fno-rtti -fvisibility-inlines-hidden -O2 -pipe -fstack-protector-strong -fno-strict-aliasing   -c ../../third_party/inspector_protocol/crdtp/status_test_support.cc -o obj/third_party/inspector_protocol/crdtp_test/status_test_support.o
In file included from ../../third_party/inspector_protocol/crdtp/status_test_support.cc:5:
In file included from ../../third_party/inspector_protocol/crdtp/status_test_support.h:10:
In file included from ../../third_party/inspector_protocol/crdtp/test_platform.h:15:
In file included from ../../testing/gmock/include/gmock/gmock.h:10:
In file included from ../../third_party/googletest/src/googlemock/include/gmock/gmock.h:57:
In file included from ../../third_party/googletest/src/googlemock/include/gmock/gmock-actions.h:143:
In file included from ../../third_party/googletest/src/googlemock/include/gmock/internal/gmock-internal-utils.h:44:
In file included from ../../third_party/googletest/src/googlemock/include/gmock/internal/gmock-port.h:54:
./../third_party/googletest/src/googletest/include/gtest/internal/gtest-port.h:1652:3: warning: mutex 'mutex_' is still held at the end of function [-Wthread-safety-analysis]
  }
  ^
./../third_party/googletest/src/googletest/include/gtest/internal/gtest-port.h:1649:32: note: mutex acquired here
    GTEST_CHECK_POSIX_SUCCESS_(pthread_mutex_lock(&mutex_));
                               ^
./../third_party/googletest/src/googletest/include/gtest/internal/gtest-port.h:1661:32: warning: releasing mutex 'mutex_' that was not held [-Wthread-safety-analysis]
    GTEST_CHECK_POSIX_SUCCESS_(pthread_mutex_unlock(&mutex_));
                               ^
2 warnings generated.
[ 83% 1812/2170] c++ -MMD -MF obj/third_party/inspector_protocol/crdtp_test/serializer_traits_test.o.d -DUSE_AURA=1 -DUSE_GLIB=1 -DUSE_NSS_CERTS=1 -DUSE_OZONE=1 -DUSE_X11=1 -D_FILE_OFFSET_BITS=64 -D_LARGEFILE_SOURCE -D_LARGEFILE64_SOURCE -D_GNU_SOURCE -DCR_CLANG_REVISION=\"llvmorg-14-init-591-g7d9d926a-1\" -D__STDC_CONSTANT_MACROS -D__STDC_FORMAT_MACROS -DCOMPONENT_BUILD -D_DEBUG -DDYNAMIC_ANNOTATIONS_ENABLED=1 -DENABLE_DISASSEMBLER -DV8_TYPED_ARRAY_MAX_SIZE_IN_HEAP=64 -DENABLE_GDB_JIT_INTERFACE -DENABLE_MINOR_MC -DOBJECT_PRINT -DVERIFY_HEAP -DV8_TRACE_MAPS -DV8_ENABLE_ALLOCATION_TIMEOUT -DV8_ENABLE_FORCE_SLOW_PATH -DV8_ENABLE_DOUBLE_CONST_STORE_CHECK -DV8_INTL_SUPPORT -DENABLE_HANDLE_ZAPPING -DV8_CODE_COMMENTS -DV8_ENABLE_DEBUG_CODE -DV8_SNAPSHOT_NATIVE_CODE_COUNTERS -DV8_ATOMIC_OBJECT_FIELD_WRITES -DV8_ATOMIC_MARKING_STATE -DV8_ENABLE_LAZY_SOURCE_POSITIONS -DV8_SHARED_RO_HEAP -DV8_WIN64_UNWINDING_INFO -DV8_ENABLE_REGEXP_INTERPRETER_THREADED_DISPATCH -DV8_SNAPSHOT_COMPRESSION -DV8_E
 NABLE_WEBASSEMBLY -DV8_ALLOCATION_FOLDING -DV8_ALLOCATION_SITE_TRACKING -DV8_ADVANCED_BIGINT_ALGORITHMS -DV8_ENABLE_CHECKS -DV8_DEPRECATION_WARNINGS -DV8_IMMINENT_DEPRECATION_WARNINGS -DV8_TARGET_ARCH_IA32 -DDEBUG -DV8_RUNTIME_CALL_STATS -DDISABLE_UNTRUSTED_CODE_MITIGATIONS -DBUILDING_V8_SHARED -DV8_ENABLE_CHECKS -DV8_DEPRECATION_WARNINGS -DV8_IMMINENT_DEPRECATION_WARNINGS -DGTEST_API_= -DGTEST_HAS_POSIX_RE=0 -DGTEST_LANG_CXX11=1 -DGTEST_HAS_TR1_TUPLE=0 -DUSING_V8_BASE_SHARED -DUNIT_TEST -I../.. -Igen -I../../include -I../.. -I../../include -Igen -Igen/include -Igen/shim_headers/icui18n_shim -Igen/shim_headers/icuuc_shim -I../../third_party/googletest/custom -I../../third_party/googletest/src/googletest/include -Igen/include -I../../third_party/googletest/src/googlemock/include -fno-delete-null-pointer-checks -fno-ident -fno-strict-aliasing --param=ssp-buffer-size=4 -fstack-protector -funwind-tables -fPIC -pthread -fcolor-diagnostics -fmerge-all-constants -m32 -mfpmath=sse -msse3 -W
 no-builtin-macro-redefined -D__DATE__= -D__T!
 IME__= -D__TIMESTAMP__= -Xclang -fdebug-compilation-dir -Xclang . -no-canonical-prefixes -Wall -Wextra -Wimplicit-fallthrough -Wunreachable-code -Wthread-safety -Wextra-semi -Wno-missing-field-initializers -Wno-unused-parameter -Wloop-analysis -Wno-unneeded-internal-declaration -fno-omit-frame-pointer -momit-leaf-frame-pointer -g0 -gsplit-dwarf -Xclang -debug-info-kind=limited -fvisibility=hidden -Wheader-hygiene -Wstring-conversion -Wtautological-overlap-compare -Wmissing-field-initializers -Wunreachable-code -O3 -fdata-sections -ffunction-sections -fno-unique-section-names -Wexit-time-destructors -Wno-undefined-bool-conversion -Wno-tautological-undefined-compare -std=c++14 -fno-trigraphs -Wno-trigraphs -fno-exceptions -fno-rtti -fvisibility-inlines-hidden -O2 -pipe -fstack-protector-strong -fno-strict-aliasing   -c ../../third_party/inspector_protocol/crdtp/serializer_traits_test.cc -o obj/third_party/inspector_protocol/crdtp_test/serializer_traits_test.o
In file included from ../../third_party/inspector_protocol/crdtp/serializer_traits_test.cc:9:
In file included from ../../third_party/inspector_protocol/crdtp/test_platform.h:15:
In file included from ../../testing/gmock/include/gmock/gmock.h:10:
In file included from ../../third_party/googletest/src/googlemock/include/gmock/gmock.h:57:
In file included from ../../third_party/googletest/src/googlemock/include/gmock/gmock-actions.h:143:
In file included from ../../third_party/googletest/src/googlemock/include/gmock/internal/gmock-internal-utils.h:44:
In file included from ../../third_party/googletest/src/googlemock/include/gmock/internal/gmock-port.h:54:
./../third_party/googletest/src/googletest/include/gtest/internal/gtest-port.h:1652:3: warning: mutex 'mutex_' is still held at the end of function [-Wthread-safety-analysis]
  }
  ^
./../third_party/googletest/src/googletest/include/gtest/internal/gtest-port.h:1649:32: note: mutex acquired here
    GTEST_CHECK_POSIX_SUCCESS_(pthread_mutex_lock(&mutex_));
                               ^
./../third_party/googletest/src/googletest/include/gtest/internal/gtest-port.h:1661:32: warning: releasing mutex 'mutex_' that was not held [-Wthread-safety-analysis]
    GTEST_CHECK_POSIX_SUCCESS_(pthread_mutex_unlock(&mutex_));
                               ^
2 warnings generated.
[ 83% 1813/2170] touch obj/third_party/inspector_protocol/crdtp_test_platform.inputdeps.stamp
[ 83% 1814/2170] c++ -MMD -MF obj/third_party/inspector_protocol/crdtp_test/status_test.o.d -DUSE_AURA=1 -DUSE_GLIB=1 -DUSE_NSS_CERTS=1 -DUSE_OZONE=1 -DUSE_X11=1 -D_FILE_OFFSET_BITS=64 -D_LARGEFILE_SOURCE -D_LARGEFILE64_SOURCE -D_GNU_SOURCE -DCR_CLANG_REVISION=\"llvmorg-14-init-591-g7d9d926a-1\" -D__STDC_CONSTANT_MACROS -D__STDC_FORMAT_MACROS -DCOMPONENT_BUILD -D_DEBUG -DDYNAMIC_ANNOTATIONS_ENABLED=1 -DENABLE_DISASSEMBLER -DV8_TYPED_ARRAY_MAX_SIZE_IN_HEAP=64 -DENABLE_GDB_JIT_INTERFACE -DENABLE_MINOR_MC -DOBJECT_PRINT -DVERIFY_HEAP -DV8_TRACE_MAPS -DV8_ENABLE_ALLOCATION_TIMEOUT -DV8_ENABLE_FORCE_SLOW_PATH -DV8_ENABLE_DOUBLE_CONST_STORE_CHECK -DV8_INTL_SUPPORT -DENABLE_HANDLE_ZAPPING -DV8_CODE_COMMENTS -DV8_ENABLE_DEBUG_CODE -DV8_SNAPSHOT_NATIVE_CODE_COUNTERS -DV8_ATOMIC_OBJECT_FIELD_WRITES -DV8_ATOMIC_MARKING_STATE -DV8_ENABLE_LAZY_SOURCE_POSITIONS -DV8_SHARED_RO_HEAP -DV8_WIN64_UNWINDING_INFO -DV8_ENABLE_REGEXP_INTERPRETER_THREADED_DISPATCH -DV8_SNAPSHOT_COMPRESSION -DV8_ENABLE_WEBAS
 SEMBLY -DV8_ALLOCATION_FOLDING -DV8_ALLOCATION_SITE_TRACKING -DV8_ADVANCED_BIGINT_ALGORITHMS -DV8_ENABLE_CHECKS -DV8_DEPRECATION_WARNINGS -DV8_IMMINENT_DEPRECATION_WARNINGS -DV8_TARGET_ARCH_IA32 -DDEBUG -DV8_RUNTIME_CALL_STATS -DDISABLE_UNTRUSTED_CODE_MITIGATIONS -DBUILDING_V8_SHARED -DV8_ENABLE_CHECKS -DV8_DEPRECATION_WARNINGS -DV8_IMMINENT_DEPRECATION_WARNINGS -DGTEST_API_= -DGTEST_HAS_POSIX_RE=0 -DGTEST_LANG_CXX11=1 -DGTEST_HAS_TR1_TUPLE=0 -DUSING_V8_BASE_SHARED -DUNIT_TEST -I../.. -Igen -I../../include -I../.. -I../../include -Igen -Igen/include -Igen/shim_headers/icui18n_shim -Igen/shim_headers/icuuc_shim -I../../third_party/googletest/custom -I../../third_party/googletest/src/googletest/include -Igen/include -I../../third_party/googletest/src/googlemock/include -fno-delete-null-pointer-checks -fno-ident -fno-strict-aliasing --param=ssp-buffer-size=4 -fstack-protector -funwind-tables -fPIC -pthread -fcolor-diagnostics -fmerge-all-constants -m32 -mfpmath=sse -msse3 -Wno-builtin-
 macro-redefined -D__DATE__= -D__TIME__= -D__!
 TIMESTAMP__= -Xclang -fdebug-compilation-dir -Xclang . -no-canonical-prefixes -Wall -Wextra -Wimplicit-fallthrough -Wunreachable-code -Wthread-safety -Wextra-semi -Wno-missing-field-initializers -Wno-unused-parameter -Wloop-analysis -Wno-unneeded-internal-declaration -fno-omit-frame-pointer -momit-leaf-frame-pointer -g0 -gsplit-dwarf -Xclang -debug-info-kind=limited -fvisibility=hidden -Wheader-hygiene -Wstring-conversion -Wtautological-overlap-compare -Wmissing-field-initializers -Wunreachable-code -O3 -fdata-sections -ffunction-sections -fno-unique-section-names -Wexit-time-destructors -Wno-undefined-bool-conversion -Wno-tautological-undefined-compare -std=c++14 -fno-trigraphs -Wno-trigraphs -fno-exceptions -fno-rtti -fvisibility-inlines-hidden -O2 -pipe -fstack-protector-strong -fno-strict-aliasing   -c ../../third_party/inspector_protocol/crdtp/status_test.cc -o obj/third_party/inspector_protocol/crdtp_test/status_test.o
In file included from ../../third_party/inspector_protocol/crdtp/status_test.cc:6:
In file included from ../../third_party/inspector_protocol/crdtp/status_test_support.h:10:
In file included from ../../third_party/inspector_protocol/crdtp/test_platform.h:15:
In file included from ../../testing/gmock/include/gmock/gmock.h:10:
In file included from ../../third_party/googletest/src/googlemock/include/gmock/gmock.h:57:
In file included from ../../third_party/googletest/src/googlemock/include/gmock/gmock-actions.h:143:
In file included from ../../third_party/googletest/src/googlemock/include/gmock/internal/gmock-internal-utils.h:44:
In file included from ../../third_party/googletest/src/googlemock/include/gmock/internal/gmock-port.h:54:
./../third_party/googletest/src/googletest/include/gtest/internal/gtest-port.h:1652:3: warning: mutex 'mutex_' is still held at the end of function [-Wthread-safety-analysis]
  }
  ^
./../third_party/googletest/src/googletest/include/gtest/internal/gtest-port.h:1649:32: note: mutex acquired here
    GTEST_CHECK_POSIX_SUCCESS_(pthread_mutex_lock(&mutex_));
                               ^
./../third_party/googletest/src/googletest/include/gtest/internal/gtest-port.h:1661:32: warning: releasing mutex 'mutex_' that was not held [-Wthread-safety-analysis]
    GTEST_CHECK_POSIX_SUCCESS_(pthread_mutex_unlock(&mutex_));
                               ^
2 warnings generated.
[ 83% 1815/2170] cc -MMD -MF obj/third_party/zlib/minizip/ioapi.o.d -DUSE_AURA=1 -DUSE_GLIB=1 -DUSE_NSS_CERTS=1 -DUSE_OZONE=1 -DUSE_X11=1 -D_FILE_OFFSET_BITS=64 -D_LARGEFILE_SOURCE -D_LARGEFILE64_SOURCE -D_GNU_SOURCE -DCR_CLANG_REVISION=\"llvmorg-14-init-591-g7d9d926a-1\" -DCOMPONENT_BUILD -D_DEBUG -DDYNAMIC_ANNOTATIONS_ENABLED=1 -I../.. -Igen -I../../third_party/zlib -fno-delete-null-pointer-checks -fno-ident -fno-strict-aliasing --param=ssp-buffer-size=4 -fstack-protector -funwind-tables -fPIC -pthread -fcolor-diagnostics -fmerge-all-constants -m32 -mfpmath=sse -msse3 -Wno-builtin-macro-redefined -D__DATE__= -D__TIME__= -D__TIMESTAMP__= -Xclang -fdebug-compilation-dir -Xclang . -no-canonical-prefixes -O0 -fno-omit-frame-pointer -momit-leaf-frame-pointer -g0 -gsplit-dwarf -Xclang -debug-info-kind=limited -fvisibility=hidden -Wheader-hygiene -Wstring-conversion -Wtautological-overlap-compare -Wall -Wno-unused-variable -Wno-c++11-narrowing -Wno-misleading-indentation -Wno-missing-fiel
 d-initializers -Wno-unused-parameter -Wloop-analysis -Wno-unneeded-internal-declaration -Wno-parentheses-equality -std=c11 -c ../../third_party/zlib/contrib/minizip/ioapi.c -o obj/third_party/zlib/minizip/ioapi.o
[ 83% 1816/2170] cc -MMD -MF obj/third_party/zlib/minizip/unzip.o.d -DUSE_AURA=1 -DUSE_GLIB=1 -DUSE_NSS_CERTS=1 -DUSE_OZONE=1 -DUSE_X11=1 -D_FILE_OFFSET_BITS=64 -D_LARGEFILE_SOURCE -D_LARGEFILE64_SOURCE -D_GNU_SOURCE -DCR_CLANG_REVISION=\"llvmorg-14-init-591-g7d9d926a-1\" -DCOMPONENT_BUILD -D_DEBUG -DDYNAMIC_ANNOTATIONS_ENABLED=1 -I../.. -Igen -I../../third_party/zlib -fno-delete-null-pointer-checks -fno-ident -fno-strict-aliasing --param=ssp-buffer-size=4 -fstack-protector -funwind-tables -fPIC -pthread -fcolor-diagnostics -fmerge-all-constants -m32 -mfpmath=sse -msse3 -Wno-builtin-macro-redefined -D__DATE__= -D__TIME__= -D__TIMESTAMP__= -Xclang -fdebug-compilation-dir -Xclang . -no-canonical-prefixes -O0 -fno-omit-frame-pointer -momit-leaf-frame-pointer -g0 -gsplit-dwarf -Xclang -debug-info-kind=limited -fvisibility=hidden -Wheader-hygiene -Wstring-conversion -Wtautological-overlap-compare -Wall -Wno-unused-variable -Wno-c++11-narrowing -Wno-misleading-indentation -Wno-missing-fiel
 d-initializers -Wno-unused-parameter -Wloop-analysis -Wno-unneeded-internal-declaration -Wno-parentheses-equality -std=c11 -c ../../third_party/zlib/contrib/minizip/unzip.c -o obj/third_party/zlib/minizip/unzip.o
[ 83% 1817/2170] c++ -MMD -MF obj/third_party/inspector_protocol/crdtp_test_platform/test_platform_v8.o.d -DUSE_AURA=1 -DUSE_GLIB=1 -DUSE_NSS_CERTS=1 -DUSE_OZONE=1 -DUSE_X11=1 -D_FILE_OFFSET_BITS=64 -D_LARGEFILE_SOURCE -D_LARGEFILE64_SOURCE -D_GNU_SOURCE -DCR_CLANG_REVISION=\"llvmorg-14-init-591-g7d9d926a-1\" -D__STDC_CONSTANT_MACROS -D__STDC_FORMAT_MACROS -DCOMPONENT_BUILD -D_DEBUG -DDYNAMIC_ANNOTATIONS_ENABLED=1 -DENABLE_DISASSEMBLER -DV8_TYPED_ARRAY_MAX_SIZE_IN_HEAP=64 -DENABLE_GDB_JIT_INTERFACE -DENABLE_MINOR_MC -DOBJECT_PRINT -DVERIFY_HEAP -DV8_TRACE_MAPS -DV8_ENABLE_ALLOCATION_TIMEOUT -DV8_ENABLE_FORCE_SLOW_PATH -DV8_ENABLE_DOUBLE_CONST_STORE_CHECK -DV8_INTL_SUPPORT -DENABLE_HANDLE_ZAPPING -DV8_CODE_COMMENTS -DV8_ENABLE_DEBUG_CODE -DV8_SNAPSHOT_NATIVE_CODE_COUNTERS -DV8_ATOMIC_OBJECT_FIELD_WRITES -DV8_ATOMIC_MARKING_STATE -DV8_ENABLE_LAZY_SOURCE_POSITIONS -DV8_SHARED_RO_HEAP -DV8_WIN64_UNWINDING_INFO -DV8_ENABLE_REGEXP_INTERPRETER_THREADED_DISPATCH -DV8_SNAPSHOT_COMPRESSION -DV
 8_ENABLE_WEBASSEMBLY -DV8_ALLOCATION_FOLDING -DV8_ALLOCATION_SITE_TRACKING -DV8_ADVANCED_BIGINT_ALGORITHMS -DV8_ENABLE_CHECKS -DV8_DEPRECATION_WARNINGS -DV8_IMMINENT_DEPRECATION_WARNINGS -DV8_TARGET_ARCH_IA32 -DDEBUG -DV8_RUNTIME_CALL_STATS -DDISABLE_UNTRUSTED_CODE_MITIGATIONS -DBUILDING_V8_SHARED -DV8_ENABLE_CHECKS -DV8_DEPRECATION_WARNINGS -DV8_IMMINENT_DEPRECATION_WARNINGS -DGTEST_API_= -DGTEST_HAS_POSIX_RE=0 -DGTEST_LANG_CXX11=1 -DGTEST_HAS_TR1_TUPLE=0 -DUSING_V8_BASE_SHARED -DUNIT_TEST -I../.. -Igen -I../../include -I../.. -I../../include -Igen -Igen/include -Igen/shim_headers/icui18n_shim -Igen/shim_headers/icuuc_shim -I../../third_party/googletest/custom -I../../third_party/googletest/src/googletest/include -Igen/include -I../../third_party/googletest/src/googlemock/include -fno-delete-null-pointer-checks -fno-ident -fno-strict-aliasing --param=ssp-buffer-size=4 -fstack-protector -funwind-tables -fPIC -pthread -fcolor-diagnostics -fmerge-all-constants -m32 -mfpmath=sse -msse3
  -Wno-builtin-macro-redefined -D__DATE__= -D!
 __TIME__= -D__TIMESTAMP__= -Xclang -fdebug-compilation-dir -Xclang . -no-canonical-prefixes -Wall -Wextra -Wimplicit-fallthrough -Wunreachable-code -Wthread-safety -Wextra-semi -Wno-missing-field-initializers -Wno-unused-parameter -Wloop-analysis -Wno-unneeded-internal-declaration -fno-omit-frame-pointer -momit-leaf-frame-pointer -g0 -gsplit-dwarf -Xclang -debug-info-kind=limited -fvisibility=hidden -Wheader-hygiene -Wstring-conversion -Wtautological-overlap-compare -Wmissing-field-initializers -Wunreachable-code -O3 -fdata-sections -ffunction-sections -fno-unique-section-names -Wexit-time-destructors -Wno-undefined-bool-conversion -Wno-tautological-undefined-compare -std=c++14 -fno-trigraphs -Wno-trigraphs -fno-exceptions -fno-rtti -fvisibility-inlines-hidden -O2 -pipe -fstack-protector-strong -fno-strict-aliasing   -c ../../third_party/inspector_protocol/crdtp/test_platform_v8.cc -o obj/third_party/inspector_protocol/crdtp_test_platform/test_platform_v8.o
In file included from ../../third_party/inspector_protocol/crdtp/test_platform_v8.cc:7:
In file included from ../../third_party/inspector_protocol/crdtp/test_platform.h:15:
In file included from ../../testing/gmock/include/gmock/gmock.h:10:
In file included from ../../third_party/googletest/src/googlemock/include/gmock/gmock.h:57:
In file included from ../../third_party/googletest/src/googlemock/include/gmock/gmock-actions.h:143:
In file included from ../../third_party/googletest/src/googlemock/include/gmock/internal/gmock-internal-utils.h:44:
In file included from ../../third_party/googletest/src/googlemock/include/gmock/internal/gmock-port.h:54:
./../third_party/googletest/src/googletest/include/gtest/internal/gtest-port.h:1652:3: warning: mutex 'mutex_' is still held at the end of function [-Wthread-safety-analysis]
  }
  ^
./../third_party/googletest/src/googletest/include/gtest/internal/gtest-port.h:1649:32: note: mutex acquired here
    GTEST_CHECK_POSIX_SUCCESS_(pthread_mutex_lock(&mutex_));
                               ^
./../third_party/googletest/src/googletest/include/gtest/internal/gtest-port.h:1661:32: warning: releasing mutex 'mutex_' that was not held [-Wthread-safety-analysis]
    GTEST_CHECK_POSIX_SUCCESS_(pthread_mutex_unlock(&mutex_));
                               ^
2 warnings generated.
[ 83% 1818/2170] touch obj/third_party/inspector_protocol/crdtp_test_platform.stamp
[ 83% 1819/2170] touch obj/third_party/inspector_protocol/crdtp_test.stamp
[ 83% 1820/2170] cc -MMD -MF obj/third_party/zlib/minizip_bin/minizip.o.d -DUSE_AURA=1 -DUSE_GLIB=1 -DUSE_NSS_CERTS=1 -DUSE_OZONE=1 -DUSE_X11=1 -D_FILE_OFFSET_BITS=64 -D_LARGEFILE_SOURCE -D_LARGEFILE64_SOURCE -D_GNU_SOURCE -DCR_CLANG_REVISION=\"llvmorg-14-init-591-g7d9d926a-1\" -DCOMPONENT_BUILD -D_DEBUG -DDYNAMIC_ANNOTATIONS_ENABLED=1 -I../../third_party/zlib -I../.. -Igen -I../../third_party/zlib -Wno-incompatible-pointer-types-discards-qualifiers -fno-delete-null-pointer-checks -fno-ident -fno-strict-aliasing --param=ssp-buffer-size=4 -fstack-protector -funwind-tables -fPIC -pthread -fcolor-diagnostics -fmerge-all-constants -m32 -mfpmath=sse -msse3 -Wno-builtin-macro-redefined -D__DATE__= -D__TIME__= -D__TIMESTAMP__= -Xclang -fdebug-compilation-dir -Xclang . -no-canonical-prefixes -O0 -fno-omit-frame-pointer -momit-leaf-frame-pointer -g0 -gsplit-dwarf -Xclang -debug-info-kind=limited -fvisibility=hidden -Wheader-hygiene -Wstring-conversion -Wtautological-overlap-compare -Wall -Wno
 -unused-variable -Wno-c++11-narrowing -Wno-misleading-indentation -Wno-missing-field-initializers -Wno-unused-parameter -Wloop-analysis -Wno-unneeded-internal-declaration -std=c11 -c ../../third_party/zlib/contrib/minizip/minizip.c -o obj/third_party/zlib/minizip_bin/minizip.o
[ 83% 1821/2170] cc -MMD -MF obj/third_party/zlib/minizip/zip.o.d -DUSE_AURA=1 -DUSE_GLIB=1 -DUSE_NSS_CERTS=1 -DUSE_OZONE=1 -DUSE_X11=1 -D_FILE_OFFSET_BITS=64 -D_LARGEFILE_SOURCE -D_LARGEFILE64_SOURCE -D_GNU_SOURCE -DCR_CLANG_REVISION=\"llvmorg-14-init-591-g7d9d926a-1\" -DCOMPONENT_BUILD -D_DEBUG -DDYNAMIC_ANNOTATIONS_ENABLED=1 -I../.. -Igen -I../../third_party/zlib -fno-delete-null-pointer-checks -fno-ident -fno-strict-aliasing --param=ssp-buffer-size=4 -fstack-protector -funwind-tables -fPIC -pthread -fcolor-diagnostics -fmerge-all-constants -m32 -mfpmath=sse -msse3 -Wno-builtin-macro-redefined -D__DATE__= -D__TIME__= -D__TIMESTAMP__= -Xclang -fdebug-compilation-dir -Xclang . -no-canonical-prefixes -O0 -fno-omit-frame-pointer -momit-leaf-frame-pointer -g0 -gsplit-dwarf -Xclang -debug-info-kind=limited -fvisibility=hidden -Wheader-hygiene -Wstring-conversion -Wtautological-overlap-compare -Wall -Wno-unused-variable -Wno-c++11-narrowing -Wno-misleading-indentation -Wno-missing-field-
 initializers -Wno-unused-parameter -Wloop-analysis -Wno-unneeded-internal-declaration -Wno-parentheses-equality -std=c11 -c ../../third_party/zlib/contrib/minizip/zip.c -o obj/third_party/zlib/minizip/zip.o
[ 83% 1822/2170] cc -MMD -MF obj/third_party/zlib/zlib/adler32.o.d -DUSE_AURA=1 -DUSE_GLIB=1 -DUSE_NSS_CERTS=1 -DUSE_OZONE=1 -DUSE_X11=1 -D_FILE_OFFSET_BITS=64 -D_LARGEFILE_SOURCE -D_LARGEFILE64_SOURCE -D_GNU_SOURCE -DCR_CLANG_REVISION=\"llvmorg-14-init-591-g7d9d926a-1\" -DCOMPONENT_BUILD -D_DEBUG -DDYNAMIC_ANNOTATIONS_ENABLED=1 -DZLIB_IMPLEMENTATION -DZLIB_DEBUG -DADLER32_SIMD_SSSE3 -DX86_NOT_WINDOWS -DINFLATE_CHUNK_SIMD_SSE2 -DCRC32_SIMD_SSE42_PCLMUL -DCRC32_SIMD_SSE42_PCLMUL -DDEFLATE_FILL_WINDOW_SSE2 -I../.. -Igen -I../../third_party/zlib -fno-delete-null-pointer-checks -fno-ident -fno-strict-aliasing --param=ssp-buffer-size=4 -fstack-protector -funwind-tables -fPIC -pthread -fcolor-diagnostics -fmerge-all-constants -m32 -mfpmath=sse -msse3 -Wno-builtin-macro-redefined -D__DATE__= -D__TIME__= -D__TIMESTAMP__= -Xclang -fdebug-compilation-dir -Xclang . -no-canonical-prefixes -O0 -fno-omit-frame-pointer -momit-leaf-frame-pointer -g0 -gsplit-dwarf -Xclang -debug-info-kind=limited -fv
 isibility=hidden -Wheader-hygiene -Wstring-conversion -Wtautological-overlap-compare -Wall -Wno-unused-variable -Wno-c++11-narrowing -Wno-misleading-indentation -Wno-missing-field-initializers -Wno-unused-parameter -Wloop-analysis -Wno-unneeded-internal-declaration -Wno-incompatible-pointer-types -std=c11 -c ../../third_party/zlib/adler32.c -o obj/third_party/zlib/zlib/adler32.o
[ 83% 1823/2170] cc -MMD -MF obj/third_party/zlib/zlib/compress.o.d -DUSE_AURA=1 -DUSE_GLIB=1 -DUSE_NSS_CERTS=1 -DUSE_OZONE=1 -DUSE_X11=1 -D_FILE_OFFSET_BITS=64 -D_LARGEFILE_SOURCE -D_LARGEFILE64_SOURCE -D_GNU_SOURCE -DCR_CLANG_REVISION=\"llvmorg-14-init-591-g7d9d926a-1\" -DCOMPONENT_BUILD -D_DEBUG -DDYNAMIC_ANNOTATIONS_ENABLED=1 -DZLIB_IMPLEMENTATION -DZLIB_DEBUG -DADLER32_SIMD_SSSE3 -DX86_NOT_WINDOWS -DINFLATE_CHUNK_SIMD_SSE2 -DCRC32_SIMD_SSE42_PCLMUL -DCRC32_SIMD_SSE42_PCLMUL -DDEFLATE_FILL_WINDOW_SSE2 -I../.. -Igen -I../../third_party/zlib -fno-delete-null-pointer-checks -fno-ident -fno-strict-aliasing --param=ssp-buffer-size=4 -fstack-protector -funwind-tables -fPIC -pthread -fcolor-diagnostics -fmerge-all-constants -m32 -mfpmath=sse -msse3 -Wno-builtin-macro-redefined -D__DATE__= -D__TIME__= -D__TIMESTAMP__= -Xclang -fdebug-compilation-dir -Xclang . -no-canonical-prefixes -O0 -fno-omit-frame-pointer -momit-leaf-frame-pointer -g0 -gsplit-dwarf -Xclang -debug-info-kind=limited -f
 visibility=hidden -Wheader-hygiene -Wstring-conversion -Wtautological-overlap-compare -Wall -Wno-unused-variable -Wno-c++11-narrowing -Wno-misleading-indentation -Wno-missing-field-initializers -Wno-unused-parameter -Wloop-analysis -Wno-unneeded-internal-declaration -Wno-incompatible-pointer-types -std=c11 -c ../../third_party/zlib/compress.c -o obj/third_party/zlib/zlib/compress.o
[ 84% 1824/2170] cc -MMD -MF obj/third_party/zlib/zlib/cpu_features.o.d -DUSE_AURA=1 -DUSE_GLIB=1 -DUSE_NSS_CERTS=1 -DUSE_OZONE=1 -DUSE_X11=1 -D_FILE_OFFSET_BITS=64 -D_LARGEFILE_SOURCE -D_LARGEFILE64_SOURCE -D_GNU_SOURCE -DCR_CLANG_REVISION=\"llvmorg-14-init-591-g7d9d926a-1\" -DCOMPONENT_BUILD -D_DEBUG -DDYNAMIC_ANNOTATIONS_ENABLED=1 -DZLIB_IMPLEMENTATION -DZLIB_DEBUG -DADLER32_SIMD_SSSE3 -DX86_NOT_WINDOWS -DINFLATE_CHUNK_SIMD_SSE2 -DCRC32_SIMD_SSE42_PCLMUL -DCRC32_SIMD_SSE42_PCLMUL -DDEFLATE_FILL_WINDOW_SSE2 -I../.. -Igen -I../../third_party/zlib -fno-delete-null-pointer-checks -fno-ident -fno-strict-aliasing --param=ssp-buffer-size=4 -fstack-protector -funwind-tables -fPIC -pthread -fcolor-diagnostics -fmerge-all-constants -m32 -mfpmath=sse -msse3 -Wno-builtin-macro-redefined -D__DATE__= -D__TIME__= -D__TIMESTAMP__= -Xclang -fdebug-compilation-dir -Xclang . -no-canonical-prefixes -O0 -fno-omit-frame-pointer -momit-leaf-frame-pointer -g0 -gsplit-dwarf -Xclang -debug-info-kind=limite
 d -fvisibility=hidden -Wheader-hygiene -Wstring-conversion -Wtautological-overlap-compare -Wall -Wno-unused-variable -Wno-c++11-narrowing -Wno-misleading-indentation -Wno-missing-field-initializers -Wno-unused-parameter -Wloop-analysis -Wno-unneeded-internal-declaration -Wno-incompatible-pointer-types -std=c11 -c ../../third_party/zlib/cpu_features.c -o obj/third_party/zlib/zlib/cpu_features.o
[ 84% 1825/2170] cc -MMD -MF obj/third_party/zlib/zlib/crc32.o.d -DUSE_AURA=1 -DUSE_GLIB=1 -DUSE_NSS_CERTS=1 -DUSE_OZONE=1 -DUSE_X11=1 -D_FILE_OFFSET_BITS=64 -D_LARGEFILE_SOURCE -D_LARGEFILE64_SOURCE -D_GNU_SOURCE -DCR_CLANG_REVISION=\"llvmorg-14-init-591-g7d9d926a-1\" -DCOMPONENT_BUILD -D_DEBUG -DDYNAMIC_ANNOTATIONS_ENABLED=1 -DZLIB_IMPLEMENTATION -DZLIB_DEBUG -DADLER32_SIMD_SSSE3 -DX86_NOT_WINDOWS -DINFLATE_CHUNK_SIMD_SSE2 -DCRC32_SIMD_SSE42_PCLMUL -DCRC32_SIMD_SSE42_PCLMUL -DDEFLATE_FILL_WINDOW_SSE2 -I../.. -Igen -I../../third_party/zlib -fno-delete-null-pointer-checks -fno-ident -fno-strict-aliasing --param=ssp-buffer-size=4 -fstack-protector -funwind-tables -fPIC -pthread -fcolor-diagnostics -fmerge-all-constants -m32 -mfpmath=sse -msse3 -Wno-builtin-macro-redefined -D__DATE__= -D__TIME__= -D__TIMESTAMP__= -Xclang -fdebug-compilation-dir -Xclang . -no-canonical-prefixes -O0 -fno-omit-frame-pointer -momit-leaf-frame-pointer -g0 -gsplit-dwarf -Xclang -debug-info-kind=limited -fvis
 ibility=hidden -Wheader-hygiene -Wstring-conversion -Wtautological-overlap-compare -Wall -Wno-unused-variable -Wno-c++11-narrowing -Wno-misleading-indentation -Wno-missing-field-initializers -Wno-unused-parameter -Wloop-analysis -Wno-unneeded-internal-declaration -Wno-incompatible-pointer-types -std=c11 -c ../../third_party/zlib/crc32.c -o obj/third_party/zlib/zlib/crc32.o
[ 84% 1826/2170] cc -MMD -MF obj/third_party/zlib/zlib/gzclose.o.d -DUSE_AURA=1 -DUSE_GLIB=1 -DUSE_NSS_CERTS=1 -DUSE_OZONE=1 -DUSE_X11=1 -D_FILE_OFFSET_BITS=64 -D_LARGEFILE_SOURCE -D_LARGEFILE64_SOURCE -D_GNU_SOURCE -DCR_CLANG_REVISION=\"llvmorg-14-init-591-g7d9d926a-1\" -DCOMPONENT_BUILD -D_DEBUG -DDYNAMIC_ANNOTATIONS_ENABLED=1 -DZLIB_IMPLEMENTATION -DZLIB_DEBUG -DADLER32_SIMD_SSSE3 -DX86_NOT_WINDOWS -DINFLATE_CHUNK_SIMD_SSE2 -DCRC32_SIMD_SSE42_PCLMUL -DCRC32_SIMD_SSE42_PCLMUL -DDEFLATE_FILL_WINDOW_SSE2 -I../.. -Igen -I../../third_party/zlib -fno-delete-null-pointer-checks -fno-ident -fno-strict-aliasing --param=ssp-buffer-size=4 -fstack-protector -funwind-tables -fPIC -pthread -fcolor-diagnostics -fmerge-all-constants -m32 -mfpmath=sse -msse3 -Wno-builtin-macro-redefined -D__DATE__= -D__TIME__= -D__TIMESTAMP__= -Xclang -fdebug-compilation-dir -Xclang . -no-canonical-prefixes -O0 -fno-omit-frame-pointer -momit-leaf-frame-pointer -g0 -gsplit-dwarf -Xclang -debug-info-kind=limited -fv
 isibility=hidden -Wheader-hygiene -Wstring-conversion -Wtautological-overlap-compare -Wall -Wno-unused-variable -Wno-c++11-narrowing -Wno-misleading-indentation -Wno-missing-field-initializers -Wno-unused-parameter -Wloop-analysis -Wno-unneeded-internal-declaration -Wno-incompatible-pointer-types -std=c11 -c ../../third_party/zlib/gzclose.c -o obj/third_party/zlib/zlib/gzclose.o
[ 84% 1827/2170] cc -MMD -MF obj/third_party/zlib/zlib/gzlib.o.d -DUSE_AURA=1 -DUSE_GLIB=1 -DUSE_NSS_CERTS=1 -DUSE_OZONE=1 -DUSE_X11=1 -D_FILE_OFFSET_BITS=64 -D_LARGEFILE_SOURCE -D_LARGEFILE64_SOURCE -D_GNU_SOURCE -DCR_CLANG_REVISION=\"llvmorg-14-init-591-g7d9d926a-1\" -DCOMPONENT_BUILD -D_DEBUG -DDYNAMIC_ANNOTATIONS_ENABLED=1 -DZLIB_IMPLEMENTATION -DZLIB_DEBUG -DADLER32_SIMD_SSSE3 -DX86_NOT_WINDOWS -DINFLATE_CHUNK_SIMD_SSE2 -DCRC32_SIMD_SSE42_PCLMUL -DCRC32_SIMD_SSE42_PCLMUL -DDEFLATE_FILL_WINDOW_SSE2 -I../.. -Igen -I../../third_party/zlib -fno-delete-null-pointer-checks -fno-ident -fno-strict-aliasing --param=ssp-buffer-size=4 -fstack-protector -funwind-tables -fPIC -pthread -fcolor-diagnostics -fmerge-all-constants -m32 -mfpmath=sse -msse3 -Wno-builtin-macro-redefined -D__DATE__= -D__TIME__= -D__TIMESTAMP__= -Xclang -fdebug-compilation-dir -Xclang . -no-canonical-prefixes -O0 -fno-omit-frame-pointer -momit-leaf-frame-pointer -g0 -gsplit-dwarf -Xclang -debug-info-kind=limited -fvis
 ibility=hidden -Wheader-hygiene -Wstring-conversion -Wtautological-overlap-compare -Wall -Wno-unused-variable -Wno-c++11-narrowing -Wno-misleading-indentation -Wno-missing-field-initializers -Wno-unused-parameter -Wloop-analysis -Wno-unneeded-internal-declaration -Wno-incompatible-pointer-types -std=c11 -c ../../third_party/zlib/gzlib.c -o obj/third_party/zlib/zlib/gzlib.o
[ 84% 1828/2170] cc -MMD -MF obj/third_party/zlib/zlib/deflate.o.d -DUSE_AURA=1 -DUSE_GLIB=1 -DUSE_NSS_CERTS=1 -DUSE_OZONE=1 -DUSE_X11=1 -D_FILE_OFFSET_BITS=64 -D_LARGEFILE_SOURCE -D_LARGEFILE64_SOURCE -D_GNU_SOURCE -DCR_CLANG_REVISION=\"llvmorg-14-init-591-g7d9d926a-1\" -DCOMPONENT_BUILD -D_DEBUG -DDYNAMIC_ANNOTATIONS_ENABLED=1 -DZLIB_IMPLEMENTATION -DZLIB_DEBUG -DADLER32_SIMD_SSSE3 -DX86_NOT_WINDOWS -DINFLATE_CHUNK_SIMD_SSE2 -DCRC32_SIMD_SSE42_PCLMUL -DCRC32_SIMD_SSE42_PCLMUL -DDEFLATE_FILL_WINDOW_SSE2 -I../.. -Igen -I../../third_party/zlib -fno-delete-null-pointer-checks -fno-ident -fno-strict-aliasing --param=ssp-buffer-size=4 -fstack-protector -funwind-tables -fPIC -pthread -fcolor-diagnostics -fmerge-all-constants -m32 -mfpmath=sse -msse3 -Wno-builtin-macro-redefined -D__DATE__= -D__TIME__= -D__TIMESTAMP__= -Xclang -fdebug-compilation-dir -Xclang . -no-canonical-prefixes -O0 -fno-omit-frame-pointer -momit-leaf-frame-pointer -g0 -gsplit-dwarf -Xclang -debug-info-kind=limited -fv
 isibility=hidden -Wheader-hygiene -Wstring-conversion -Wtautological-overlap-compare -Wall -Wno-unused-variable -Wno-c++11-narrowing -Wno-misleading-indentation -Wno-missing-field-initializers -Wno-unused-parameter -Wloop-analysis -Wno-unneeded-internal-declaration -Wno-incompatible-pointer-types -std=c11 -c ../../third_party/zlib/deflate.c -o obj/third_party/zlib/zlib/deflate.o
[ 84% 1829/2170] cc -MMD -MF obj/third_party/zlib/zlib/gzread.o.d -DUSE_AURA=1 -DUSE_GLIB=1 -DUSE_NSS_CERTS=1 -DUSE_OZONE=1 -DUSE_X11=1 -D_FILE_OFFSET_BITS=64 -D_LARGEFILE_SOURCE -D_LARGEFILE64_SOURCE -D_GNU_SOURCE -DCR_CLANG_REVISION=\"llvmorg-14-init-591-g7d9d926a-1\" -DCOMPONENT_BUILD -D_DEBUG -DDYNAMIC_ANNOTATIONS_ENABLED=1 -DZLIB_IMPLEMENTATION -DZLIB_DEBUG -DADLER32_SIMD_SSSE3 -DX86_NOT_WINDOWS -DINFLATE_CHUNK_SIMD_SSE2 -DCRC32_SIMD_SSE42_PCLMUL -DCRC32_SIMD_SSE42_PCLMUL -DDEFLATE_FILL_WINDOW_SSE2 -I../.. -Igen -I../../third_party/zlib -fno-delete-null-pointer-checks -fno-ident -fno-strict-aliasing --param=ssp-buffer-size=4 -fstack-protector -funwind-tables -fPIC -pthread -fcolor-diagnostics -fmerge-all-constants -m32 -mfpmath=sse -msse3 -Wno-builtin-macro-redefined -D__DATE__= -D__TIME__= -D__TIMESTAMP__= -Xclang -fdebug-compilation-dir -Xclang . -no-canonical-prefixes -O0 -fno-omit-frame-pointer -momit-leaf-frame-pointer -g0 -gsplit-dwarf -Xclang -debug-info-kind=limited -fvi
 sibility=hidden -Wheader-hygiene -Wstring-conversion -Wtautological-overlap-compare -Wall -Wno-unused-variable -Wno-c++11-narrowing -Wno-misleading-indentation -Wno-missing-field-initializers -Wno-unused-parameter -Wloop-analysis -Wno-unneeded-internal-declaration -Wno-incompatible-pointer-types -std=c11 -c ../../third_party/zlib/gzread.c -o obj/third_party/zlib/zlib/gzread.o
[ 84% 1830/2170] cc -MMD -MF obj/third_party/zlib/zlib/gzwrite.o.d -DUSE_AURA=1 -DUSE_GLIB=1 -DUSE_NSS_CERTS=1 -DUSE_OZONE=1 -DUSE_X11=1 -D_FILE_OFFSET_BITS=64 -D_LARGEFILE_SOURCE -D_LARGEFILE64_SOURCE -D_GNU_SOURCE -DCR_CLANG_REVISION=\"llvmorg-14-init-591-g7d9d926a-1\" -DCOMPONENT_BUILD -D_DEBUG -DDYNAMIC_ANNOTATIONS_ENABLED=1 -DZLIB_IMPLEMENTATION -DZLIB_DEBUG -DADLER32_SIMD_SSSE3 -DX86_NOT_WINDOWS -DINFLATE_CHUNK_SIMD_SSE2 -DCRC32_SIMD_SSE42_PCLMUL -DCRC32_SIMD_SSE42_PCLMUL -DDEFLATE_FILL_WINDOW_SSE2 -I../.. -Igen -I../../third_party/zlib -fno-delete-null-pointer-checks -fno-ident -fno-strict-aliasing --param=ssp-buffer-size=4 -fstack-protector -funwind-tables -fPIC -pthread -fcolor-diagnostics -fmerge-all-constants -m32 -mfpmath=sse -msse3 -Wno-builtin-macro-redefined -D__DATE__= -D__TIME__= -D__TIMESTAMP__= -Xclang -fdebug-compilation-dir -Xclang . -no-canonical-prefixes -O0 -fno-omit-frame-pointer -momit-leaf-frame-pointer -g0 -gsplit-dwarf -Xclang -debug-info-kind=limited -fv
 isibility=hidden -Wheader-hygiene -Wstring-conversion -Wtautological-overlap-compare -Wall -Wno-unused-variable -Wno-c++11-narrowing -Wno-misleading-indentation -Wno-missing-field-initializers -Wno-unused-parameter -Wloop-analysis -Wno-unneeded-internal-declaration -Wno-incompatible-pointer-types -std=c11 -c ../../third_party/zlib/gzwrite.c -o obj/third_party/zlib/zlib/gzwrite.o
[ 84% 1831/2170] cc -MMD -MF obj/third_party/zlib/zlib/infback.o.d -DUSE_AURA=1 -DUSE_GLIB=1 -DUSE_NSS_CERTS=1 -DUSE_OZONE=1 -DUSE_X11=1 -D_FILE_OFFSET_BITS=64 -D_LARGEFILE_SOURCE -D_LARGEFILE64_SOURCE -D_GNU_SOURCE -DCR_CLANG_REVISION=\"llvmorg-14-init-591-g7d9d926a-1\" -DCOMPONENT_BUILD -D_DEBUG -DDYNAMIC_ANNOTATIONS_ENABLED=1 -DZLIB_IMPLEMENTATION -DZLIB_DEBUG -DADLER32_SIMD_SSSE3 -DX86_NOT_WINDOWS -DINFLATE_CHUNK_SIMD_SSE2 -DCRC32_SIMD_SSE42_PCLMUL -DCRC32_SIMD_SSE42_PCLMUL -DDEFLATE_FILL_WINDOW_SSE2 -I../.. -Igen -I../../third_party/zlib -fno-delete-null-pointer-checks -fno-ident -fno-strict-aliasing --param=ssp-buffer-size=4 -fstack-protector -funwind-tables -fPIC -pthread -fcolor-diagnostics -fmerge-all-constants -m32 -mfpmath=sse -msse3 -Wno-builtin-macro-redefined -D__DATE__= -D__TIME__= -D__TIMESTAMP__= -Xclang -fdebug-compilation-dir -Xclang . -no-canonical-prefixes -O0 -fno-omit-frame-pointer -momit-leaf-frame-pointer -g0 -gsplit-dwarf -Xclang -debug-info-kind=limited -fv
 isibility=hidden -Wheader-hygiene -Wstring-conversion -Wtautological-overlap-compare -Wall -Wno-unused-variable -Wno-c++11-narrowing -Wno-misleading-indentation -Wno-missing-field-initializers -Wno-unused-parameter -Wloop-analysis -Wno-unneeded-internal-declaration -Wno-incompatible-pointer-types -std=c11 -c ../../third_party/zlib/infback.c -o obj/third_party/zlib/zlib/infback.o
[ 84% 1832/2170] cc -MMD -MF obj/third_party/zlib/zlib/inffast.o.d -DUSE_AURA=1 -DUSE_GLIB=1 -DUSE_NSS_CERTS=1 -DUSE_OZONE=1 -DUSE_X11=1 -D_FILE_OFFSET_BITS=64 -D_LARGEFILE_SOURCE -D_LARGEFILE64_SOURCE -D_GNU_SOURCE -DCR_CLANG_REVISION=\"llvmorg-14-init-591-g7d9d926a-1\" -DCOMPONENT_BUILD -D_DEBUG -DDYNAMIC_ANNOTATIONS_ENABLED=1 -DZLIB_IMPLEMENTATION -DZLIB_DEBUG -DADLER32_SIMD_SSSE3 -DX86_NOT_WINDOWS -DINFLATE_CHUNK_SIMD_SSE2 -DCRC32_SIMD_SSE42_PCLMUL -DCRC32_SIMD_SSE42_PCLMUL -DDEFLATE_FILL_WINDOW_SSE2 -I../.. -Igen -I../../third_party/zlib -fno-delete-null-pointer-checks -fno-ident -fno-strict-aliasing --param=ssp-buffer-size=4 -fstack-protector -funwind-tables -fPIC -pthread -fcolor-diagnostics -fmerge-all-constants -m32 -mfpmath=sse -msse3 -Wno-builtin-macro-redefined -D__DATE__= -D__TIME__= -D__TIMESTAMP__= -Xclang -fdebug-compilation-dir -Xclang . -no-canonical-prefixes -O0 -fno-omit-frame-pointer -momit-leaf-frame-pointer -g0 -gsplit-dwarf -Xclang -debug-info-kind=limited -fv
 isibility=hidden -Wheader-hygiene -Wstring-conversion -Wtautological-overlap-compare -Wall -Wno-unused-variable -Wno-c++11-narrowing -Wno-misleading-indentation -Wno-missing-field-initializers -Wno-unused-parameter -Wloop-analysis -Wno-unneeded-internal-declaration -Wno-incompatible-pointer-types -std=c11 -c ../../third_party/zlib/inffast.c -o obj/third_party/zlib/zlib/inffast.o
[ 84% 1833/2170] cc -MMD -MF obj/third_party/zlib/zlib/inftrees.o.d -DUSE_AURA=1 -DUSE_GLIB=1 -DUSE_NSS_CERTS=1 -DUSE_OZONE=1 -DUSE_X11=1 -D_FILE_OFFSET_BITS=64 -D_LARGEFILE_SOURCE -D_LARGEFILE64_SOURCE -D_GNU_SOURCE -DCR_CLANG_REVISION=\"llvmorg-14-init-591-g7d9d926a-1\" -DCOMPONENT_BUILD -D_DEBUG -DDYNAMIC_ANNOTATIONS_ENABLED=1 -DZLIB_IMPLEMENTATION -DZLIB_DEBUG -DADLER32_SIMD_SSSE3 -DX86_NOT_WINDOWS -DINFLATE_CHUNK_SIMD_SSE2 -DCRC32_SIMD_SSE42_PCLMUL -DCRC32_SIMD_SSE42_PCLMUL -DDEFLATE_FILL_WINDOW_SSE2 -I../.. -Igen -I../../third_party/zlib -fno-delete-null-pointer-checks -fno-ident -fno-strict-aliasing --param=ssp-buffer-size=4 -fstack-protector -funwind-tables -fPIC -pthread -fcolor-diagnostics -fmerge-all-constants -m32 -mfpmath=sse -msse3 -Wno-builtin-macro-redefined -D__DATE__= -D__TIME__= -D__TIMESTAMP__= -Xclang -fdebug-compilation-dir -Xclang . -no-canonical-prefixes -O0 -fno-omit-frame-pointer -momit-leaf-frame-pointer -g0 -gsplit-dwarf -Xclang -debug-info-kind=limited -f
 visibility=hidden -Wheader-hygiene -Wstring-conversion -Wtautological-overlap-compare -Wall -Wno-unused-variable -Wno-c++11-narrowing -Wno-misleading-indentation -Wno-missing-field-initializers -Wno-unused-parameter -Wloop-analysis -Wno-unneeded-internal-declaration -Wno-incompatible-pointer-types -std=c11 -c ../../third_party/zlib/inftrees.c -o obj/third_party/zlib/zlib/inftrees.o
[ 84% 1834/2170] touch obj/tools/gcmole/v8_run_gcmole.stamp
[ 84% 1834/2170] cc -MMD -MF obj/third_party/zlib/zlib/trees.o.d -DUSE_AURA=1 -DUSE_GLIB=1 -DUSE_NSS_CERTS=1 -DUSE_OZONE=1 -DUSE_X11=1 -D_FILE_OFFSET_BITS=64 -D_LARGEFILE_SOURCE -D_LARGEFILE64_SOURCE -D_GNU_SOURCE -DCR_CLANG_REVISION=\"llvmorg-14-init-591-g7d9d926a-1\" -DCOMPONENT_BUILD -D_DEBUG -DDYNAMIC_ANNOTATIONS_ENABLED=1 -DZLIB_IMPLEMENTATION -DZLIB_DEBUG -DADLER32_SIMD_SSSE3 -DX86_NOT_WINDOWS -DINFLATE_CHUNK_SIMD_SSE2 -DCRC32_SIMD_SSE42_PCLMUL -DCRC32_SIMD_SSE42_PCLMUL -DDEFLATE_FILL_WINDOW_SSE2 -I../.. -Igen -I../../third_party/zlib -fno-delete-null-pointer-checks -fno-ident -fno-strict-aliasing --param=ssp-buffer-size=4 -fstack-protector -funwind-tables -fPIC -pthread -fcolor-diagnostics -fmerge-all-constants -m32 -mfpmath=sse -msse3 -Wno-builtin-macro-redefined -D__DATE__= -D__TIME__= -D__TIMESTAMP__= -Xclang -fdebug-compilation-dir -Xclang . -no-canonical-prefixes -O0 -fno-omit-frame-pointer -momit-leaf-frame-pointer -g0 -gsplit-dwarf -Xclang -debug-info-kind=limited -fvis
 ibility=hidden -Wheader-hygiene -Wstring-conversion -Wtautological-overlap-compare -Wall -Wno-unused-variable -Wno-c++11-narrowing -Wno-misleading-indentation -Wno-missing-field-initializers -Wno-unused-parameter -Wloop-analysis -Wno-unneeded-internal-declaration -Wno-incompatible-pointer-types -std=c11 -c ../../third_party/zlib/trees.c -o obj/third_party/zlib/zlib/trees.o
[ 84% 1835/2170] python3 "../../build/toolchain/gcc_solink_wrapper.py" --readelf="readelf" --nm="/usr/local/bin/nm"  --sofile="./libchrome_zlib.so" --tocfile="./libchrome_zlib.so.TOC" --output="./libchrome_zlib.so" -- c++ -shared -Wl,-soname="libchrome_zlib.so" -fuse-ld=lld -Wl,--build-id -fPIC -Wl,-z,noexecstack -Wl,-z,relro -Wl,--color-diagnostics -Wl,--no-call-graph-profile-sort -m32 -rdynamic -Wl,-z,defs -Wl,--as-needed -Wl,-rpath=\$ORIGIN  -fstack-protector-strong  -o "./libchrome_zlib.so" _at_"./libchrome_zlib.so.rsp"
[ 84% 1837/2170] rm -f obj/third_party/zlib/google/libcompression_utils_portable.a && "/usr/local/bin/ar"  -r -c -s -D obj/third_party/zlib/google/libcompression_utils_portable.a _at_"obj/third_party/zlib/google/libcompression_utils_portable.a.rsp"
[ 84% 1838/2170] touch obj/v8_base_without_compiler.stamp
[ 84% 1839/2170] touch obj/torque_generated_initializers.stamp
[ 84% 1840/2170] touch obj/v8_compiler.stamp
[ 84% 1841/2170] touch obj/v8_base.stamp
[ 84% 1842/2170] touch obj/v8_compiler_for_mksnapshot.stamp
[ 84% 1843/2170] touch obj/v8_compiler_opt.stamp
[ 84% 1844/2170] touch obj/v8_initializers.stamp
[ 84% 1845/2170] touch obj/v8_init.stamp
[ 85% 1846/2170] rm -f obj/third_party/zlib/libminizip.a && "/usr/local/bin/ar"  -r -c -s -D obj/third_party/zlib/libminizip.a _at_"obj/third_party/zlib/libminizip.a.rsp"
[ 85% 1846/2170] python3 "../../build/toolchain/gcc_link_wrapper.py" --output="./zlib_bench" -- c++ -fuse-ld=lld -Wl,--build-id -fPIC -Wl,-z,noexecstack -Wl,-z,relro -Wl,--color-diagnostics -Wl,--no-call-graph-profile-sort -m32 -rdynamic -Wl,-z,defs -Wl,--as-needed -pie -Wl,--disable-new-dtags -Wl,-rpath=\$ORIGIN  -fstack-protector-strong  -o "./zlib_bench" -Wl,--start-group _at_"./zlib_bench.rsp" ./libchrome_zlib.so -Wl,--end-group  -lpthread
[ 85% 1847/2170] python3 "../../build/toolchain/gcc_link_wrapper.py" --output="./mksnapshot" -- c++ -pie -fuse-ld=lld -Wl,--build-id -fPIC -Wl,-z,noexecstack -Wl,-z,relro -Wl,--color-diagnostics -Wl,--no-call-graph-profile-sort -m32 -rdynamic -Wl,-z,defs -Wl,--as-needed -pie -Wl,--disable-new-dtags -Wl,-rpath=\$ORIGIN -Wl,-O2 -Wl,--gc-sections -L/usr/local/lib  -fstack-protector-strong  -o "./mksnapshot" -Wl,--start-group _at_"./mksnapshot.rsp" ./libv8_libbase.so ./libv8_libplatform.so ./libchrome_zlib.so -Wl,--end-group  -lpthread -licui18n -licuuc -licudata
FAILED: mksnapshot 
python3 "../../build/toolchain/gcc_link_wrapper.py" --output="./mksnapshot" -- c++ -pie -fuse-ld=lld -Wl,--build-id -fPIC -Wl,-z,noexecstack -Wl,-z,relro -Wl,--color-diagnostics -Wl,--no-call-graph-profile-sort -m32 -rdynamic -Wl,-z,defs -Wl,--as-needed -pie -Wl,--disable-new-dtags -Wl,-rpath=\$ORIGIN -Wl,-O2 -Wl,--gc-sections -L/usr/local/lib  -fstack-protector-strong  -o "./mksnapshot" -Wl,--start-group _at_"./mksnapshot.rsp" ./libv8_libbase.so ./libv8_libplatform.so ./libchrome_zlib.so -Wl,--end-group  -lpthread -licui18n -licuuc -licudata
LLVM ERROR: out of memory
Allocation failed
PLEASE submit a bug report to https://bugs.freebsd.org/submit/ and include the crash backtrace.
Stack dump:
0.	Program arguments: /usr/bin/ld.lld -pie --eh-frame-hdr -export-dynamic -dynamic-linker /libexec/ld-elf.so.1 --hash-style=both --enable-new-dtags -m elf_i386_fbsd -o ./mksnapshot /usr/lib/Scrt1.o /usr/lib/crti.o /usr/lib/crtbeginS.o -L/usr/local/lib -L/usr/lib --build-id -z noexecstack -z relro --color-diagnostics --no-call-graph-profile-sort -z defs --as-needed --disable-new-dtags -rpath=$ORIGIN -O2 --gc-sections --start-group obj/mksnapshot/embedded-empty.o obj/mksnapshot/embedded-file-writer.o obj/mksnapshot/platform-embedded-file-writer-aix.o obj/mksnapshot/platform-embedded-file-writer-base.o obj/mksnapshot/platform-embedded-file-writer-generic.o obj/mksnapshot/platform-embedded-file-writer-mac.o obj/mksnapshot/platform-embedded-file-writer-win.o obj/mksnapshot/mksnapshot.o obj/mksnapshot/snapshot-empty.o obj/v8_base_without_compiler/api-arguments.o obj/v8_base_without_compiler/api-natives.o obj/v8_base_without_compiler/api.o obj/v8_base_without_compiler/ast-function-literal-i
 d-reindexer.o obj/v8_base_without_compiler/ast-value-factory.o obj/v8_base_without_compiler/ast.o obj/v8_base_without_compiler/modules.o obj/v8_base_without_compiler/prettyprinter.o obj/v8_base_without_compiler/scopes.o obj/v8_base_without_compiler/source-range-ast-visitor.o obj/v8_base_without_compiler/variables.o obj/v8_base_without_compiler/baseline-batch-compiler.o obj/v8_base_without_compiler/baseline-compiler.o obj/v8_base_without_compiler/baseline.o obj/v8_base_without_compiler/bytecode-offset-iterator.o obj/v8_base_without_compiler/accessors.o obj/v8_base_without_compiler/builtins-api.o obj/v8_base_without_compiler/builtins-array.o obj/v8_base_without_compiler/builtins-arraybuffer.o obj/v8_base_without_compiler/builtins-async-module.o obj/v8_base_without_compiler/builtins-bigint.o obj/v8_base_without_compiler/builtins-callsite.o obj/v8_base_without_compiler/builtins-collections.o obj/v8_base_without_compiler/builtins-console.o obj/v8_base_without_compiler/builtins-dataview.o
  obj/v8_base_without_compiler/builtins-date.!
 o obj/v8_base_without_compiler/builtins-error.o obj/v8_base_without_compiler/builtins-function.o obj/v8_base_without_compiler/builtins-global.o obj/v8_base_without_compiler/builtins-internal.o obj/v8_base_without_compiler/builtins-intl.o obj/v8_base_without_compiler/builtins-json.o obj/v8_base_without_compiler/builtins-number.o obj/v8_base_without_compiler/builtins-object.o obj/v8_base_without_compiler/builtins-reflect.o obj/v8_base_without_compiler/builtins-regexp.o obj/v8_base_without_compiler/builtins-sharedarraybuffer.o obj/v8_base_without_compiler/builtins-string.o obj/v8_base_without_compiler/builtins-symbol.o obj/v8_base_without_compiler/builtins-trace.o obj/v8_base_without_compiler/builtins-typed-array.o obj/v8_base_without_compiler/builtins-weak-refs.o obj/v8_base_without_compiler/builtins.o obj/v8_base_without_compiler/constants-table-builder.o obj/v8_base_without_compiler/aligned-slot-allocator.o obj/v8_base_without_compiler/assembler.o obj/v8_base_without_compiler/bailou
 t-reason.o obj/v8_base_without_compiler/code-comments.o obj/v8_base_without_compiler/code-desc.o obj/v8_base_without_compiler/code-factory.o obj/v8_base_without_compiler/code-reference.o obj/v8_base_without_compiler/compilation-cache.o obj/v8_base_without_compiler/compiler.o obj/v8_base_without_compiler/constant-pool.o obj/v8_base_without_compiler/external-reference-encoder.o obj/v8_base_without_compiler/external-reference-table.o obj/v8_base_without_compiler/external-reference.o obj/v8_base_without_compiler/flush-instruction-cache.o obj/v8_base_without_compiler/handler-table.o obj/v8_base_without_compiler/interface-descriptors.o obj/v8_base_without_compiler/machine-type.o obj/v8_base_without_compiler/optimized-compilation-info.o obj/v8_base_without_compiler/pending-optimization-table.o obj/v8_base_without_compiler/register-configuration.o obj/v8_base_without_compiler/reloc-info.o obj/v8_base_without_compiler/safepoint-table.o obj/v8_base_without_compiler/source-position-table.o obj
 /v8_base_without_compiler/source-position.o !
 obj/v8_ba!
 se_without_compiler/string-constants.o obj/v8_base_without_compiler/tick-counter.o obj/v8_base_without_compiler/tnode.o obj/v8_base_without_compiler/turbo-assembler.o obj/v8_base_without_compiler/unoptimized-compilation-info.o obj/v8_base_without_compiler/assert-scope.o obj/v8_base_without_compiler/lazy-compile-dispatcher.o obj/v8_base_without_compiler/optimizing-compile-dispatcher.o obj/v8_base_without_compiler/date.o obj/v8_base_without_compiler/dateparser.o obj/v8_base_without_compiler/debug-coverage.o obj/v8_base_without_compiler/debug-evaluate.o obj/v8_base_without_compiler/debug-frames.o obj/v8_base_without_compiler/debug-interface.o obj/v8_base_without_compiler/debug-property-iterator.o obj/v8_base_without_compiler/debug-scope-iterator.o obj/v8_base_without_compiler/debug-scopes.o obj/v8_base_without_compiler/debug-stack-trace-iterator.o obj/v8_base_without_compiler/debug-type-profile.o obj/v8_base_without_compiler/debug.o obj/v8_base_without_compiler/liveedit.o obj/v8_base_w
 ithout_compiler/deoptimize-reason.o obj/v8_base_without_compiler/deoptimized-frame-info.o obj/v8_base_without_compiler/deoptimizer.o obj/v8_base_without_compiler/materialized-object-store.o obj/v8_base_without_compiler/translated-state.o obj/v8_base_without_compiler/translation-array.o obj/v8_base_without_compiler/basic-block-profiler.o obj/v8_base_without_compiler/compilation-statistics.o obj/v8_base_without_compiler/disassembler.o obj/v8_base_without_compiler/eh-frame.o obj/v8_base_without_compiler/gdb-jit.o obj/v8_base_without_compiler/objects-debug.o obj/v8_base_without_compiler/objects-printer.o obj/v8_base_without_compiler/perf-jit.o obj/v8_base_without_compiler/unwinder.o obj/v8_base_without_compiler/arguments.o obj/v8_base_without_compiler/execution.o obj/v8_base_without_compiler/external-pointer-table.o obj/v8_base_without_compiler/frames.o obj/v8_base_without_compiler/futex-emulation.o obj/v8_base_without_compiler/interrupts-scope.o obj/v8_base_without_compiler/isolate.o o
 bj/v8_base_without_compiler/local-isolate.o !
 obj/v8_ba!
 se_without_compiler/messages.o obj/v8_base_without_compiler/microtask-queue.o obj/v8_base_without_compiler/protectors.o obj/v8_base_without_compiler/runtime-profiler.o obj/v8_base_without_compiler/simulator-base.o obj/v8_base_without_compiler/stack-guard.o obj/v8_base_without_compiler/thread-id.o obj/v8_base_without_compiler/thread-local-top.o obj/v8_base_without_compiler/v8threads.o obj/v8_base_without_compiler/cputracemark-extension.o obj/v8_base_without_compiler/externalize-string-extension.o obj/v8_base_without_compiler/gc-extension.o obj/v8_base_without_compiler/ignition-statistics-extension.o obj/v8_base_without_compiler/statistics-extension.o obj/v8_base_without_compiler/trigger-failure-extension.o obj/v8_base_without_compiler/flags.o obj/v8_base_without_compiler/global-handles.o obj/v8_base_without_compiler/handles.o obj/v8_base_without_compiler/local-handles.o obj/v8_base_without_compiler/persistent-handles.o obj/v8_base_without_compiler/allocation-observer.o obj/v8_base_wi
 thout_compiler/array-buffer-sweeper.o obj/v8_base_without_compiler/base-space.o obj/v8_base_without_compiler/basic-memory-chunk.o obj/v8_base_without_compiler/code-object-registry.o obj/v8_base_without_compiler/code-range.o obj/v8_base_without_compiler/code-stats.o obj/v8_base_without_compiler/collection-barrier.o obj/v8_base_without_compiler/combined-heap.o obj/v8_base_without_compiler/concurrent-allocator.o obj/v8_base_without_compiler/concurrent-marking.o obj/v8_base_without_compiler/cpp-heap.o obj/v8_base_without_compiler/cpp-snapshot.o obj/v8_base_without_compiler/unified-heap-marking-verifier.o obj/v8_base_without_compiler/unified-heap-marking-visitor.o obj/v8_base_without_compiler/embedder-tracing.o obj/v8_base_without_compiler/factory-base.o obj/v8_base_without_compiler/factory.o obj/v8_base_without_compiler/finalization-registry-cleanup-task.o obj/v8_base_without_compiler/free-list.o obj/v8_base_without_compiler/gc-idle-time-handler.o obj/v8_base_without_compiler/gc-tracer.
 o obj/v8_base_without_compiler/heap-controll!
 er.o obj/!
 v8_base_without_compiler/heap-write-barrier.o obj/v8_base_without_compiler/heap.o obj/v8_base_without_compiler/incremental-marking-job.o obj/v8_base_without_compiler/incremental-marking.o obj/v8_base_without_compiler/index-generator.o obj/v8_base_without_compiler/invalidated-slots.o obj/v8_base_without_compiler/large-spaces.o obj/v8_base_without_compiler/local-factory.o obj/v8_base_without_compiler/local-heap.o obj/v8_base_without_compiler/mark-compact.o obj/v8_base_without_compiler/marking-barrier.o obj/v8_base_without_compiler/marking-worklist.o obj/v8_base_without_compiler/marking.o obj/v8_base_without_compiler/memory-allocator.o obj/v8_base_without_compiler/memory-chunk-layout.o obj/v8_base_without_compiler/memory-chunk.o obj/v8_base_without_compiler/memory-measurement.o obj/v8_base_without_compiler/memory-reducer.o obj/v8_base_without_compiler/new-spaces.o obj/v8_base_without_compiler/object-stats.o obj/v8_base_without_compiler/objects-visiting.o obj/v8_base_without_compiler/pa
 ged-spaces.o obj/v8_base_without_compiler/read-only-heap.o obj/v8_base_without_compiler/read-only-spaces.o obj/v8_base_without_compiler/safepoint.o obj/v8_base_without_compiler/scavenge-job.o obj/v8_base_without_compiler/scavenger.o obj/v8_base_without_compiler/slot-set.o obj/v8_base_without_compiler/spaces.o obj/v8_base_without_compiler/stress-marking-observer.o obj/v8_base_without_compiler/stress-scavenge-observer.o obj/v8_base_without_compiler/sweeper.o obj/v8_base_without_compiler/weak-object-worklists.o obj/v8_base_without_compiler/call-optimization.o obj/v8_base_without_compiler/handler-configuration.o obj/v8_base_without_compiler/ic-stats.o obj/v8_base_without_compiler/ic.o obj/v8_base_without_compiler/stub-cache.o obj/v8_base_without_compiler/bootstrapper.o obj/v8_base_without_compiler/icu_util.o obj/v8_base_without_compiler/isolate-allocator.o obj/v8_base_without_compiler/startup-data-util.o obj/v8_base_without_compiler/v8.o obj/v8_base_without_compiler/bytecode-array-build
 er.o obj/v8_base_without_compiler/bytecode-a!
 rray-iter!
 ator.o obj/v8_base_without_compiler/bytecode-array-random-iterator.o obj/v8_base_without_compiler/bytecode-array-writer.o obj/v8_base_without_compiler/bytecode-decoder.o obj/v8_base_without_compiler/bytecode-flags.o obj/v8_base_without_compiler/bytecode-generator.o obj/v8_base_without_compiler/bytecode-label.o obj/v8_base_without_compiler/bytecode-node.o obj/v8_base_without_compiler/bytecode-operands.o obj/v8_base_without_compiler/bytecode-register-optimizer.o obj/v8_base_without_compiler/bytecode-register.o obj/v8_base_without_compiler/bytecode-source-info.o obj/v8_base_without_compiler/bytecodes.o obj/v8_base_without_compiler/constant-array-builder.o obj/v8_base_without_compiler/control-flow-builders.o obj/v8_base_without_compiler/handler-table-builder.o obj/v8_base_without_compiler/interpreter-intrinsics.o obj/v8_base_without_compiler/interpreter.o obj/v8_base_without_compiler/json-parser.o obj/v8_base_without_compiler/json-stringifier.o obj/v8_base_without_compiler/sampler.o obj
 /v8_base_without_compiler/counters.o obj/v8_base_without_compiler/local-logger.o obj/v8_base_without_compiler/log-utils.o obj/v8_base_without_compiler/log.o obj/v8_base_without_compiler/metrics.o obj/v8_base_without_compiler/runtime-call-stats.o obj/v8_base_without_compiler/tracing-flags.o obj/v8_base_without_compiler/conversions.o obj/v8_base_without_compiler/math-random.o obj/v8_base_without_compiler/backing-store.o obj/v8_base_without_compiler/bigint.o obj/v8_base_without_compiler/code-kind.o obj/v8_base_without_compiler/code.o obj/v8_base_without_compiler/compilation-cache-table.o obj/v8_base_without_compiler/contexts.o obj/v8_base_without_compiler/debug-objects.o obj/v8_base_without_compiler/elements-kind.o obj/v8_base_without_compiler/elements.o obj/v8_base_without_compiler/embedder-data-array.o obj/v8_base_without_compiler/feedback-vector.o obj/v8_base_without_compiler/field-type.o obj/v8_base_without_compiler/intl-objects.o obj/v8_base_without_compiler/js-array-buffer.o obj/
 v8_base_without_compiler/js-break-iterator.o!
  obj/v8_b!
 ase_without_compiler/js-collator.o obj/v8_base_without_compiler/js-date-time-format.o obj/v8_base_without_compiler/js-display-names.o obj/v8_base_without_compiler/js-function.o obj/v8_base_without_compiler/js-list-format.o obj/v8_base_without_compiler/js-locale.o obj/v8_base_without_compiler/js-number-format.o obj/v8_base_without_compiler/js-objects.o obj/v8_base_without_compiler/js-plural-rules.o obj/v8_base_without_compiler/js-regexp.o obj/v8_base_without_compiler/js-relative-time-format.o obj/v8_base_without_compiler/js-segment-iterator.o obj/v8_base_without_compiler/js-segmenter.o obj/v8_base_without_compiler/js-segments.o obj/v8_base_without_compiler/keys.o obj/v8_base_without_compiler/literal-objects.o obj/v8_base_without_compiler/lookup-cache.o obj/v8_base_without_compiler/lookup.o obj/v8_base_without_compiler/managed.o obj/v8_base_without_compiler/map-updater.o obj/v8_base_without_compiler/map.o obj/v8_base_without_compiler/module.o obj/v8_base_without_compiler/object-type.o
  obj/v8_base_without_compiler/objects.o obj/v8_base_without_compiler/ordered-hash-table.o obj/v8_base_without_compiler/osr-optimized-code-cache.o obj/v8_base_without_compiler/property-descriptor.o obj/v8_base_without_compiler/property.o obj/v8_base_without_compiler/scope-info.o obj/v8_base_without_compiler/shared-function-info.o obj/v8_base_without_compiler/source-text-module.o obj/v8_base_without_compiler/stack-frame-info.o obj/v8_base_without_compiler/string-comparator.o obj/v8_base_without_compiler/string-table.o obj/v8_base_without_compiler/string.o obj/v8_base_without_compiler/swiss-name-dictionary.o obj/v8_base_without_compiler/synthetic-module.o obj/v8_base_without_compiler/tagged-impl.o obj/v8_base_without_compiler/template-objects.o obj/v8_base_without_compiler/templates.o obj/v8_base_without_compiler/transitions.o obj/v8_base_without_compiler/type-hints.o obj/v8_base_without_compiler/value-serializer.o obj/v8_base_without_compiler/visitors.o obj/v8_base_without_compiler/fu
 nc-name-inferrer.o obj/v8_base_without_compi!
 ler/impor!
 t-assertions.o obj/v8_base_without_compiler/literal-buffer.o obj/v8_base_without_compiler/parse-info.o obj/v8_base_without_compiler/parser.o obj/v8_base_without_compiler/parsing.o obj/v8_base_without_compiler/pending-compilation-error-handler.o obj/v8_base_without_compiler/preparse-data.o obj/v8_base_without_compiler/preparser.o obj/v8_base_without_compiler/rewriter.o obj/v8_base_without_compiler/scanner-character-streams.o obj/v8_base_without_compiler/scanner.o obj/v8_base_without_compiler/token.o obj/v8_base_without_compiler/allocation-tracker.o obj/v8_base_without_compiler/cpu-profiler.o obj/v8_base_without_compiler/heap-profiler.o obj/v8_base_without_compiler/heap-snapshot-generator.o obj/v8_base_without_compiler/profile-generator.o obj/v8_base_without_compiler/profiler-listener.o obj/v8_base_without_compiler/profiler-stats.o obj/v8_base_without_compiler/sampling-heap-profiler.o obj/v8_base_without_compiler/strings-storage.o obj/v8_base_without_compiler/symbolizer.o obj/v8_base_
 without_compiler/tick-sample.o obj/v8_base_without_compiler/tracing-cpu-profiler.o obj/v8_base_without_compiler/weak-code-registry.o obj/v8_base_without_compiler/experimental-bytecode.o obj/v8_base_without_compiler/experimental-compiler.o obj/v8_base_without_compiler/experimental-interpreter.o obj/v8_base_without_compiler/experimental.o obj/v8_base_without_compiler/property-sequences.o obj/v8_base_without_compiler/regexp-ast.o obj/v8_base_without_compiler/regexp-bytecode-generator.o obj/v8_base_without_compiler/regexp-bytecode-peephole.o obj/v8_base_without_compiler/regexp-bytecodes.o obj/v8_base_without_compiler/regexp-compiler-tonode.o obj/v8_base_without_compiler/regexp-compiler.o obj/v8_base_without_compiler/regexp-dotprinter.o obj/v8_base_without_compiler/regexp-error.o obj/v8_base_without_compiler/regexp-interpreter.o obj/v8_base_without_compiler/regexp-macro-assembler-tracer.o obj/v8_base_without_compiler/regexp-macro-assembler.o obj/v8_base_without_compiler/regexp-parser.o o
 bj/v8_base_without_compiler/regexp-stack.o o!
 bj/v8_bas!
 e_without_compiler/regexp-utils.o obj/v8_base_without_compiler/regexp.o obj/v8_base_without_compiler/roots.o obj/v8_base_without_compiler/runtime-array.o obj/v8_base_without_compiler/runtime-atomics.o obj/v8_base_without_compiler/runtime-bigint.o obj/v8_base_without_compiler/runtime-classes.o obj/v8_base_without_compiler/runtime-collections.o obj/v8_base_without_compiler/runtime-compiler.o obj/v8_base_without_compiler/runtime-date.o obj/v8_base_without_compiler/runtime-debug.o obj/v8_base_without_compiler/runtime-forin.o obj/v8_base_without_compiler/runtime-function.o obj/v8_base_without_compiler/runtime-futex.o obj/v8_base_without_compiler/runtime-generator.o obj/v8_base_without_compiler/runtime-internal.o obj/v8_base_without_compiler/runtime-intl.o obj/v8_base_without_compiler/runtime-literals.o obj/v8_base_without_compiler/runtime-module.o obj/v8_base_without_compiler/runtime-numbers.o obj/v8_base_without_compiler/runtime-object.o obj/v8_base_without_compiler/runtime-operators.o 
 obj/v8_base_without_compiler/runtime-promise.o obj/v8_base_without_compiler/runtime-proxy.o obj/v8_base_without_compiler/runtime-regexp.o obj/v8_base_without_compiler/runtime-scopes.o obj/v8_base_without_compiler/runtime-strings.o obj/v8_base_without_compiler/runtime-symbol.o obj/v8_base_without_compiler/runtime-test.o obj/v8_base_without_compiler/runtime-trace.o obj/v8_base_without_compiler/runtime-typedarray.o obj/v8_base_without_compiler/runtime-weak-refs.o obj/v8_base_without_compiler/runtime.o obj/v8_base_without_compiler/code-serializer.o obj/v8_base_without_compiler/context-deserializer.o obj/v8_base_without_compiler/context-serializer.o obj/v8_base_without_compiler/deserializer.o obj/v8_base_without_compiler/embedded-data.o obj/v8_base_without_compiler/object-deserializer.o obj/v8_base_without_compiler/read-only-deserializer.o obj/v8_base_without_compiler/read-only-serializer.o obj/v8_base_without_compiler/roots-serializer.o obj/v8_base_without_compiler/serializer-deserializ
 er.o obj/v8_base_without_compiler/serializer!
 .o obj/v8!
 _base_without_compiler/snapshot-compression.o obj/v8_base_without_compiler/snapshot-data.o obj/v8_base_without_compiler/snapshot-source-sink.o obj/v8_base_without_compiler/snapshot-utils.o obj/v8_base_without_compiler/snapshot.o obj/v8_base_without_compiler/startup-deserializer.o obj/v8_base_without_compiler/startup-serializer.o obj/v8_base_without_compiler/char-predicates.o obj/v8_base_without_compiler/string-builder.o obj/v8_base_without_compiler/string-case.o obj/v8_base_without_compiler/string-stream.o obj/v8_base_without_compiler/unicode-decoder.o obj/v8_base_without_compiler/unicode.o obj/v8_base_without_compiler/uri.o obj/v8_base_without_compiler/cancelable-task.o obj/v8_base_without_compiler/operations-barrier.o obj/v8_base_without_compiler/task-utils.o obj/v8_base_without_compiler/halfsiphash.o obj/v8_base_without_compiler/trace-event.o obj/v8_base_without_compiler/traced-value.o obj/v8_base_without_compiler/tracing-category-observer.o obj/v8_base_without_compiler/address-m
 ap.o obj/v8_base_without_compiler/allocation.o obj/v8_base_without_compiler/bit-vector.o obj/v8_base_without_compiler/detachable-vector.o obj/v8_base_without_compiler/identity-map.o obj/v8_base_without_compiler/memcopy.o obj/v8_base_without_compiler/ostreams.o obj/v8_base_without_compiler/utils.o obj/v8_base_without_compiler/version.o obj/v8_base_without_compiler/web-snapshot.o obj/v8_base_without_compiler/accounting-allocator.o obj/v8_base_without_compiler/type-stats.o obj/v8_base_without_compiler/zone-segment.o obj/v8_base_without_compiler/zone.o obj/v8_base_without_compiler/asm-js.o obj/v8_base_without_compiler/asm-parser.o obj/v8_base_without_compiler/asm-scanner.o obj/v8_base_without_compiler/asm-types.o obj/v8_base_without_compiler/debug-wasm-objects.o obj/v8_base_without_compiler/runtime-test-wasm.o obj/v8_base_without_compiler/runtime-wasm.o obj/v8_base_without_compiler/handler-inside.o obj/v8_base_without_compiler/handler-outside.o obj/v8_base_without_compiler/handler-share
 d.o obj/v8_base_without_compiler/liftoff-ass!
 embler.o !
 obj/v8_base_without_compiler/liftoff-compiler.o obj/v8_base_without_compiler/code-space-access.o obj/v8_base_without_compiler/function-body-decoder.o obj/v8_base_without_compiler/function-compiler.o obj/v8_base_without_compiler/graph-builder-interface.o obj/v8_base_without_compiler/init-expr-interface.o obj/v8_base_without_compiler/jump-table-assembler.o obj/v8_base_without_compiler/local-decl-encoder.o obj/v8_base_without_compiler/memory-protection-key.o obj/v8_base_without_compiler/memory-tracing.o obj/v8_base_without_compiler/module-compiler.o obj/v8_base_without_compiler/module-decoder.o obj/v8_base_without_compiler/module-instantiate.o obj/v8_base_without_compiler/signature-map.o obj/v8_base_without_compiler/simd-shuffle.o obj/v8_base_without_compiler/streaming-decoder.o obj/v8_base_without_compiler/sync-streaming-decoder.o obj/v8_base_without_compiler/value-type.o obj/v8_base_without_compiler/wasm-code-manager.o obj/v8_base_without_compiler/wasm-debug.o obj/v8_base_without_com
 piler/wasm-engine.o obj/v8_base_without_compiler/wasm-external-refs.o obj/v8_base_without_compiler/wasm-features.o obj/v8_base_without_compiler/wasm-import-wrapper-cache.o obj/v8_base_without_compiler/wasm-init-expr.o obj/v8_base_without_compiler/wasm-js.o obj/v8_base_without_compiler/wasm-module-builder.o obj/v8_base_without_compiler/wasm-module-sourcemap.o obj/v8_base_without_compiler/wasm-module.o obj/v8_base_without_compiler/wasm-objects.o obj/v8_base_without_compiler/wasm-opcodes.o obj/v8_base_without_compiler/wasm-result.o obj/v8_base_without_compiler/wasm-serialization.o obj/v8_base_without_compiler/wasm-subtyping.o obj/v8_base_without_compiler/heap-api-stub.o obj/v8_base_without_compiler/assembler-ia32.o obj/v8_base_without_compiler/cpu-ia32.o obj/v8_base_without_compiler/macro-assembler-ia32.o obj/v8_base_without_compiler/macro-assembler-shared-ia32-x64.o obj/v8_base_without_compiler/code-generator-ia32.o obj/v8_base_without_compiler/instruction-scheduler-ia32.o obj/v8_base
 _without_compiler/instruction-selector-ia32.!
 o obj/v8_!
 base_without_compiler/deoptimizer-ia32.o obj/v8_base_without_compiler/disasm-ia32.o obj/v8_base_without_compiler/unwinder-ia32.o obj/v8_base_without_compiler/frame-constants-ia32.o obj/v8_base_without_compiler/regexp-macro-assembler-ia32.o obj/v8_base_without_compiler/special-case.o obj/v8_init/setup-isolate-full.o obj/cppgc_base/allocation.o obj/cppgc_base/compaction-worklists.o obj/cppgc_base/compactor.o obj/cppgc_base/concurrent-marker.o obj/cppgc_base/default-platform.o obj/cppgc_base/explicit-management.o obj/cppgc_base/free-list.o obj/cppgc_base/gc-info-table.o obj/cppgc_base/gc-info.o obj/cppgc_base/gc-invoker.o obj/cppgc_base/heap-base.o obj/cppgc_base/heap-consistency.o obj/cppgc_base/heap-growing.o obj/cppgc_base/heap-object-header.o obj/cppgc_base/heap-page.o obj/cppgc_base/heap-space.o obj/cppgc_base/heap-state.o obj/cppgc_base/heap-statistics-collector.o obj/cppgc_base/heap.o obj/cppgc_base/incremental-marking-schedule.o obj/cppgc_base/liveness-broker.o obj/cppgc_base/l
 ogging.o obj/cppgc_base/marker.o obj/cppgc_base/marking-state.o obj/cppgc_base/marking-verifier.o obj/cppgc_base/marking-visitor.o obj/cppgc_base/marking-worklists.o obj/cppgc_base/memory.o obj/cppgc_base/name-trait.o obj/cppgc_base/object-allocator.o obj/cppgc_base/object-size-trait.o obj/cppgc_base/page-memory.o obj/cppgc_base/persistent-node.o obj/cppgc_base/platform.o obj/cppgc_base/pointer-policies.o obj/cppgc_base/prefinalizer-handler.o obj/cppgc_base/process-heap-statistics.o obj/cppgc_base/process-heap.o obj/cppgc_base/raw-heap.o obj/cppgc_base/source-location.o obj/cppgc_base/stats-collector.o obj/cppgc_base/sweeper.o obj/cppgc_base/testing.o obj/cppgc_base/trace-trait.o obj/cppgc_base/virtual-memory.o obj/cppgc_base/visitor.o obj/cppgc_base/write-barrier.o obj/v8_cppgc_shared/stack.o obj/v8_cppgc_shared/worklist.o obj/v8_cppgc_shared/push_registers_asm.o obj/torque_generated_definitions/class-verifiers.o obj/torque_generated_definitions/factory.o obj/torque_generated_defin
 itions/objects-printer.o obj/torque_generate!
 d_definit!
 ions/aggregate-error-tq.o obj/torque_generated_definitions/array-at-tq.o obj/torque_generated_definitions/array-concat-tq.o obj/torque_generated_definitions/array-copywithin-tq.o obj/torque_generated_definitions/array-every-tq.o obj/torque_generated_definitions/array-filter-tq.o obj/torque_generated_definitions/array-find-tq.o obj/torque_generated_definitions/array-findindex-tq.o obj/torque_generated_definitions/array-findlast-tq.o obj/torque_generated_definitions/array-findlastindex-tq.o obj/torque_generated_definitions/array-foreach-tq.o obj/torque_generated_definitions/array-from-tq.o obj/torque_generated_definitions/array-isarray-tq.o obj/torque_generated_definitions/array-join-tq.o obj/torque_generated_definitions/array-lastindexof-tq.o obj/torque_generated_definitions/array-map-tq.o obj/torque_generated_definitions/array-of-tq.o obj/torque_generated_definitions/array-reduce-right-tq.o obj/torque_generated_definitions/array-reduce-tq.o obj/torque_generated_definitions/array-rev
 erse-tq.o obj/torque_generated_definitions/array-shift-tq.o obj/torque_generated_definitions/array-slice-tq.o obj/torque_generated_definitions/array-some-tq.o obj/torque_generated_definitions/array-splice-tq.o obj/torque_generated_definitions/array-unshift-tq.o obj/torque_generated_definitions/array-tq.o obj/torque_generated_definitions/arraybuffer-tq.o obj/torque_generated_definitions/base-tq.o obj/torque_generated_definitions/boolean-tq.o obj/torque_generated_definitions/builtins-bigint-tq.o obj/torque_generated_definitions/builtins-string-tq.o obj/torque_generated_definitions/cast-tq.o obj/torque_generated_definitions/collections-tq.o obj/torque_generated_definitions/constructor-tq.o obj/torque_generated_definitions/conversion-tq.o obj/torque_generated_definitions/convert-tq.o obj/torque_generated_definitions/console-tq.o obj/torque_generated_definitions/data-view-tq.o obj/torque_generated_definitions/finalization-registry-tq.o obj/torque_generated_definitions/frames-tq.o obj/tor
 que_generated_definitions/frame-arguments-tq!
 .o obj/to!
 rque_generated_definitions/function-tq.o obj/torque_generated_definitions/growable-fixed-array-tq.o obj/torque_generated_definitions/ic-callable-tq.o obj/torque_generated_definitions/ic-dynamic-check-maps-tq.o obj/torque_generated_definitions/ic-tq.o obj/torque_generated_definitions/internal-coverage-tq.o obj/torque_generated_definitions/internal-tq.o obj/torque_generated_definitions/iterator-tq.o obj/torque_generated_definitions/math-tq.o obj/torque_generated_definitions/number-tq.o obj/torque_generated_definitions/object-fromentries-tq.o obj/torque_generated_definitions/object-tq.o obj/torque_generated_definitions/promise-abstract-operations-tq.o obj/torque_generated_definitions/promise-all-tq.o obj/torque_generated_definitions/promise-all-element-closure-tq.o obj/torque_generated_definitions/promise-any-tq.o obj/torque_generated_definitions/promise-constructor-tq.o obj/torque_generated_definitions/promise-finally-tq.o obj/torque_generated_definitions/promise-misc-tq.o obj/torque_
 generated_definitions/promise-race-tq.o obj/torque_generated_definitions/promise-reaction-job-tq.o obj/torque_generated_definitions/promise-resolve-tq.o obj/torque_generated_definitions/promise-then-tq.o obj/torque_generated_definitions/promise-jobs-tq.o obj/torque_generated_definitions/proxy-constructor-tq.o obj/torque_generated_definitions/proxy-delete-property-tq.o obj/torque_generated_definitions/proxy-get-property-tq.o obj/torque_generated_definitions/proxy-get-prototype-of-tq.o obj/torque_generated_definitions/proxy-has-property-tq.o obj/torque_generated_definitions/proxy-is-extensible-tq.o obj/torque_generated_definitions/proxy-prevent-extensions-tq.o obj/torque_generated_definitions/proxy-revocable-tq.o obj/torque_generated_definitions/proxy-revoke-tq.o obj/torque_generated_definitions/proxy-set-property-tq.o obj/torque_generated_definitions/proxy-set-prototype-of-tq.o obj/torque_generated_definitions/proxy-tq.o obj/torque_generated_definitions/reflect-tq.o obj/torque_genera
 ted_definitions/regexp-exec-tq.o obj/torque_!
 generated!
 _definitions/regexp-match-all-tq.o obj/torque_generated_definitions/regexp-match-tq.o obj/torque_generated_definitions/regexp-replace-tq.o obj/torque_generated_definitions/regexp-search-tq.o obj/torque_generated_definitions/regexp-source-tq.o obj/torque_generated_definitions/regexp-split-tq.o obj/torque_generated_definitions/regexp-test-tq.o obj/torque_generated_definitions/regexp-tq.o obj/torque_generated_definitions/string-at-tq.o obj/torque_generated_definitions/string-endswith-tq.o obj/torque_generated_definitions/string-html-tq.o obj/torque_generated_definitions/string-includes-tq.o obj/torque_generated_definitions/string-indexof-tq.o obj/torque_generated_definitions/string-iterator-tq.o obj/torque_generated_definitions/string-match-search-tq.o obj/torque_generated_definitions/string-pad-tq.o obj/torque_generated_definitions/string-repeat-tq.o obj/torque_generated_definitions/string-replaceall-tq.o obj/torque_generated_definitions/string-slice-tq.o obj/torque_generated_definiti
 ons/string-startswith-tq.o obj/torque_generated_definitions/string-substr-tq.o obj/torque_generated_definitions/string-substring-tq.o obj/torque_generated_definitions/string-trim-tq.o obj/torque_generated_definitions/symbol-tq.o obj/torque_generated_definitions/torque-internal-tq.o obj/torque_generated_definitions/typed-array-at-tq.o obj/torque_generated_definitions/typed-array-createtypedarray-tq.o obj/torque_generated_definitions/typed-array-every-tq.o obj/torque_generated_definitions/typed-array-entries-tq.o obj/torque_generated_definitions/typed-array-filter-tq.o obj/torque_generated_definitions/typed-array-find-tq.o obj/torque_generated_definitions/typed-array-findindex-tq.o obj/torque_generated_definitions/typed-array-findlast-tq.o obj/torque_generated_definitions/typed-array-findlastindex-tq.o obj/torque_generated_definitions/typed-array-foreach-tq.o obj/torque_generated_definitions/typed-array-from-tq.o obj/torque_generated_definitions/typed-array-keys-tq.o obj/torque_genera
 ted_definitions/typed-array-of-tq.o obj/torq!
 ue_genera!
 ted_definitions/typed-array-reduce-tq.o obj/torque_generated_definitions/typed-array-reduceright-tq.o obj/torque_generated_definitions/typed-array-set-tq.o obj/torque_generated_definitions/typed-array-slice-tq.o obj/torque_generated_definitions/typed-array-some-tq.o obj/torque_generated_definitions/typed-array-sort-tq.o obj/torque_generated_definitions/typed-array-subarray-tq.o obj/torque_generated_definitions/typed-array-values-tq.o obj/torque_generated_definitions/typed-array-tq.o obj/torque_generated_definitions/weak-ref-tq.o obj/torque_generated_definitions/handler-configuration-tq.o obj/torque_generated_definitions/allocation-site-tq.o obj/torque_generated_definitions/api-callbacks-tq.o obj/torque_generated_definitions/arguments-tq.o obj/torque_generated_definitions/bigint-tq.o obj/torque_generated_definitions/cell-tq.o obj/torque_generated_definitions/code-tq.o obj/torque_generated_definitions/contexts-tq.o obj/torque_generated_definitions/data-handler-tq.o obj/torque_generate
 d_definitions/debug-objects-tq.o obj/torque_generated_definitions/descriptor-array-tq.o obj/torque_generated_definitions/embedder-data-array-tq.o obj/torque_generated_definitions/feedback-cell-tq.o obj/torque_generated_definitions/feedback-vector-tq.o obj/torque_generated_definitions/fixed-array-tq.o obj/torque_generated_definitions/foreign-tq.o obj/torque_generated_definitions/free-space-tq.o obj/torque_generated_definitions/heap-number-tq.o obj/torque_generated_definitions/heap-object-tq.o obj/torque_generated_definitions/js-array-buffer-tq.o obj/torque_generated_definitions/js-array-tq.o obj/torque_generated_definitions/js-collection-iterator-tq.o obj/torque_generated_definitions/js-collection-tq.o obj/torque_generated_definitions/js-function-tq.o obj/torque_generated_definitions/js-generator-tq.o obj/torque_generated_definitions/js-objects-tq.o obj/torque_generated_definitions/js-promise-tq.o obj/torque_generated_definitions/js-proxy-tq.o obj/torque_generated_definitions/js-rege
 xp-string-iterator-tq.o obj/torque_generated!
 _definiti!
 ons/js-regexp-tq.o obj/torque_generated_definitions/js-weak-refs-tq.o obj/torque_generated_definitions/literal-objects-tq.o obj/torque_generated_definitions/map-tq.o obj/torque_generated_definitions/megadom-handler-tq.o obj/torque_generated_definitions/microtask-tq.o obj/torque_generated_definitions/module-tq.o obj/torque_generated_definitions/name-tq.o obj/torque_generated_definitions/oddball-tq.o obj/torque_generated_definitions/ordered-hash-table-tq.o obj/torque_generated_definitions/primitive-heap-object-tq.o obj/torque_generated_definitions/promise-tq.o obj/torque_generated_definitions/property-array-tq.o obj/torque_generated_definitions/property-cell-tq.o obj/torque_generated_definitions/property-descriptor-object-tq.o obj/torque_generated_definitions/prototype-info-tq.o obj/torque_generated_definitions/regexp-match-info-tq.o obj/torque_generated_definitions/scope-info-tq.o obj/torque_generated_definitions/script-tq.o obj/torque_generated_definitions/shared-function-info-tq.o 
 obj/torque_generated_definitions/source-text-module-tq.o obj/torque_generated_definitions/stack-frame-info-tq.o obj/torque_generated_definitions/string-tq.o obj/torque_generated_definitions/struct-tq.o obj/torque_generated_definitions/swiss-hash-table-helpers-tq.o obj/torque_generated_definitions/swiss-name-dictionary-tq.o obj/torque_generated_definitions/synthetic-module-tq.o obj/torque_generated_definitions/template-objects-tq.o obj/torque_generated_definitions/templates-tq.o obj/torque_generated_definitions/torque-defined-classes-tq.o obj/torque_generated_definitions/test-torque-tq.o obj/torque_generated_definitions/array-sort-tq.o obj/torque_generated_definitions/intl-objects-tq.o obj/torque_generated_definitions/js-break-iterator-tq.o obj/torque_generated_definitions/js-collator-tq.o obj/torque_generated_definitions/js-date-time-format-tq.o obj/torque_generated_definitions/js-display-names-tq.o obj/torque_generated_definitions/js-list-format-tq.o obj/torque_generated_definition
 s/js-locale-tq.o obj/torque_generated_defini!
 tions/js-!
 number-format-tq.o obj/torque_generated_definitions/js-plural-rules-tq.o obj/torque_generated_definitions/js-relative-time-format-tq.o obj/torque_generated_definitions/js-segment-iterator-tq.o obj/torque_generated_definitions/js-segmenter-tq.o obj/torque_generated_definitions/js-segments-tq.o obj/torque_generated_definitions/wasm-tq.o obj/torque_generated_definitions/debug-wasm-objects-tq.o obj/torque_generated_definitions/wasm-objects-tq.o obj/v8_bigint/bigint-internal.o obj/v8_bigint/div-burnikel.o obj/v8_bigint/div-helpers.o obj/v8_bigint/div-schoolbook.o obj/v8_bigint/fromstring.o obj/v8_bigint/mul-karatsuba.o obj/v8_bigint/mul-schoolbook.o obj/v8_bigint/tostring.o obj/v8_bigint/vector-arithmetic.o obj/v8_bigint/div-barrett.o obj/v8_bigint/mul-fft.o obj/v8_bigint/mul-toom.o obj/src/inspector/inspector/Protocol.o obj/src/inspector/inspector/Console.o obj/src/inspector/inspector/Debugger.o obj/src/inspector/inspector/HeapProfiler.o obj/src/inspector/inspector/Profiler.o obj/src/in
 spector/inspector/Runtime.o obj/src/inspector/inspector/Schema.o obj/src/inspector/inspector/custom-preview.o obj/src/inspector/inspector/injected-script.o obj/src/inspector/inspector/inspected-context.o obj/src/inspector/inspector/remote-object-id.o obj/src/inspector/inspector/search-util.o obj/src/inspector/inspector/string-16.o obj/src/inspector/inspector/string-util.o obj/src/inspector/inspector/test-interface.o obj/src/inspector/inspector/v8-console-agent-impl.o obj/src/inspector/inspector/v8-console-message.o obj/src/inspector/inspector/v8-console.o obj/src/inspector/inspector/v8-debugger-agent-impl.o obj/src/inspector/inspector/v8-debugger-id.o obj/src/inspector/inspector/v8-debugger-script.o obj/src/inspector/inspector/v8-debugger.o obj/src/inspector/inspector/v8-heap-profiler-agent-impl.o obj/src/inspector/inspector/v8-inspector-impl.o obj/src/inspector/inspector/v8-inspector-session-impl.o obj/src/inspector/inspector/v8-profiler-agent-impl.o obj/src/inspector/inspector/v8-
 regex.o obj/src/inspector/inspector/v8-runti!
 me-agent-!
 impl.o obj/src/inspector/inspector/v8-schema-agent-impl.o obj/src/inspector/inspector/v8-stack-trace-impl.o obj/src/inspector/inspector/v8-value-utils.o obj/src/inspector/inspector/value-mirror.o obj/src/inspector/inspector_string_conversions/v8-string-conversions.o obj/third_party/inspector_protocol/crdtp/cbor.o obj/third_party/inspector_protocol/crdtp/dispatch.o obj/third_party/inspector_protocol/crdtp/error_support.o obj/third_party/inspector_protocol/crdtp/json.o obj/third_party/inspector_protocol/crdtp/protocol_core.o obj/third_party/inspector_protocol/crdtp/serializable.o obj/third_party/inspector_protocol/crdtp/span.o obj/third_party/inspector_protocol/crdtp/status.o obj/third_party/inspector_protocol/crdtp_platform/json_platform_v8.o obj/v8_compiler/access-builder.o obj/v8_compiler/access-info.o obj/v8_compiler/add-type-assertions-reducer.o obj/v8_compiler/all-nodes.o obj/v8_compiler/code-generator.o obj/v8_compiler/frame-elider.o obj/v8_compiler/gap-resolver.o obj/v8_compil
 er/instruction-scheduler.o obj/v8_compiler/instruction-selector.o obj/v8_compiler/instruction.o obj/v8_compiler/jump-threading.o obj/v8_compiler/mid-tier-register-allocator.o obj/v8_compiler/move-optimizer.o obj/v8_compiler/register-allocator-verifier.o obj/v8_compiler/register-allocator.o obj/v8_compiler/spill-placer.o obj/v8_compiler/basic-block-instrumentor.o obj/v8_compiler/branch-elimination.o obj/v8_compiler/bytecode-analysis.o obj/v8_compiler/bytecode-graph-builder.o obj/v8_compiler/bytecode-liveness-map.o obj/v8_compiler/c-linkage.o obj/v8_compiler/checkpoint-elimination.o obj/v8_compiler/code-assembler.o obj/v8_compiler/common-node-cache.o obj/v8_compiler/common-operator-reducer.o obj/v8_compiler/common-operator.o obj/v8_compiler/compilation-dependencies.o obj/v8_compiler/compiler-source-position-table.o obj/v8_compiler/constant-folding-reducer.o obj/v8_compiler/control-equivalence.o obj/v8_compiler/control-flow-optimizer.o obj/v8_compiler/csa-load-elimination.o obj/v8_comp
 iler/dead-code-elimination.o obj/v8_compiler!
 /decompre!
 ssion-optimizer.o obj/v8_compiler/effect-control-linearizer.o obj/v8_compiler/escape-analysis-reducer.o obj/v8_compiler/escape-analysis.o obj/v8_compiler/fast-api-calls.o obj/v8_compiler/feedback-source.o obj/v8_compiler/frame-states.o obj/v8_compiler/frame.o obj/v8_compiler/graph-assembler.o obj/v8_compiler/graph-reducer.o obj/v8_compiler/graph-trimmer.o obj/v8_compiler/graph-visualizer.o obj/v8_compiler/graph.o obj/v8_compiler/heap-refs.o obj/v8_compiler/js-call-reducer.o obj/v8_compiler/js-context-specialization.o obj/v8_compiler/js-create-lowering.o obj/v8_compiler/js-generic-lowering.o obj/v8_compiler/js-graph.o obj/v8_compiler/js-heap-broker.o obj/v8_compiler/js-heap-copy-reducer.o obj/v8_compiler/js-inlining-heuristic.o obj/v8_compiler/js-inlining.o obj/v8_compiler/js-intrinsic-lowering.o obj/v8_compiler/js-native-context-specialization.o obj/v8_compiler/js-operator.o obj/v8_compiler/js-type-hint-lowering.o obj/v8_compiler/js-typed-lowering.o obj/v8_compiler/linkage.o obj/v8_
 compiler/load-elimination.o obj/v8_compiler/loop-analysis.o obj/v8_compiler/loop-peeling.o obj/v8_compiler/loop-unrolling.o obj/v8_compiler/loop-variable-optimizer.o obj/v8_compiler/machine-graph-verifier.o obj/v8_compiler/machine-graph.o obj/v8_compiler/machine-operator-reducer.o obj/v8_compiler/machine-operator.o obj/v8_compiler/map-inference.o obj/v8_compiler/memory-lowering.o obj/v8_compiler/memory-optimizer.o obj/v8_compiler/node-marker.o obj/v8_compiler/node-matchers.o obj/v8_compiler/node-observer.o obj/v8_compiler/node-origin-table.o obj/v8_compiler/node-properties.o obj/v8_compiler/node.o obj/v8_compiler/opcodes.o obj/v8_compiler/operation-typer.o obj/v8_compiler/operator-properties.o obj/v8_compiler/operator.o obj/v8_compiler/osr.o obj/v8_compiler/pipeline-statistics.o obj/v8_compiler/pipeline.o obj/v8_compiler/property-access-builder.o obj/v8_compiler/raw-machine-assembler.o obj/v8_compiler/redundancy-elimination.o obj/v8_compiler/refs-map.o obj/v8_compiler/representation
 -change.o obj/v8_compiler/schedule.o obj/v8_!
 compiler/!
 scheduler.o obj/v8_compiler/select-lowering.o obj/v8_compiler/simplified-lowering.o obj/v8_compiler/simplified-operator-reducer.o obj/v8_compiler/simplified-operator.o obj/v8_compiler/state-values-utils.o obj/v8_compiler/store-store-elimination.o obj/v8_compiler/type-cache.o obj/v8_compiler/type-narrowing-reducer.o obj/v8_compiler/typed-optimization.o obj/v8_compiler/typer.o obj/v8_compiler/types.o obj/v8_compiler/value-numbering-reducer.o obj/v8_compiler/verifier.o obj/v8_compiler/zone-stats.o obj/v8_compiler/int64-lowering.o obj/v8_compiler/wasm-compiler.o obj/v8_initializers/builtins-array-gen.o obj/v8_initializers/builtins-async-function-gen.o obj/v8_initializers/builtins-async-gen.o obj/v8_initializers/builtins-async-generator-gen.o obj/v8_initializers/builtins-async-iterator-gen.o obj/v8_initializers/builtins-bigint-gen.o obj/v8_initializers/builtins-call-gen.o obj/v8_initializers/builtins-collections-gen.o obj/v8_initializers/builtins-constructor-gen.o obj/v8_initializers/bui
 ltins-conversion-gen.o obj/v8_initializers/builtins-date-gen.o obj/v8_initializers/builtins-generator-gen.o obj/v8_initializers/builtins-global-gen.o obj/v8_initializers/builtins-handler-gen.o obj/v8_initializers/builtins-ic-gen.o obj/v8_initializers/builtins-internal-gen.o obj/v8_initializers/builtins-interpreter-gen.o obj/v8_initializers/builtins-intl-gen.o obj/v8_initializers/builtins-iterator-gen.o obj/v8_initializers/builtins-lazy-gen.o obj/v8_initializers/builtins-microtask-queue-gen.o obj/v8_initializers/builtins-number-gen.o obj/v8_initializers/builtins-object-gen.o obj/v8_initializers/builtins-promise-gen.o obj/v8_initializers/builtins-proxy-gen.o obj/v8_initializers/builtins-regexp-gen.o obj/v8_initializers/builtins-sharedarraybuffer-gen.o obj/v8_initializers/builtins-string-gen.o obj/v8_initializers/builtins-typed-array-gen.o obj/v8_initializers/growable-fixed-array-gen.o obj/v8_initializers/profile-data-reader.o obj/v8_initializers/setup-builtins-internal.o obj/v8_initia
 lizers/code-stub-assembler.o obj/v8_initiali!
 zers/setu!
 p-heap-internal.o obj/v8_initializers/accessor-assembler.o obj/v8_initializers/binary-op-assembler.o obj/v8_initializers/keyed-store-generic.o obj/v8_initializers/unary-op-assembler.o obj/v8_initializers/interpreter-assembler.o obj/v8_initializers/interpreter-generator.o obj/v8_initializers/interpreter-intrinsics-generator.o obj/v8_initializers/builtins-wasm-gen.o obj/v8_initializers/builtins-ia32.o obj/torque_generated_initializers/enum-verifiers.o obj/torque_generated_initializers/exported-macros-assembler.o obj/torque_generated_initializers/aggregate-error-tq-csa.o obj/torque_generated_initializers/array-at-tq-csa.o obj/torque_generated_initializers/array-concat-tq-csa.o obj/torque_generated_initializers/array-copywithin-tq-csa.o obj/torque_generated_initializers/array-every-tq-csa.o obj/torque_generated_initializers/array-filter-tq-csa.o obj/torque_generated_initializers/array-find-tq-csa.o obj/torque_generated_initializers/array-findindex-tq-csa.o obj/torque_generated_initializ
 ers/array-findlast-tq-csa.o obj/torque_generated_initializers/array-findlastindex-tq-csa.o obj/torque_generated_initializers/array-foreach-tq-csa.o obj/torque_generated_initializers/array-from-tq-csa.o obj/torque_generated_initializers/array-isarray-tq-csa.o obj/torque_generated_initializers/array-join-tq-csa.o obj/torque_generated_initializers/array-lastindexof-tq-csa.o obj/torque_generated_initializers/array-map-tq-csa.o obj/torque_generated_initializers/array-of-tq-csa.o obj/torque_generated_initializers/array-reduce-right-tq-csa.o obj/torque_generated_initializers/array-reduce-tq-csa.o obj/torque_generated_initializers/array-reverse-tq-csa.o obj/torque_generated_initializers/array-shift-tq-csa.o obj/torque_generated_initializers/array-slice-tq-csa.o obj/torque_generated_initializers/array-some-tq-csa.o obj/torque_generated_initializers/array-splice-tq-csa.o obj/torque_generated_initializers/array-unshift-tq-csa.o obj/torque_generated_initializers/array-tq-csa.o obj/torque_genera
 ted_initializers/arraybuffer-tq-csa.o obj/to!
 rque_gene!
 rated_initializers/base-tq-csa.o obj/torque_generated_initializers/boolean-tq-csa.o obj/torque_generated_initializers/builtins-bigint-tq-csa.o obj/torque_generated_initializers/builtins-string-tq-csa.o obj/torque_generated_initializers/cast-tq-csa.o obj/torque_generated_initializers/collections-tq-csa.o obj/torque_generated_initializers/constructor-tq-csa.o obj/torque_generated_initializers/conversion-tq-csa.o obj/torque_generated_initializers/convert-tq-csa.o obj/torque_generated_initializers/console-tq-csa.o obj/torque_generated_initializers/data-view-tq-csa.o obj/torque_generated_initializers/finalization-registry-tq-csa.o obj/torque_generated_initializers/frames-tq-csa.o obj/torque_generated_initializers/frame-arguments-tq-csa.o obj/torque_generated_initializers/function-tq-csa.o obj/torque_generated_initializers/growable-fixed-array-tq-csa.o obj/torque_generated_initializers/ic-callable-tq-csa.o obj/torque_generated_initializers/ic-dynamic-check-maps-tq-csa.o obj/torque_generat
 ed_initializers/ic-tq-csa.o obj/torque_generated_initializers/internal-coverage-tq-csa.o obj/torque_generated_initializers/internal-tq-csa.o obj/torque_generated_initializers/iterator-tq-csa.o obj/torque_generated_initializers/math-tq-csa.o obj/torque_generated_initializers/number-tq-csa.o obj/torque_generated_initializers/object-fromentries-tq-csa.o obj/torque_generated_initializers/object-tq-csa.o obj/torque_generated_initializers/promise-abstract-operations-tq-csa.o obj/torque_generated_initializers/promise-all-tq-csa.o obj/torque_generated_initializers/promise-all-element-closure-tq-csa.o obj/torque_generated_initializers/promise-any-tq-csa.o obj/torque_generated_initializers/promise-constructor-tq-csa.o obj/torque_generated_initializers/promise-finally-tq-csa.o obj/torque_generated_initializers/promise-misc-tq-csa.o obj/torque_generated_initializers/promise-race-tq-csa.o obj/torque_generated_initializers/promise-reaction-job-tq-csa.o obj/torque_generated_initializers/promise-re
 solve-tq-csa.o obj/torque_generated_initiali!
 zers/prom!
 ise-then-tq-csa.o obj/torque_generated_initializers/promise-jobs-tq-csa.o obj/torque_generated_initializers/proxy-constructor-tq-csa.o obj/torque_generated_initializers/proxy-delete-property-tq-csa.o obj/torque_generated_initializers/proxy-get-property-tq-csa.o obj/torque_generated_initializers/proxy-get-prototype-of-tq-csa.o obj/torque_generated_initializers/proxy-has-property-tq-csa.o obj/torque_generated_initializers/proxy-is-extensible-tq-csa.o obj/torque_generated_initializers/proxy-prevent-extensions-tq-csa.o obj/torque_generated_initializers/proxy-revocable-tq-csa.o obj/torque_generated_initializers/proxy-revoke-tq-csa.o obj/torque_generated_initializers/proxy-set-property-tq-csa.o obj/torque_generated_initializers/proxy-set-prototype-of-tq-csa.o obj/torque_generated_initializers/proxy-tq-csa.o obj/torque_generated_initializers/reflect-tq-csa.o obj/torque_generated_initializers/regexp-exec-tq-csa.o obj/torque_generated_initializers/regexp-match-all-tq-csa.o obj/torque_generat
 ed_initializers/regexp-match-tq-csa.o obj/torque_generated_initializers/regexp-replace-tq-csa.o obj/torque_generated_initializers/regexp-search-tq-csa.o obj/torque_generated_initializers/regexp-source-tq-csa.o obj/torque_generated_initializers/regexp-split-tq-csa.o obj/torque_generated_initializers/regexp-test-tq-csa.o obj/torque_generated_initializers/regexp-tq-csa.o obj/torque_generated_initializers/string-at-tq-csa.o obj/torque_generated_initializers/string-endswith-tq-csa.o obj/torque_generated_initializers/string-html-tq-csa.o obj/torque_generated_initializers/string-includes-tq-csa.o obj/torque_generated_initializers/string-indexof-tq-csa.o obj/torque_generated_initializers/string-iterator-tq-csa.o obj/torque_generated_initializers/string-match-search-tq-csa.o obj/torque_generated_initializers/string-pad-tq-csa.o obj/torque_generated_initializers/string-repeat-tq-csa.o obj/torque_generated_initializers/string-replaceall-tq-csa.o obj/torque_generated_initializers/string-slice-t
 q-csa.o obj/torque_generated_initializers/st!
 ring-star!
 tswith-tq-csa.o obj/torque_generated_initializers/string-substr-tq-csa.o obj/torque_generated_initializers/string-substring-tq-csa.o obj/torque_generated_initializers/string-trim-tq-csa.o obj/torque_generated_initializers/symbol-tq-csa.o obj/torque_generated_initializers/torque-internal-tq-csa.o obj/torque_generated_initializers/typed-array-at-tq-csa.o obj/torque_generated_initializers/typed-array-createtypedarray-tq-csa.o obj/torque_generated_initializers/typed-array-every-tq-csa.o obj/torque_generated_initializers/typed-array-entries-tq-csa.o obj/torque_generated_initializers/typed-array-filter-tq-csa.o obj/torque_generated_initializers/typed-array-find-tq-csa.o obj/torque_generated_initializers/typed-array-findindex-tq-csa.o obj/torque_generated_initializers/typed-array-findlast-tq-csa.o obj/torque_generated_initializers/typed-array-findlastindex-tq-csa.o obj/torque_generated_initializers/typed-array-foreach-tq-csa.o obj/torque_generated_initializers/typed-array-from-tq-csa.o obj
 /torque_generated_initializers/typed-array-keys-tq-csa.o obj/torque_generated_initializers/typed-array-of-tq-csa.o obj/torque_generated_initializers/typed-array-reduce-tq-csa.o obj/torque_generated_initializers/typed-array-reduceright-tq-csa.o obj/torque_generated_initializers/typed-array-set-tq-csa.o obj/torque_generated_initializers/typed-array-slice-tq-csa.o obj/torque_generated_initializers/typed-array-some-tq-csa.o obj/torque_generated_initializers/typed-array-sort-tq-csa.o obj/torque_generated_initializers/typed-array-subarray-tq-csa.o obj/torque_generated_initializers/typed-array-values-tq-csa.o obj/torque_generated_initializers/typed-array-tq-csa.o obj/torque_generated_initializers/weak-ref-tq-csa.o obj/torque_generated_initializers/handler-configuration-tq-csa.o obj/torque_generated_initializers/allocation-site-tq-csa.o obj/torque_generated_initializers/api-callbacks-tq-csa.o obj/torque_generated_initializers/arguments-tq-csa.o obj/torque_generated_initializers/bigint-tq-cs
 a.o obj/torque_generated_initializers/cell-t!
 q-csa.o o!
 bj/torque_generated_initializers/code-tq-csa.o obj/torque_generated_initializers/contexts-tq-csa.o obj/torque_generated_initializers/data-handler-tq-csa.o obj/torque_generated_initializers/debug-objects-tq-csa.o obj/torque_generated_initializers/descriptor-array-tq-csa.o obj/torque_generated_initializers/embedder-data-array-tq-csa.o obj/torque_generated_initializers/feedback-cell-tq-csa.o obj/torque_generated_initializers/feedback-vector-tq-csa.o obj/torque_generated_initializers/fixed-array-tq-csa.o obj/torque_generated_initializers/foreign-tq-csa.o obj/torque_generated_initializers/free-space-tq-csa.o obj/torque_generated_initializers/heap-number-tq-csa.o obj/torque_generated_initializers/heap-object-tq-csa.o obj/torque_generated_initializers/js-array-buffer-tq-csa.o obj/torque_generated_initializers/js-array-tq-csa.o obj/torque_generated_initializers/js-collection-iterator-tq-csa.o obj/torque_generated_initializers/js-collection-tq-csa.o obj/torque_generated_initializers/js-funct
 ion-tq-csa.o obj/torque_generated_initializers/js-generator-tq-csa.o obj/torque_generated_initializers/js-objects-tq-csa.o obj/torque_generated_initializers/js-promise-tq-csa.o obj/torque_generated_initializers/js-proxy-tq-csa.o obj/torque_generated_initializers/js-regexp-string-iterator-tq-csa.o obj/torque_generated_initializers/js-regexp-tq-csa.o obj/torque_generated_initializers/js-weak-refs-tq-csa.o obj/torque_generated_initializers/literal-objects-tq-csa.o obj/torque_generated_initializers/map-tq-csa.o obj/torque_generated_initializers/megadom-handler-tq-csa.o obj/torque_generated_initializers/microtask-tq-csa.o obj/torque_generated_initializers/module-tq-csa.o obj/torque_generated_initializers/name-tq-csa.o obj/torque_generated_initializers/oddball-tq-csa.o obj/torque_generated_initializers/ordered-hash-table-tq-csa.o obj/torque_generated_initializers/primitive-heap-object-tq-csa.o obj/torque_generated_initializers/promise-tq-csa.o obj/torque_generated_initializers/property-ar
 ray-tq-csa.o obj/torque_generated_initialize!
 rs/proper!
 ty-cell-tq-csa.o obj/torque_generated_initializers/property-descriptor-object-tq-csa.o obj/torque_generated_initializers/prototype-info-tq-csa.o obj/torque_generated_initializers/regexp-match-info-tq-csa.o obj/torque_generated_initializers/scope-info-tq-csa.o obj/torque_generated_initializers/script-tq-csa.o obj/torque_generated_initializers/shared-function-info-tq-csa.o obj/torque_generated_initializers/source-text-module-tq-csa.o obj/torque_generated_initializers/stack-frame-info-tq-csa.o obj/torque_generated_initializers/string-tq-csa.o obj/torque_generated_initializers/struct-tq-csa.o obj/torque_generated_initializers/swiss-hash-table-helpers-tq-csa.o obj/torque_generated_initializers/swiss-name-dictionary-tq-csa.o obj/torque_generated_initializers/synthetic-module-tq-csa.o obj/torque_generated_initializers/template-objects-tq-csa.o obj/torque_generated_initializers/templates-tq-csa.o obj/torque_generated_initializers/torque-defined-classes-tq-csa.o obj/torque_generated_initiali
 zers/test-torque-tq-csa.o obj/torque_generated_initializers/array-sort-tq-csa.o obj/torque_generated_initializers/intl-objects-tq-csa.o obj/torque_generated_initializers/js-break-iterator-tq-csa.o obj/torque_generated_initializers/js-collator-tq-csa.o obj/torque_generated_initializers/js-date-time-format-tq-csa.o obj/torque_generated_initializers/js-display-names-tq-csa.o obj/torque_generated_initializers/js-list-format-tq-csa.o obj/torque_generated_initializers/js-locale-tq-csa.o obj/torque_generated_initializers/js-number-format-tq-csa.o obj/torque_generated_initializers/js-plural-rules-tq-csa.o obj/torque_generated_initializers/js-relative-time-format-tq-csa.o obj/torque_generated_initializers/js-segment-iterator-tq-csa.o obj/torque_generated_initializers/js-segmenter-tq-csa.o obj/torque_generated_initializers/js-segments-tq-csa.o obj/torque_generated_initializers/wasm-tq-csa.o obj/torque_generated_initializers/debug-wasm-objects-tq-csa.o obj/torque_generated_initializers/wasm-ob
 jects-tq-csa.o obj/third_party/zlib/google/l!
 ibcompres!
 sion_utils_portable.a ./libv8_libbase.so ./libv8_libplatform.so ./libchrome_zlib.so --end-group -lpthread -licui18n -licuuc -licudata -lc++ -lm -lgcc --as-needed -lgcc_s --no-as-needed -lc -lgcc --as-needed -lgcc_s --no-as-needed /usr/lib/crtendS.o /usr/lib/crtn.o
#0 0x02150fb4 (/usr/bin/ld.lld+0x2150fb4)
#1 0x02151430 (/usr/bin/ld.lld+0x2151430)
#2 0x0214f01e (/usr/bin/ld.lld+0x214f01e)
#3 0x0215171c (/usr/bin/ld.lld+0x215171c)
#4 0x23b7a729 (/lib/libthr.so.3+0x18729)
c++: error: unable to execute command: Abort trap (core dumped)
c++: error: linker command failed due to signal (use -v to see invocation)
ninja: build stopped: subcommand failed.
===> Compilation failed unexpectedly.
Try to set MAKE_JOBS_UNSAFE=yes and rebuild before reporting the failure to
the maintainer.
*** Error code 1

Stop.
make: stopped in /usr/ports/lang/v8
Received on Thu Oct 28 2021 - 07:59:41 UTC

Original text of this message