[package - 130amd64-quarterly][science/py-tensorflow] Failed for py38-tensorflow-1.15.5_2 in build

From: <pkg-fallout_at_FreeBSD.org>
Date: Thu, 28 Oct 2021 02:05:57 GMT
You are receiving this mail as a port that you maintain
is failing to build on the FreeBSD package build server.
Please investigate the failure and submit a PR to fix
build.

Maintainer:     amzo1337_at_gmail.com
Log URL:        http://beefy14.nyi.freebsd.org/data/130amd64-quarterly/fd73fc6e3c70/logs/py38-tensorflow-1.15.5_2.log
Build URL:      http://beefy14.nyi.freebsd.org/build.html?mastername=130amd64-quarterly&build=fd73fc6e3c70
Log:

=>> Building science/py-tensorflow
build started at Thu Oct 28 01:11:29 UTC 2021
port directory: /usr/ports/science/py-tensorflow
package name: py38-tensorflow-1.15.5_2
building for: FreeBSD 130amd64-quarterly-job-08 13.0-RELEASE-p4 FreeBSD 13.0-RELEASE-p4 amd64
maintained by: amzo1337_at_gmail.com
Makefile ident: 
Poudriere version: 3.2.8-21-g883afb07
Host OSVERSION: 1400008
Jail OSVERSION: 1300139
Job Id: 08

---Begin Environment---
SHELL=/bin/csh
OSVERSION=1300139
UNAME_v=FreeBSD 13.0-RELEASE-p4
UNAME_r=13.0-RELEASE-p4
BLOCKSIZE=K
MAIL=/var/mail/root
MM_CHARSET=UTF-8
LANG=C.UTF-8
STATUS=1
HOME=/root
PATH=/sbin:/bin:/usr/sbin:/usr/bin:/usr/local/sbin:/usr/local/bin:/root/bin
LOCALBASE=/usr/local
USER=root
LIBEXECPREFIX=/usr/local/libexec/poudriere
POUDRIERE_VERSION=3.2.8-21-g883afb07
MASTERMNT=/usr/local/poudriere/data/.m/130amd64-quarterly/ref
POUDRIERE_BUILD_TYPE=bulk
PACKAGE_BUILDING=yes
SAVED_TERM=
PWD=/usr/local/poudriere/data/.m/130amd64-quarterly/ref/.p/pool
P_PORTS_FEATURES=FLAVORS SELECTED_OPTIONS
MASTERNAME=130amd64-quarterly
SCRIPTPREFIX=/usr/local/share/poudriere
OLDPWD=/usr/local/poudriere/data/.m/130amd64-quarterly/ref/.p
SCRIPTPATH=/usr/local/share/poudriere/bulk.sh
POUDRIEREPATH=/usr/local/bin/poudriere
---End Environment---

---Begin Poudriere Port Flags/Env---
PORT_FLAGS=
PKGENV=
FLAVOR=py38
DEPENDS_ARGS=
MAKE_ARGS= FLAVOR=py38
---End Poudriere Port Flags/Env---

---Begin OPTIONS List---
===> The following configuration options are available for py38-tensorflow-1.15.5_2:
     CPU_OPTS=off: Enable optimisations using features available on your CPU
===> Use 'make config' to modify these settings
---End OPTIONS List---

--MAINTAINER--
amzo1337_at_gmail.com
--End MAINTAINER--

--CONFIGURE_ARGS--

--End CONFIGURE_ARGS--

--CONFIGURE_ENV--
PYTHON="/usr/local/bin/python3.8" XDG_DATA_HOME=/wrkdirs/usr/ports/science/py-tensorflow/work-py38  XDG_CONFIG_HOME=/wrkdirs/usr/ports/science/py-tensorflow/work-py38  HOME=/wrkdirs/usr/ports/science/py-tensorflow/work-py38 TMPDIR="/tmp" PATH=/wrkdirs/usr/ports/science/py-tensorflow/work-py38/.bin:/sbin:/bin:/usr/sbin:/usr/bin:/usr/local/sbin:/usr/local/bin:/root/bin SHELL=/bin/sh CONFIG_SHELL=/bin/sh
--End CONFIGURE_ENV--

--MAKE_ENV--
OPENSSLBASE=/usr OPENSSLDIR=/etc/ssl OPENSSLINC=/usr/include OPENSSLLIB=/usr/lib XDG_DATA_HOME=/wrkdirs/usr/ports/science/py-tensorflow/work-py38  XDG_CONFIG_HOME=/wrkdirs/usr/ports/science/py-tensorflow/work-py38  HOME=/wrkdirs/usr/ports/science/py-tensorflow/work-py38 TMPDIR="/tmp" PATH=/wrkdirs/usr/ports/science/py-tensorflow/work-py38/.bin:/sbin:/bin:/usr/sbin:/usr/bin:/usr/local/sbin:/usr/local/bin:/root/bin NO_PIE=yes MK_DEBUG_FILES=no MK_KERNEL_SYMBOLS=no SHELL=/bin/sh NO_LINT=YES LDSHARED="cc -shared" PYTHONDONTWRITEBYTECODE= PYTHONOPTIMIZE= PREFIX=/usr/local  LOCALBASE=/usr/local  CC="cc" CFLAGS="-O2 -pipe  -fstack-protector-strong -fno-strict-aliasing "  CPP="cpp" CPPFLAGS=""  LDFLAGS="  -fstack-protector-strong " LIBS=""  CXX="c++" CXXFLAGS="-O2 -pipe -fstack-protector-strong -fno-strict-aliasing  "  MANPREFIX="/usr/local" BSD_INSTALL_PROGRAM="install  -s -m 555"  BSD_INSTALL_LIB="install  -s -m 0644"  BSD_INSTALL_SCRIPT="install  -m 555"  BSD_INSTALL_DATA="install  -m 064
 4"  BSD_INSTALL_MAN="install  -m 444"
--End MAKE_ENV--

--PLIST_SUB--
TF_PORT_VERSION=1.15.5 PYTHON_INCLUDEDIR=include/python3.8  PYTHON_LIBDIR=lib/python3.8  PYTHON_PLATFORM=freebsd13  PYTHON_SITELIBDIR=lib/python3.8/site-packages  PYTHON_SUFFIX=38  PYTHON_EXT_SUFFIX=.cpython-38  PYTHON_VER=3.8  PYTHON_VERSION=python3.8 PYTHON2="_at_comment " PYTHON3="" OSREL=13.0 PREFIX=%D LOCALBASE=/usr/local  RESETPREFIX=/usr/local LIB32DIR=lib DOCSDIR="share/doc/tensorflow"  EXAMPLESDIR="share/examples/tensorflow"  DATADIR="share/tensorflow"  WWWDIR="www/tensorflow"  ETCDIR="etc/tensorflow"
--End PLIST_SUB--

--SUB_LIST--
PREFIX=/usr/local LOCALBASE=/usr/local  DATADIR=/usr/local/share/tensorflow DOCSDIR=/usr/local/share/doc/tensorflow EXAMPLESDIR=/usr/local/share/examples/tensorflow  WWWDIR=/usr/local/www/tensorflow ETCDIR=/usr/local/etc/tensorflow
--End SUB_LIST--

---Begin make.conf---
USE_PACKAGE_DEPENDS=yes
BATCH=yes
WRKDIRPREFIX=/wrkdirs
PORTSDIR=/usr/ports
PACKAGES=/packages
DISTDIR=/distfiles
PACKAGE_BUILDING=yes
PACKAGE_BUILDING_FLAVORS=yes
#### /usr/local/etc/poudriere.d/make.conf ####
# XXX: We really need this but cannot use it while 'make checksum' does not
# try the next mirror on checksum failure.  It currently retries the same
# failed mirror and then fails rather then trying another.  It *does*
# try the next if the size is mismatched though.
#MASTER_SITE_FREEBSD=yes
# Build ALLOW_MAKE_JOBS_PACKAGES with 2 jobs
MAKE_JOBS_NUMBER=2
#### /usr/ports/Mk/Scripts/ports_env.sh ####
_CCVERSION_921dbbb2=FreeBSD clang version 11.0.1 (git_at_github.com:llvm/llvm-project.git llvmorg-11.0.1-0-g43ff75f2c3fe) Target: x86_64-unknown-freebsd13.0 Thread model: posix InstalledDir: /usr/bin
_ALTCCVERSION_921dbbb2=none
_CXXINTERNAL_acaad9ca=FreeBSD clang version 11.0.1 (git_at_github.com:llvm/llvm-project.git llvmorg-11.0.1-0-g43ff75f2c3fe) Target: x86_64-unknown-freebsd13.0 Thread model: posix InstalledDir: /usr/bin "/usr/bin/ld" "--eh-frame-hdr" "-dynamic-linker" "/libexec/ld-elf.so.1" "--hash-style=both" "--enable-new-dtags" "-o" "a.out" "/usr/lib/crt1.o" "/usr/lib/crti.o" "/usr/lib/crtbegin.o" "-L/usr/lib" "/dev/null" "-lc++" "-lm" "-lgcc" "--as-needed" "-lgcc_s" "--no-as-needed" "-lc" "-lgcc" "--as-needed" "-lgcc_s" "--no-as-needed" "/usr/lib/crtend.o" "/usr/lib/crtn.o"
CC_OUTPUT_921dbbb2_58173849=yes
CC_OUTPUT_921dbbb2_9bdba57c=yes
CC_OUTPUT_921dbbb2_6a4fe7f5=yes
CC_OUTPUT_921dbbb2_6bcac02b=yes
CC_OUTPUT_921dbbb2_67d20829=yes
CC_OUTPUT_921dbbb2_bfa62e83=yes
CC_OUTPUT_921dbbb2_f0b4d593=yes
CC_OUTPUT_921dbbb2_308abb44=yes
CC_OUTPUT_921dbbb2_f00456e5=yes
CC_OUTPUT_921dbbb2_65ad290d=yes
CC_OUTPUT_921dbbb2_f2776b26=yes
CC_OUTPUT_921dbbb2_b2657cc3=yes
CC_OUTPUT_921dbbb2_380987f7=yes
CC_OUTPUT_921dbbb2_160933ec=yes
CC_OUTPUT_921dbbb2_fb62803b=yes
_OBJC_CCVERSION_921dbbb2=FreeBSD clang version 11.0.1 (git_at_github.com:llvm/llvm-project.git llvmorg-11.0.1-0-g43ff75f2c3fe) Target: x86_64-unknown-freebsd13.0 Thread model: posix InstalledDir: /usr/bin
_OBJC_ALTCCVERSION_921dbbb2=none
ARCH=amd64
OPSYS=FreeBSD
_OSRELEASE=13.0-RELEASE-p4
OSREL=13.0
OSVERSION=1300139
PYTHONBASE=/usr/local
HAVE_COMPAT_IA32_KERN=YES
CONFIGURE_MAX_CMD_LEN=524288
HAVE_PORTS_ENV=1
#### Misc Poudriere ####
GID=0
UID=0
DISABLE_MAKE_JOBS=poudriere
---End make.conf---
--Resource limits--
cpu time               (seconds, -t)  unlimited
file size           (512-blocks, -f)  unlimited
data seg size           (kbytes, -d)  33554432
stack size              (kbytes, -s)  524288
core file size      (512-blocks, -c)  unlimited
max memory size         (kbytes, -m)  unlimited
locked memory           (kbytes, -l)  unlimited
max user processes              (-u)  89999
open files                      (-n)  1024
virtual mem size        (kbytes, -v)  unlimited
swap limit              (kbytes, -w)  unlimited
socket buffer size       (bytes, -b)  unlimited
pseudo-terminals                (-p)  unlimited
kqueues                         (-k)  unlimited
umtx shared locks               (-o)  unlimited
--End resource limits--
=======================<phase: check-sanity   >============================
===>  License APACHE20 accepted by the user
===========================================================================
=======================<phase: pkg-depends    >============================
===>   py38-tensorflow-1.15.5_2 depends on file: /usr/local/sbin/pkg - not found
===>   Installing existing package /packages/All/pkg-1.17.2.pkg
[130amd64-quarterly-job-08] Installing pkg-1.17.2...
[130amd64-quarterly-job-08] Extracting pkg-1.17.2: .......... done
===>   py38-tensorflow-1.15.5_2 depends on file: /usr/local/sbin/pkg - found
===>   Returning to build of py38-tensorflow-1.15.5_2
===========================================================================
=======================<phase: fetch-depends  >============================
===========================================================================
=======================<phase: fetch          >============================
===>  License APACHE20 accepted by the user
===> Fetching all distfiles required by py38-tensorflow-1.15.5_2 for building
===========================================================================
=======================<phase: checksum       >============================
===>  License APACHE20 accepted by the user
===> Fetching all distfiles required by py38-tensorflow-1.15.5_2 for building
=> SHA256 Checksum OK for tensorflow/fft2d.tgz.
=> SHA256 Checksum OK for tensorflow/49177915a14a.tar.gz.
=> SHA256 Checksum OK for tensorflow/43ef2148c0936ebf7cb4be6b19927a9d9d145b8f.tar.gz.
=> SHA256 Checksum OK for tensorflow/bazel-skylib.0.8.0.tar.gz.
=> SHA256 Checksum OK for tensorflow/92dd8a7a518a2fb7ba992d47c8b38299fe0be825.tar.gz.
=> SHA256 Checksum OK for tensorflow/308b05b2419edb5c8ee0471b67a40403df940149.tar.gz.
=> SHA256 Checksum OK for tensorflow/0d5f3f2768c6ca2faca0079a997a97ce22997a0c.zip.
=> SHA256 Checksum OK for tensorflow/rules_docker-v0.10.0.tar.gz.
=> SHA256 Checksum OK for tensorflow/rules_swift.0.11.1.tar.gz.
=> SHA256 Checksum OK for tensorflow/816a4ae622e964763ca0862d9dbd19324a1eaf45.tar.gz.
=> SHA256 Checksum OK for tensorflow/12fed0cd7cfcd9e169bf1925bc3a7a58725fdcc3.zip.
=> SHA256 Checksum OK for tensorflow/fd3d9af80465e4383162e4a7c5e2f406e82dd968.tar.gz.
=> SHA256 Checksum OK for tensorflow/36dbc057604f00aacfc0288ddad57e3b21cfc1b8.tar.gz.
=> SHA256 Checksum OK for tensorflow/94d31935a2c94fe7e7c7379a0f3393e181928ff7.tar.gz.
=> SHA256 Checksum OK for tensorflow/v2.3.0.tar.gz.
=> SHA256 Checksum OK for tensorflow/7a7e03f906aada0cf4b749b51213fe5784eeff84.tar.gz.
=> SHA256 Checksum OK for tensorflow/1200fe90bb174a6224a525ee60148671a786a71f.tar.gz.
=> SHA256 Checksum OK for tensorflow/license.rst.txt.
=> SHA256 Checksum OK for tensorflow/backports.weakref-1.0rc1.tar.gz.
=> SHA256 Checksum OK for tensorflow/tensorflow-tensorflow-v1.15.5_GH0.tar.gz.
===========================================================================
=======================<phase: extract-depends>============================
===========================================================================
=======================<phase: extract        >============================
===>  License APACHE20 accepted by the user
===> Fetching all distfiles required by py38-tensorflow-1.15.5_2 for building
===>  Extracting for py38-tensorflow-1.15.5_2
=> SHA256 Checksum OK for tensorflow/fft2d.tgz.
=> SHA256 Checksum OK for tensorflow/49177915a14a.tar.gz.
=> SHA256 Checksum OK for tensorflow/43ef2148c0936ebf7cb4be6b19927a9d9d145b8f.tar.gz.
=> SHA256 Checksum OK for tensorflow/bazel-skylib.0.8.0.tar.gz.
<snip>
    TF_CONFIGURE_IOS=0 \
    TF_SYSTEM_LIBS=absl_py,astor_archive,boringssl,com_github_googleapis_googleapis,com_github_googlecloudplatform_google_cloud_cpp,com_google_protobuf,com_googlesource_code_re2,curl,cython,double_conversion,enum34_archive,flatbuffers,functools32_archive,gast_archive,gif_archive,grpc,hwloc,icu,jpeg,jsoncpp_git,keras_applications_archive,lmdb,nasm,nsync,opt_einsum_archive,org_sqlite,pasta,pcre,png_archive,six_archive,snappy,swig,termcolor_archive,wrapt,zlib_archive \
  /usr/bin/ar rcsD bazel-out/freebsd-py2-opt/bin/tensorflow/lite/python/interpreter_wrapper/libpython_utils.pic.a bazel-out/freebsd-py2-opt/bin/tensorflow/lite/python/interpreter_wrapper/_objs/python_utils/python_utils.pic.o)
SUBCOMMAND: # //tensorflow/python:logging_ops_pygenrule [action 'Executing genrule //tensorflow/python:logging_ops_pygenrule']
(cd /wrkdirs/usr/ports/science/py-tensorflow/work-py38/bazel_out/402a45203959a31b484023dc35f5ca93/execroot/org_tensorflow && \
  exec env - \
    PATH=/bin:/usr/bin/:/usr/local/bin \
    PYTHON_BIN_PATH=/usr/local/bin/python3.8 \
    PYTHON_LIB_PATH=/usr/local/lib/python3.8/site-packages \
    TF2_BEHAVIOR=0 \
    TF_CONFIGURE_IOS=0 \
    TF_SYSTEM_LIBS=absl_py,astor_archive,boringssl,com_github_googleapis_googleapis,com_github_googlecloudplatform_google_cloud_cpp,com_google_protobuf,com_googlesource_code_re2,curl,cython,double_conversion,enum34_archive,flatbuffers,functools32_archive,gast_archive,gif_archive,grpc,hwloc,icu,jpeg,jsoncpp_git,keras_applications_archive,lmdb,nasm,nsync,opt_einsum_archive,org_sqlite,pasta,pcre,png_archive,six_archive,snappy,swig,termcolor_archive,wrapt,zlib_archive \
  /usr/local/bin/bash bazel-out/freebsd-py2-opt/bin/tensorflow/python/logging_ops_pygenrule.genrule_script.sh)
SUBCOMMAND: # //tensorflow/lite/python/interpreter_wrapper:tensorflow_wrap_interpreter_wrapper_py_wrap [action 'SWIGing tensorflow/lite/python/interpreter_wrapper/interpreter_wrapper.i']
(cd /wrkdirs/usr/ports/science/py-tensorflow/work-py38/bazel_out/402a45203959a31b484023dc35f5ca93/execroot/org_tensorflow && \
  exec env - \
  bazel-out/host/bin/external/swig/swig -c++ -python -module tensorflow_wrap_interpreter_wrapper -o bazel-out/freebsd-py2-opt/bin/tensorflow/lite/python/interpreter_wrapper/tensorflow_wrap_interpreter_wrapper.cc -outdir bazel-out/freebsd-py2-opt/bin/tensorflow/lite/python/interpreter_wrapper -Iexternal/eigen_archive -Ibazel-out/freebsd-py2-opt/bin -Ibazel-out/freebsd-py2-opt/bin/external/local_config_python -Iexternal/com_google_absl -Iexternal/gemmlowp -Iexternal/arm_neon_2_x86_sse -Iexternal/farmhash_archive tensorflow/lite/python/interpreter_wrapper/interpreter_wrapper.i)
SUBCOMMAND: # //tensorflow/python:list_ops_pygenrule [action 'Executing genrule //tensorflow/python:list_ops_pygenrule']
(cd /wrkdirs/usr/ports/science/py-tensorflow/work-py38/bazel_out/402a45203959a31b484023dc35f5ca93/execroot/org_tensorflow && \
  exec env - \
    PATH=/bin:/usr/bin/:/usr/local/bin \
    PYTHON_BIN_PATH=/usr/local/bin/python3.8 \
    PYTHON_LIB_PATH=/usr/local/lib/python3.8/site-packages \
    TF2_BEHAVIOR=0 \
    TF_CONFIGURE_IOS=0 \
    TF_SYSTEM_LIBS=absl_py,astor_archive,boringssl,com_github_googleapis_googleapis,com_github_googlecloudplatform_google_cloud_cpp,com_google_protobuf,com_googlesource_code_re2,curl,cython,double_conversion,enum34_archive,flatbuffers,functools32_archive,gast_archive,gif_archive,grpc,hwloc,icu,jpeg,jsoncpp_git,keras_applications_archive,lmdb,nasm,nsync,opt_einsum_archive,org_sqlite,pasta,pcre,png_archive,six_archive,snappy,swig,termcolor_archive,wrapt,zlib_archive \
  /usr/local/bin/bash bazel-out/freebsd-py2-opt/bin/tensorflow/python/list_ops_pygenrule.genrule_script.sh)
SUBCOMMAND: # //tensorflow/python:control_flow_ops_pygenrule [action 'Executing genrule //tensorflow/python:control_flow_ops_pygenrule']
(cd /wrkdirs/usr/ports/science/py-tensorflow/work-py38/bazel_out/402a45203959a31b484023dc35f5ca93/execroot/org_tensorflow && \
  exec env - \
    PATH=/bin:/usr/bin/:/usr/local/bin \
    PYTHON_BIN_PATH=/usr/local/bin/python3.8 \
    PYTHON_LIB_PATH=/usr/local/lib/python3.8/site-packages \
    TF2_BEHAVIOR=0 \
    TF_CONFIGURE_IOS=0 \
    TF_SYSTEM_LIBS=absl_py,astor_archive,boringssl,com_github_googleapis_googleapis,com_github_googlecloudplatform_google_cloud_cpp,com_google_protobuf,com_googlesource_code_re2,curl,cython,double_conversion,enum34_archive,flatbuffers,functools32_archive,gast_archive,gif_archive,grpc,hwloc,icu,jpeg,jsoncpp_git,keras_applications_archive,lmdb,nasm,nsync,opt_einsum_archive,org_sqlite,pasta,pcre,png_archive,six_archive,snappy,swig,termcolor_archive,wrapt,zlib_archive \
  /usr/local/bin/bash bazel-out/freebsd-py2-opt/bin/tensorflow/python/control_flow_ops_pygenrule.genrule_script.sh)
SUBCOMMAND: # //tensorflow/lite/tools/optimize:quantization_utils [action 'Linking tensorflow/lite/tools/optimize/libquantization_utils.pic.a']
(cd /wrkdirs/usr/ports/science/py-tensorflow/work-py38/bazel_out/402a45203959a31b484023dc35f5ca93/execroot/org_tensorflow && \
  exec env - \
    PATH=/bin:/usr/bin/:/usr/local/bin \
    PWD=/proc/self/cwd \
    PYTHON_BIN_PATH=/usr/local/bin/python3.8 \
    PYTHON_LIB_PATH=/usr/local/lib/python3.8/site-packages \
    TF2_BEHAVIOR=0 \
    TF_CONFIGURE_IOS=0 \
    TF_SYSTEM_LIBS=absl_py,astor_archive,boringssl,com_github_googleapis_googleapis,com_github_googlecloudplatform_google_cloud_cpp,com_google_protobuf,com_googlesource_code_re2,curl,cython,double_conversion,enum34_archive,flatbuffers,functools32_archive,gast_archive,gif_archive,grpc,hwloc,icu,jpeg,jsoncpp_git,keras_applications_archive,lmdb,nasm,nsync,opt_einsum_archive,org_sqlite,pasta,pcre,png_archive,six_archive,snappy,swig,termcolor_archive,wrapt,zlib_archive \
  /usr/bin/ar rcsD bazel-out/freebsd-py2-opt/bin/tensorflow/lite/tools/optimize/libquantization_utils.pic.a bazel-out/freebsd-py2-opt/bin/tensorflow/lite/tools/optimize/_objs/quantization_utils/quantization_utils.pic.o)
SUBCOMMAND: # //tensorflow/python:nn_ops_pygenrule [action 'Executing genrule //tensorflow/python:nn_ops_pygenrule']
(cd /wrkdirs/usr/ports/science/py-tensorflow/work-py38/bazel_out/402a45203959a31b484023dc35f5ca93/execroot/org_tensorflow && \
  exec env - \
    PATH=/bin:/usr/bin/:/usr/local/bin \
    PYTHON_BIN_PATH=/usr/local/bin/python3.8 \
    PYTHON_LIB_PATH=/usr/local/lib/python3.8/site-packages \
    TF2_BEHAVIOR=0 \
    TF_CONFIGURE_IOS=0 \
    TF_SYSTEM_LIBS=absl_py,astor_archive,boringssl,com_github_googleapis_googleapis,com_github_googlecloudplatform_google_cloud_cpp,com_google_protobuf,com_googlesource_code_re2,curl,cython,double_conversion,enum34_archive,flatbuffers,functools32_archive,gast_archive,gif_archive,grpc,hwloc,icu,jpeg,jsoncpp_git,keras_applications_archive,lmdb,nasm,nsync,opt_einsum_archive,org_sqlite,pasta,pcre,png_archive,six_archive,snappy,swig,termcolor_archive,wrapt,zlib_archive \
  /usr/local/bin/bash bazel-out/freebsd-py2-opt/bin/tensorflow/python/nn_ops_pygenrule.genrule_script.sh)
SUBCOMMAND: # //tensorflow/python:resource_variable_ops_pygenrule [action 'Executing genrule //tensorflow/python:resource_variable_ops_pygenrule']
(cd /wrkdirs/usr/ports/science/py-tensorflow/work-py38/bazel_out/402a45203959a31b484023dc35f5ca93/execroot/org_tensorflow && \
  exec env - \
    PATH=/bin:/usr/bin/:/usr/local/bin \
    PYTHON_BIN_PATH=/usr/local/bin/python3.8 \
    PYTHON_LIB_PATH=/usr/local/lib/python3.8/site-packages \
    TF2_BEHAVIOR=0 \
    TF_CONFIGURE_IOS=0 \
    TF_SYSTEM_LIBS=absl_py,astor_archive,boringssl,com_github_googleapis_googleapis,com_github_googlecloudplatform_google_cloud_cpp,com_google_protobuf,com_googlesource_code_re2,curl,cython,double_conversion,enum34_archive,flatbuffers,functools32_archive,gast_archive,gif_archive,grpc,hwloc,icu,jpeg,jsoncpp_git,keras_applications_archive,lmdb,nasm,nsync,opt_einsum_archive,org_sqlite,pasta,pcre,png_archive,six_archive,snappy,swig,termcolor_archive,wrapt,zlib_archive \
  /usr/local/bin/bash bazel-out/freebsd-py2-opt/bin/tensorflow/python/resource_variable_ops_pygenrule.genrule_script.sh)
SUBCOMMAND: # //tensorflow/lite/python/interpreter_wrapper:_tensorflow_wrap_interpreter_wrapper.so [action 'Compiling tensorflow/lite/python/interpreter_wrapper/tensorflow_wrap_interpreter_wrapper.cc']
(cd /wrkdirs/usr/ports/science/py-tensorflow/work-py38/bazel_out/402a45203959a31b484023dc35f5ca93/execroot/org_tensorflow && \
  exec env - \
    PATH=/bin:/usr/bin/:/usr/local/bin \
    PWD=/proc/self/cwd \
    PYTHON_BIN_PATH=/usr/local/bin/python3.8 \
    PYTHON_LIB_PATH=/usr/local/lib/python3.8/site-packages \
    TF2_BEHAVIOR=0 \
    TF_CONFIGURE_IOS=0 \
    TF_SYSTEM_LIBS=absl_py,astor_archive,boringssl,com_github_googleapis_googleapis,com_github_googlecloudplatform_google_cloud_cpp,com_google_protobuf,com_googlesource_code_re2,curl,cython,double_conversion,enum34_archive,flatbuffers,functools32_archive,gast_archive,gif_archive,grpc,hwloc,icu,jpeg,jsoncpp_git,keras_applications_archive,lmdb,nasm,nsync,opt_einsum_archive,org_sqlite,pasta,pcre,png_archive,six_archive,snappy,swig,termcolor_archive,wrapt,zlib_archive \
  /usr/bin/clang -U_FORTIFY_SOURCE '-D_FORTIFY_SOURCE=1' -fstack-protector -Wall -fno-omit-frame-pointer -g0 -O2 -DNDEBUG -ffunction-sections -fdata-sections '-std=c++0x' -MD -MF bazel-out/freebsd-py2-opt/bin/tensorflow/lite/python/interpreter_wrapper/_objs/_tensorflow_wrap_interpreter_wrapper.so/tensorflow_wrap_interpreter_wrapper.pic.d '-frandom-seed=bazel-out/freebsd-py2-opt/bin/tensorflow/lite/python/interpreter_wrapper/_objs/_tensorflow_wrap_interpreter_wrapper.so/tensorflow_wrap_interpreter_wrapper.pic.o' -fPIC -DEIGEN_MPL2_ONLY '-DEIGEN_MAX_ALIGN_BYTES=64' '-DEIGEN_HAS_TYPE_TRAITS=0' -D__CLANG_SUPPORT_DYN_ANNOTATION__ -iquote . -iquote bazel-out/freebsd-py2-opt/bin -iquote external/local_config_python -iquote bazel-out/freebsd-py2-opt/bin/external/local_config_python -iquote external/flatbuffers -iquote bazel-out/freebsd-py2-opt/bin/external/flatbuffers -iquote external/gemmlowp -iquote bazel-out/freebsd-py2-opt/bin/external/gemmlowp -iquote external/arm_neon_2_x86_sse -iquote
  bazel-out/freebsd-py2-opt/bin/external/arm_neon_2_x86_sse -iquote external/eigen_archive -iquote bazel-out/freebsd-py2-opt/bin/external/eigen_archive -iquote external/local_config_sycl -iquote bazel-out/freebsd-py2-opt/bin/external/local_config_sycl -iquote external/fft2d -iquote bazel-out/freebsd-py2-opt/bin/external/fft2d -iquote external/farmhash_archive -iquote bazel-out/freebsd-py2-opt/bin/external/farmhash_archive -iquote external/com_google_absl -iquote bazel-out/freebsd-py2-opt/bin/external/com_google_absl -iquote external/bazel_tools -iquote bazel-out/freebsd-py2-opt/bin/external/bazel_tools -isystem external/local_config_python/numpy_include -isystem bazel-out/freebsd-py2-opt/bin/external/local_config_python/numpy_include -isystem external/local_config_python/python_include -isystem bazel-out/freebsd-py2-opt/bin/external/local_config_python/python_include -isystem tensorflow/lite/schema -isystem bazel-out/freebsd-py2-opt/bin/tensorflow/lite/schema -isystem external/eigen_
 archive -isystem bazel-out/freebsd-py2-opt/b!
 in/external/eigen_archive -isystem external/farmhash_archive/src -isystem bazel-out/freebsd-py2-opt/bin/external/farmhash_archive/src -w -I/usr/local/include '-std=c++1z' '-stdlib=libc++' '--std=c++1z' -Wno-self-assign -Wno-sign-compare -Wno-write-strings -no-canonical-prefixes -Wno-builtin-macro-redefined '-D__DATE__="redacted"' '-D__TIMESTAMP__="redacted"' '-D__TIME__="redacted"' -c bazel-out/freebsd-py2-opt/bin/tensorflow/lite/python/interpreter_wrapper/tensorflow_wrap_interpreter_wrapper.cc -o bazel-out/freebsd-py2-opt/bin/tensorflow/lite/python/interpreter_wrapper/_objs/_tensorflow_wrap_interpreter_wrapper.so/tensorflow_wrap_interpreter_wrapper.pic.o)
SUBCOMMAND: # //tensorflow/lite/python/interpreter_wrapper:interpreter_wrapper_lib [action 'Compiling tensorflow/lite/python/interpreter_wrapper/interpreter_wrapper.cc']
(cd /wrkdirs/usr/ports/science/py-tensorflow/work-py38/bazel_out/402a45203959a31b484023dc35f5ca93/execroot/org_tensorflow && \
  exec env - \
    PATH=/bin:/usr/bin/:/usr/local/bin \
    PWD=/proc/self/cwd \
    PYTHON_BIN_PATH=/usr/local/bin/python3.8 \
    PYTHON_LIB_PATH=/usr/local/lib/python3.8/site-packages \
    TF2_BEHAVIOR=0 \
    TF_CONFIGURE_IOS=0 \
    TF_SYSTEM_LIBS=absl_py,astor_archive,boringssl,com_github_googleapis_googleapis,com_github_googlecloudplatform_google_cloud_cpp,com_google_protobuf,com_googlesource_code_re2,curl,cython,double_conversion,enum34_archive,flatbuffers,functools32_archive,gast_archive,gif_archive,grpc,hwloc,icu,jpeg,jsoncpp_git,keras_applications_archive,lmdb,nasm,nsync,opt_einsum_archive,org_sqlite,pasta,pcre,png_archive,six_archive,snappy,swig,termcolor_archive,wrapt,zlib_archive \
  /usr/bin/clang -U_FORTIFY_SOURCE '-D_FORTIFY_SOURCE=1' -fstack-protector -Wall -fno-omit-frame-pointer -g0 -O2 -DNDEBUG -ffunction-sections -fdata-sections '-std=c++0x' -MD -MF bazel-out/freebsd-py2-opt/bin/tensorflow/lite/python/interpreter_wrapper/_objs/interpreter_wrapper_lib/interpreter_wrapper.pic.d '-frandom-seed=bazel-out/freebsd-py2-opt/bin/tensorflow/lite/python/interpreter_wrapper/_objs/interpreter_wrapper_lib/interpreter_wrapper.pic.o' -fPIC -DEIGEN_MPL2_ONLY '-DEIGEN_MAX_ALIGN_BYTES=64' '-DEIGEN_HAS_TYPE_TRAITS=0' -D__CLANG_SUPPORT_DYN_ANNOTATION__ -iquote . -iquote bazel-out/freebsd-py2-opt/bin -iquote external/local_config_python -iquote bazel-out/freebsd-py2-opt/bin/external/local_config_python -iquote external/flatbuffers -iquote bazel-out/freebsd-py2-opt/bin/external/flatbuffers -iquote external/gemmlowp -iquote bazel-out/freebsd-py2-opt/bin/external/gemmlowp -iquote external/arm_neon_2_x86_sse -iquote bazel-out/freebsd-py2-opt/bin/external/arm_neon_2_x86_sse -iquo
 te external/eigen_archive -iquote bazel-out/freebsd-py2-opt/bin/external/eigen_archive -iquote external/local_config_sycl -iquote bazel-out/freebsd-py2-opt/bin/external/local_config_sycl -iquote external/fft2d -iquote bazel-out/freebsd-py2-opt/bin/external/fft2d -iquote external/farmhash_archive -iquote bazel-out/freebsd-py2-opt/bin/external/farmhash_archive -iquote external/com_google_absl -iquote bazel-out/freebsd-py2-opt/bin/external/com_google_absl -isystem external/local_config_python/numpy_include -isystem bazel-out/freebsd-py2-opt/bin/external/local_config_python/numpy_include -isystem external/local_config_python/python_include -isystem bazel-out/freebsd-py2-opt/bin/external/local_config_python/python_include -isystem tensorflow/lite/schema -isystem bazel-out/freebsd-py2-opt/bin/tensorflow/lite/schema -isystem external/eigen_archive -isystem bazel-out/freebsd-py2-opt/bin/external/eigen_archive -isystem external/farmhash_archive/src -isystem bazel-out/freebsd-py2-opt/bin/exte
 rnal/farmhash_archive/src -w -I/usr/local/in!
 clude '-std=c++1z' '-stdlib=libc++' '--std=c++1z' -no-canonical-prefixes -Wno-builtin-macro-redefined '-D__DATE__="redacted"' '-D__TIMESTAMP__="redacted"' '-D__TIME__="redacted"' -c tensorflow/lite/python/interpreter_wrapper/interpreter_wrapper.cc -o bazel-out/freebsd-py2-opt/bin/tensorflow/lite/python/interpreter_wrapper/_objs/interpreter_wrapper_lib/interpreter_wrapper.pic.o)
SUBCOMMAND: # _at_com_google_absl//absl/strings:str_format_internal [action 'Compiling external/com_google_absl/absl/strings/internal/str_format/arg.cc']
(cd /wrkdirs/usr/ports/science/py-tensorflow/work-py38/bazel_out/402a45203959a31b484023dc35f5ca93/execroot/org_tensorflow && \
  exec env - \
    PATH=/bin:/usr/bin/:/usr/local/bin \
    PWD=/proc/self/cwd \
    PYTHON_BIN_PATH=/usr/local/bin/python3.8 \
    PYTHON_LIB_PATH=/usr/local/lib/python3.8/site-packages \
    TF2_BEHAVIOR=0 \
    TF_CONFIGURE_IOS=0 \
    TF_SYSTEM_LIBS=absl_py,astor_archive,boringssl,com_github_googleapis_googleapis,com_github_googlecloudplatform_google_cloud_cpp,com_google_protobuf,com_googlesource_code_re2,curl,cython,double_conversion,enum34_archive,flatbuffers,functools32_archive,gast_archive,gif_archive,grpc,hwloc,icu,jpeg,jsoncpp_git,keras_applications_archive,lmdb,nasm,nsync,opt_einsum_archive,org_sqlite,pasta,pcre,png_archive,six_archive,snappy,swig,termcolor_archive,wrapt,zlib_archive \
  /usr/bin/clang -U_FORTIFY_SOURCE '-D_FORTIFY_SOURCE=1' -fstack-protector -Wall -fno-omit-frame-pointer -g0 -O2 -DNDEBUG -ffunction-sections -fdata-sections '-std=c++0x' -MD -MF bazel-out/freebsd-py2-opt/bin/external/com_google_absl/absl/strings/_objs/str_format_internal/arg.pic.d '-frandom-seed=bazel-out/freebsd-py2-opt/bin/external/com_google_absl/absl/strings/_objs/str_format_internal/arg.pic.o' -fPIC -D__CLANG_SUPPORT_DYN_ANNOTATION__ -iquote external/com_google_absl -iquote bazel-out/freebsd-py2-opt/bin/external/com_google_absl -w -I/usr/local/include '-std=c++1z' '-stdlib=libc++' '--std=c++1z' -Wall -Wextra -Wcast-qual -Wconversion-null -Wmissing-declarations -Woverlength-strings -Wpointer-arith -Wunused-local-typedefs -Wunused-result -Wvarargs -Wvla -Wwrite-strings -Wno-missing-field-initializers -Wno-sign-compare -no-canonical-prefixes -Wno-builtin-macro-redefined '-D__DATE__="redacted"' '-D__TIMESTAMP__="redacted"' '-D__TIME__="redacted"' -c external/com_google_absl/absl/st
 rings/internal/str_format/arg.cc -o bazel-out/freebsd-py2-opt/bin/external/com_google_absl/absl/strings/_objs/str_format_internal/arg.pic.o)
SUBCOMMAND: # _at_com_google_absl//absl/strings:str_format_internal [action 'Compiling external/com_google_absl/absl/strings/internal/str_format/bind.cc']
(cd /wrkdirs/usr/ports/science/py-tensorflow/work-py38/bazel_out/402a45203959a31b484023dc35f5ca93/execroot/org_tensorflow && \
  exec env - \
    PATH=/bin:/usr/bin/:/usr/local/bin \
    PWD=/proc/self/cwd \
    PYTHON_BIN_PATH=/usr/local/bin/python3.8 \
    PYTHON_LIB_PATH=/usr/local/lib/python3.8/site-packages \
    TF2_BEHAVIOR=0 \
    TF_CONFIGURE_IOS=0 \
    TF_SYSTEM_LIBS=absl_py,astor_archive,boringssl,com_github_googleapis_googleapis,com_github_googlecloudplatform_google_cloud_cpp,com_google_protobuf,com_googlesource_code_re2,curl,cython,double_conversion,enum34_archive,flatbuffers,functools32_archive,gast_archive,gif_archive,grpc,hwloc,icu,jpeg,jsoncpp_git,keras_applications_archive,lmdb,nasm,nsync,opt_einsum_archive,org_sqlite,pasta,pcre,png_archive,six_archive,snappy,swig,termcolor_archive,wrapt,zlib_archive \
  /usr/bin/clang -U_FORTIFY_SOURCE '-D_FORTIFY_SOURCE=1' -fstack-protector -Wall -fno-omit-frame-pointer -g0 -O2 -DNDEBUG -ffunction-sections -fdata-sections '-std=c++0x' -MD -MF bazel-out/freebsd-py2-opt/bin/external/com_google_absl/absl/strings/_objs/str_format_internal/bind.pic.d '-frandom-seed=bazel-out/freebsd-py2-opt/bin/external/com_google_absl/absl/strings/_objs/str_format_internal/bind.pic.o' -fPIC -D__CLANG_SUPPORT_DYN_ANNOTATION__ -iquote external/com_google_absl -iquote bazel-out/freebsd-py2-opt/bin/external/com_google_absl -w -I/usr/local/include '-std=c++1z' '-stdlib=libc++' '--std=c++1z' -Wall -Wextra -Wcast-qual -Wconversion-null -Wmissing-declarations -Woverlength-strings -Wpointer-arith -Wunused-local-typedefs -Wunused-result -Wvarargs -Wvla -Wwrite-strings -Wno-missing-field-initializers -Wno-sign-compare -no-canonical-prefixes -Wno-builtin-macro-redefined '-D__DATE__="redacted"' '-D__TIMESTAMP__="redacted"' '-D__TIME__="redacted"' -c external/com_google_absl/absl/
 strings/internal/str_format/bind.cc -o bazel-out/freebsd-py2-opt/bin/external/com_google_absl/absl/strings/_objs/str_format_internal/bind.pic.o)
SUBCOMMAND: # _at_com_google_absl//absl/strings:str_format_internal [action 'Compiling external/com_google_absl/absl/strings/internal/str_format/extension.cc']
(cd /wrkdirs/usr/ports/science/py-tensorflow/work-py38/bazel_out/402a45203959a31b484023dc35f5ca93/execroot/org_tensorflow && \
  exec env - \
    PATH=/bin:/usr/bin/:/usr/local/bin \
    PWD=/proc/self/cwd \
    PYTHON_BIN_PATH=/usr/local/bin/python3.8 \
    PYTHON_LIB_PATH=/usr/local/lib/python3.8/site-packages \
    TF2_BEHAVIOR=0 \
    TF_CONFIGURE_IOS=0 \
    TF_SYSTEM_LIBS=absl_py,astor_archive,boringssl,com_github_googleapis_googleapis,com_github_googlecloudplatform_google_cloud_cpp,com_google_protobuf,com_googlesource_code_re2,curl,cython,double_conversion,enum34_archive,flatbuffers,functools32_archive,gast_archive,gif_archive,grpc,hwloc,icu,jpeg,jsoncpp_git,keras_applications_archive,lmdb,nasm,nsync,opt_einsum_archive,org_sqlite,pasta,pcre,png_archive,six_archive,snappy,swig,termcolor_archive,wrapt,zlib_archive \
  /usr/bin/clang -U_FORTIFY_SOURCE '-D_FORTIFY_SOURCE=1' -fstack-protector -Wall -fno-omit-frame-pointer -g0 -O2 -DNDEBUG -ffunction-sections -fdata-sections '-std=c++0x' -MD -MF bazel-out/freebsd-py2-opt/bin/external/com_google_absl/absl/strings/_objs/str_format_internal/extension.pic.d '-frandom-seed=bazel-out/freebsd-py2-opt/bin/external/com_google_absl/absl/strings/_objs/str_format_internal/extension.pic.o' -fPIC -D__CLANG_SUPPORT_DYN_ANNOTATION__ -iquote external/com_google_absl -iquote bazel-out/freebsd-py2-opt/bin/external/com_google_absl -w -I/usr/local/include '-std=c++1z' '-stdlib=libc++' '--std=c++1z' -Wall -Wextra -Wcast-qual -Wconversion-null -Wmissing-declarations -Woverlength-strings -Wpointer-arith -Wunused-local-typedefs -Wunused-result -Wvarargs -Wvla -Wwrite-strings -Wno-missing-field-initializers -Wno-sign-compare -no-canonical-prefixes -Wno-builtin-macro-redefined '-D__DATE__="redacted"' '-D__TIMESTAMP__="redacted"' '-D__TIME__="redacted"' -c external/com_google_
 absl/absl/strings/internal/str_format/extension.cc -o bazel-out/freebsd-py2-opt/bin/external/com_google_absl/absl/strings/_objs/str_format_internal/extension.pic.o)
SUBCOMMAND: # //tensorflow/lite/tools/optimize/calibration:logging_op_resolver [action 'Linking tensorflow/lite/tools/optimize/calibration/liblogging_op_resolver.pic.a']
(cd /wrkdirs/usr/ports/science/py-tensorflow/work-py38/bazel_out/402a45203959a31b484023dc35f5ca93/execroot/org_tensorflow && \
  exec env - \
    PATH=/bin:/usr/bin/:/usr/local/bin \
    PWD=/proc/self/cwd \
    PYTHON_BIN_PATH=/usr/local/bin/python3.8 \
    PYTHON_LIB_PATH=/usr/local/lib/python3.8/site-packages \
    TF2_BEHAVIOR=0 \
    TF_CONFIGURE_IOS=0 \
    TF_SYSTEM_LIBS=absl_py,astor_archive,boringssl,com_github_googleapis_googleapis,com_github_googlecloudplatform_google_cloud_cpp,com_google_protobuf,com_googlesource_code_re2,curl,cython,double_conversion,enum34_archive,flatbuffers,functools32_archive,gast_archive,gif_archive,grpc,hwloc,icu,jpeg,jsoncpp_git,keras_applications_archive,lmdb,nasm,nsync,opt_einsum_archive,org_sqlite,pasta,pcre,png_archive,six_archive,snappy,swig,termcolor_archive,wrapt,zlib_archive \
  /usr/bin/ar rcsD bazel-out/freebsd-py2-opt/bin/tensorflow/lite/tools/optimize/calibration/liblogging_op_resolver.pic.a bazel-out/freebsd-py2-opt/bin/tensorflow/lite/tools/optimize/calibration/_objs/logging_op_resolver/logging_op_resolver.pic.o)
SUBCOMMAND: # _at_com_google_absl//absl/strings:str_format_internal [action 'Compiling external/com_google_absl/absl/strings/internal/str_format/float_conversion.cc']
(cd /wrkdirs/usr/ports/science/py-tensorflow/work-py38/bazel_out/402a45203959a31b484023dc35f5ca93/execroot/org_tensorflow && \
  exec env - \
    PATH=/bin:/usr/bin/:/usr/local/bin \
    PWD=/proc/self/cwd \
    PYTHON_BIN_PATH=/usr/local/bin/python3.8 \
    PYTHON_LIB_PATH=/usr/local/lib/python3.8/site-packages \
    TF2_BEHAVIOR=0 \
    TF_CONFIGURE_IOS=0 \
    TF_SYSTEM_LIBS=absl_py,astor_archive,boringssl,com_github_googleapis_googleapis,com_github_googlecloudplatform_google_cloud_cpp,com_google_protobuf,com_googlesource_code_re2,curl,cython,double_conversion,enum34_archive,flatbuffers,functools32_archive,gast_archive,gif_archive,grpc,hwloc,icu,jpeg,jsoncpp_git,keras_applications_archive,lmdb,nasm,nsync,opt_einsum_archive,org_sqlite,pasta,pcre,png_archive,six_archive,snappy,swig,termcolor_archive,wrapt,zlib_archive \
  /usr/bin/clang -U_FORTIFY_SOURCE '-D_FORTIFY_SOURCE=1' -fstack-protector -Wall -fno-omit-frame-pointer -g0 -O2 -DNDEBUG -ffunction-sections -fdata-sections '-std=c++0x' -MD -MF bazel-out/freebsd-py2-opt/bin/external/com_google_absl/absl/strings/_objs/str_format_internal/float_conversion.pic.d '-frandom-seed=bazel-out/freebsd-py2-opt/bin/external/com_google_absl/absl/strings/_objs/str_format_internal/float_conversion.pic.o' -fPIC -D__CLANG_SUPPORT_DYN_ANNOTATION__ -iquote external/com_google_absl -iquote bazel-out/freebsd-py2-opt/bin/external/com_google_absl -w -I/usr/local/include '-std=c++1z' '-stdlib=libc++' '--std=c++1z' -Wall -Wextra -Wcast-qual -Wconversion-null -Wmissing-declarations -Woverlength-strings -Wpointer-arith -Wunused-local-typedefs -Wunused-result -Wvarargs -Wvla -Wwrite-strings -Wno-missing-field-initializers -Wno-sign-compare -no-canonical-prefixes -Wno-builtin-macro-redefined '-D__DATE__="redacted"' '-D__TIMESTAMP__="redacted"' '-D__TIME__="redacted"' -c extern
 al/com_google_absl/absl/strings/internal/str_format/float_conversion.cc -o bazel-out/freebsd-py2-opt/bin/external/com_google_absl/absl/strings/_objs/str_format_internal/float_conversion.pic.o)
SUBCOMMAND: # _at_com_google_absl//absl/strings:str_format_internal [action 'Compiling external/com_google_absl/absl/strings/internal/str_format/output.cc']
(cd /wrkdirs/usr/ports/science/py-tensorflow/work-py38/bazel_out/402a45203959a31b484023dc35f5ca93/execroot/org_tensorflow && \
  exec env - \
    PATH=/bin:/usr/bin/:/usr/local/bin \
    PWD=/proc/self/cwd \
    PYTHON_BIN_PATH=/usr/local/bin/python3.8 \
    PYTHON_LIB_PATH=/usr/local/lib/python3.8/site-packages \
    TF2_BEHAVIOR=0 \
    TF_CONFIGURE_IOS=0 \
    TF_SYSTEM_LIBS=absl_py,astor_archive,boringssl,com_github_googleapis_googleapis,com_github_googlecloudplatform_google_cloud_cpp,com_google_protobuf,com_googlesource_code_re2,curl,cython,double_conversion,enum34_archive,flatbuffers,functools32_archive,gast_archive,gif_archive,grpc,hwloc,icu,jpeg,jsoncpp_git,keras_applications_archive,lmdb,nasm,nsync,opt_einsum_archive,org_sqlite,pasta,pcre,png_archive,six_archive,snappy,swig,termcolor_archive,wrapt,zlib_archive \
  /usr/bin/clang -U_FORTIFY_SOURCE '-D_FORTIFY_SOURCE=1' -fstack-protector -Wall -fno-omit-frame-pointer -g0 -O2 -DNDEBUG -ffunction-sections -fdata-sections '-std=c++0x' -MD -MF bazel-out/freebsd-py2-opt/bin/external/com_google_absl/absl/strings/_objs/str_format_internal/output.pic.d '-frandom-seed=bazel-out/freebsd-py2-opt/bin/external/com_google_absl/absl/strings/_objs/str_format_internal/output.pic.o' -fPIC -D__CLANG_SUPPORT_DYN_ANNOTATION__ -iquote external/com_google_absl -iquote bazel-out/freebsd-py2-opt/bin/external/com_google_absl -w -I/usr/local/include '-std=c++1z' '-stdlib=libc++' '--std=c++1z' -Wall -Wextra -Wcast-qual -Wconversion-null -Wmissing-declarations -Woverlength-strings -Wpointer-arith -Wunused-local-typedefs -Wunused-result -Wvarargs -Wvla -Wwrite-strings -Wno-missing-field-initializers -Wno-sign-compare -no-canonical-prefixes -Wno-builtin-macro-redefined '-D__DATE__="redacted"' '-D__TIMESTAMP__="redacted"' '-D__TIME__="redacted"' -c external/com_google_absl/a
 bsl/strings/internal/str_format/output.cc -o bazel-out/freebsd-py2-opt/bin/external/com_google_absl/absl/strings/_objs/str_format_internal/output.pic.o)
SUBCOMMAND: # _at_com_google_absl//absl/strings:str_format_internal [action 'Compiling external/com_google_absl/absl/strings/internal/str_format/parser.cc']
(cd /wrkdirs/usr/ports/science/py-tensorflow/work-py38/bazel_out/402a45203959a31b484023dc35f5ca93/execroot/org_tensorflow && \
  exec env - \
    PATH=/bin:/usr/bin/:/usr/local/bin \
    PWD=/proc/self/cwd \
    PYTHON_BIN_PATH=/usr/local/bin/python3.8 \
    PYTHON_LIB_PATH=/usr/local/lib/python3.8/site-packages \
    TF2_BEHAVIOR=0 \
    TF_CONFIGURE_IOS=0 \
    TF_SYSTEM_LIBS=absl_py,astor_archive,boringssl,com_github_googleapis_googleapis,com_github_googlecloudplatform_google_cloud_cpp,com_google_protobuf,com_googlesource_code_re2,curl,cython,double_conversion,enum34_archive,flatbuffers,functools32_archive,gast_archive,gif_archive,grpc,hwloc,icu,jpeg,jsoncpp_git,keras_applications_archive,lmdb,nasm,nsync,opt_einsum_archive,org_sqlite,pasta,pcre,png_archive,six_archive,snappy,swig,termcolor_archive,wrapt,zlib_archive \
  /usr/bin/clang -U_FORTIFY_SOURCE '-D_FORTIFY_SOURCE=1' -fstack-protector -Wall -fno-omit-frame-pointer -g0 -O2 -DNDEBUG -ffunction-sections -fdata-sections '-std=c++0x' -MD -MF bazel-out/freebsd-py2-opt/bin/external/com_google_absl/absl/strings/_objs/str_format_internal/parser.pic.d '-frandom-seed=bazel-out/freebsd-py2-opt/bin/external/com_google_absl/absl/strings/_objs/str_format_internal/parser.pic.o' -fPIC -D__CLANG_SUPPORT_DYN_ANNOTATION__ -iquote external/com_google_absl -iquote bazel-out/freebsd-py2-opt/bin/external/com_google_absl -w -I/usr/local/include '-std=c++1z' '-stdlib=libc++' '--std=c++1z' -Wall -Wextra -Wcast-qual -Wconversion-null -Wmissing-declarations -Woverlength-strings -Wpointer-arith -Wunused-local-typedefs -Wunused-result -Wvarargs -Wvla -Wwrite-strings -Wno-missing-field-initializers -Wno-sign-compare -no-canonical-prefixes -Wno-builtin-macro-redefined '-D__DATE__="redacted"' '-D__TIMESTAMP__="redacted"' '-D__TIME__="redacted"' -c external/com_google_absl/a
 bsl/strings/internal/str_format/parser.cc -o bazel-out/freebsd-py2-opt/bin/external/com_google_absl/absl/strings/_objs/str_format_internal/parser.pic.o)
ERROR: /wrkdirs/usr/ports/science/py-tensorflow/work-py38/tensorflow-1.15.5/tensorflow/BUILD:607:1: Linking of rule '//tensorflow:libtensorflow.so.1.15.5' failed (Exit 1)
ld: error: undefined symbol: absl::lts_20210324::Mutex::~Mutex()
>>> referenced by debug_service.grpc.pb.cc
>>>               debug_service.grpc.pb.pic.o:(grpc::internal::ClientCallbackReaderWriterImpl<tensorflow::Event, tensorflow::EventReply>::ClientCallbackReaderWriterImpl(grpc::internal::Call, grpc::ClientContext*, grpc::ClientBidiReactor<tensorflow::Event, tensorflow::EventReply>*)) in archive bazel-out/freebsd-opt/bin/tensorflow/core/debug/libdebug_service_proto_cc.pic.a
>>> referenced by debug_service.grpc.pb.cc
>>>               debug_service.grpc.pb.pic.o:(grpc::internal::ClientCallbackReaderWriterImpl<tensorflow::Event, tensorflow::EventReply>::~ClientCallbackReaderWriterImpl()) in archive bazel-out/freebsd-opt/bin/tensorflow/core/debug/libdebug_service_proto_cc.pic.a

ld: error: undefined symbol: absl::lts_20210324::Mutex::Lock()
>>> referenced by debug_service.grpc.pb.cc
>>>               debug_service.grpc.pb.pic.o:(grpc::internal::ClientCallbackReaderWriterImpl<tensorflow::Event, tensorflow::EventReply>::StartCall()) in archive bazel-out/freebsd-opt/bin/tensorflow/core/debug/libdebug_service_proto_cc.pic.a
>>> referenced by debug_service.grpc.pb.cc
>>>               debug_service.grpc.pb.pic.o:(grpc::internal::ClientCallbackReaderWriterImpl<tensorflow::Event, tensorflow::EventReply>::Write(tensorflow::Event const*, grpc::WriteOptions)) in archive bazel-out/freebsd-opt/bin/tensorflow/core/debug/libdebug_service_proto_cc.pic.a
>>> referenced by debug_service.grpc.pb.cc
>>>               debug_service.grpc.pb.pic.o:(grpc::internal::ClientCallbackReaderWriterImpl<tensorflow::Event, tensorflow::EventReply>::WritesDone()) in archive bazel-out/freebsd-opt/bin/tensorflow/core/debug/libdebug_service_proto_cc.pic.a
>>> referenced 1 more times

ld: error: undefined symbol: absl::lts_20210324::Mutex::Unlock()
>>> referenced by debug_service.grpc.pb.cc
>>>               debug_service.grpc.pb.pic.o:(grpc::internal::ClientCallbackReaderWriterImpl<tensorflow::Event, tensorflow::EventReply>::StartCall()) in archive bazel-out/freebsd-opt/bin/tensorflow/core/debug/libdebug_service_proto_cc.pic.a
>>> referenced by debug_service.grpc.pb.cc
>>>               debug_service.grpc.pb.pic.o:(grpc::internal::ClientCallbackReaderWriterImpl<tensorflow::Event, tensorflow::EventReply>::StartCall()) in archive bazel-out/freebsd-opt/bin/tensorflow/core/debug/libdebug_service_proto_cc.pic.a
>>> referenced by debug_service.grpc.pb.cc
>>>               debug_service.grpc.pb.pic.o:(grpc::internal::ClientCallbackReaderWriterImpl<tensorflow::Event, tensorflow::EventReply>::Write(tensorflow::Event const*, grpc::WriteOptions)) in archive bazel-out/freebsd-opt/bin/tensorflow/core/debug/libdebug_service_proto_cc.pic.a
>>> referenced 5 more times
clang: error: linker command failed with exit code 1 (use -v to see invocation)
INFO: Elapsed time: 2931.302s, Critical Path: 239.36s
INFO: 8223 processes: 8223 local.
FAILED: Build did NOT complete successfully
FAILED: Build did NOT complete successfully
*** Error code 1

Stop.
make: stopped in /usr/ports/science/py-tensorflow
Received on Thu Oct 28 2021 - 02:05:57 UTC

Original text of this message