[package - main-amd64-default][lang/rust-bootstrap] Failed for powerpc64-elfv1-rust-bootstrap-1.56.0 in build

From: <pkg-fallout_at_FreeBSD.org>
Date: Tue, 26 Oct 2021 23:19:17 GMT
You are receiving this mail as a port that you maintain
is failing to build on the FreeBSD package build server.
Please investigate the failure and submit a PR to fix
build.

Maintainer:     rust_at_FreeBSD.org
Log URL:        http://beefy18.nyi.freebsd.org/data/main-amd64-default/pebf5105f9a4d_s179219ea04/logs/powerpc64-elfv1-rust-bootstrap-1.56.0.log
Build URL:      http://beefy18.nyi.freebsd.org/build.html?mastername=main-amd64-default&build=pebf5105f9a4d_s179219ea04
Log:

=>> Building lang/rust-bootstrap
build started at Tue Oct 26 19:52:17 UTC 2021
port directory: /usr/ports/lang/rust-bootstrap
package name: powerpc64-elfv1-rust-bootstrap-1.56.0
building for: FreeBSD main-amd64-default-job-07 14.0-CURRENT FreeBSD 14.0-CURRENT 1400039 amd64
maintained by: rust_at_FreeBSD.org
Makefile ident: 
Poudriere version: 3.2.8-21-g883afb07
Host OSVERSION: 1400008
Jail OSVERSION: 1400039
Job Id: 07




!!! Jail is newer than host. (Jail: 1400039, Host: 1400008) !!!
!!! This is not supported. !!!
!!! Host kernel must be same or newer than jail. !!!
!!! Expect build failures. !!!



---Begin Environment---
SHELL=/bin/sh
OSVERSION=1400039
UNAME_v=FreeBSD 14.0-CURRENT 1400039
UNAME_r=14.0-CURRENT
BLOCKSIZE=K
MAIL=/var/mail/root
MM_CHARSET=UTF-8
LANG=C.UTF-8
STATUS=1
HOME=/root
PATH=/sbin:/bin:/usr/sbin:/usr/bin:/usr/local/sbin:/usr/local/bin:/root/bin
LOCALBASE=/usr/local
USER=root
LIBEXECPREFIX=/usr/local/libexec/poudriere
POUDRIERE_VERSION=3.2.8-21-g883afb07
MASTERMNT=/usr/local/poudriere/data/.m/main-amd64-default/ref
POUDRIERE_BUILD_TYPE=bulk
PACKAGE_BUILDING=yes
SAVED_TERM=
PWD=/usr/local/poudriere/data/.m/main-amd64-default/ref/.p/pool
P_PORTS_FEATURES=FLAVORS SELECTED_OPTIONS
MASTERNAME=main-amd64-default
SCRIPTPREFIX=/usr/local/share/poudriere
OLDPWD=/usr/local/poudriere/data/.m/main-amd64-default/ref/.p
SCRIPTPATH=/usr/local/share/poudriere/bulk.sh
POUDRIEREPATH=/usr/local/bin/poudriere
---End Environment---

---Begin Poudriere Port Flags/Env---
PORT_FLAGS=
PKGENV=
FLAVOR=powerpc64_elfv1
DEPENDS_ARGS=
MAKE_ARGS= FLAVOR=powerpc64_elfv1
---End Poudriere Port Flags/Env---

---Begin OPTIONS List---
---End OPTIONS List---

--MAINTAINER--
rust_at_FreeBSD.org
--End MAINTAINER--

--CONFIGURE_ARGS--

--End CONFIGURE_ARGS--

--CONFIGURE_ENV--
ac_cv_path_PERL=/usr/local/bin/perl ac_cv_path_PERL_PATH=/usr/local/bin/perl  PERL_USE_UNSAFE_INC=1 PYTHON="/usr/local/bin/python3.8" XDG_DATA_HOME=/wrkdirs/usr/ports/lang/rust-bootstrap/work-powerpc64_elfv1  XDG_CONFIG_HOME=/wrkdirs/usr/ports/lang/rust-bootstrap/work-powerpc64_elfv1  XDG_CACHE_HOME=/wrkdirs/usr/ports/lang/rust-bootstrap/work-powerpc64_elfv1/.cache  HOME=/wrkdirs/usr/ports/lang/rust-bootstrap/work-powerpc64_elfv1 TMPDIR="/wrkdirs/usr/ports/lang/rust-bootstrap/work-powerpc64_elfv1" PATH=/wrkdirs/usr/ports/lang/rust-bootstrap/work-powerpc64_elfv1/.bin:/sbin:/bin:/usr/sbin:/usr/bin:/usr/local/sbin:/usr/local/bin:/root/bin SHELL=/bin/sh CONFIG_SHELL=/bin/sh
--End CONFIGURE_ENV--

--MAKE_ENV--
NINJA_STATUS="[%p %s/%t] " PERL_USE_UNSAFE_INC=1 XDG_DATA_HOME=/wrkdirs/usr/ports/lang/rust-bootstrap/work-powerpc64_elfv1  XDG_CONFIG_HOME=/wrkdirs/usr/ports/lang/rust-bootstrap/work-powerpc64_elfv1  XDG_CACHE_HOME=/wrkdirs/usr/ports/lang/rust-bootstrap/work-powerpc64_elfv1/.cache  HOME=/wrkdirs/usr/ports/lang/rust-bootstrap/work-powerpc64_elfv1 TMPDIR="/wrkdirs/usr/ports/lang/rust-bootstrap/work-powerpc64_elfv1" PATH=/wrkdirs/usr/ports/lang/rust-bootstrap/work-powerpc64_elfv1/.bin:/sbin:/bin:/usr/sbin:/usr/bin:/usr/local/sbin:/usr/local/bin:/root/bin NO_PIE=yes MK_DEBUG_FILES=no MK_KERNEL_SYMBOLS=no SHELL=/bin/sh NO_LINT=YES ADDR2LINE="/usr/local/bin/addr2line" AR="/usr/local/bin/ar" AS="/usr/local/bin/as" CPPFILT="/usr/local/bin/c++filt" GPROF="/usr/local/bin/gprof" LD="/usr/local/bin/ld" NM="/usr/local/bin/nm" OBJCOPY="/usr/local/bin/objcopy" OBJDUMP="/usr/local/bin/objdump" RANLIB="/usr/local/bin/ranlib" READELF="/usr/local/bin/readelf" SIZE="/usr/local/bin/size" STRINGS="/usr/l
 ocal/bin/strings" PREFIX=/usr/local  LOCALBASE=/usr/local  CC="gcc9" CFLAGS="-O2 -pipe  -fstack-protector-strong -Wl,-rpath=/usr/local/lib/gcc9 -fno-strict-aliasing "  CPP="cpp9" CPPFLAGS=""  LDFLAGS=" -fstack-protector-strong -Wl,-rpath=/usr/local/lib/gcc9 -L/usr/local/lib/gcc9 " LIBS=""  CXX="g++9" CXXFLAGS="-O2 -pipe  -fstack-protector-strong -Wl,-rpath=/usr/local/lib/gcc9  -Wl,-rpath=/usr/local/lib/gcc9 "  MANPREFIX="/usr/local" BSD_INSTALL_PROGRAM="install  -s -m 555"  BSD_INSTALL_LIB="install  -s -m 0644"  BSD_INSTALL_SCRIPT="install  -m 555"  BSD_INSTALL_DATA="install  -m 0644"  BSD_INSTALL_MAN="install  -m 444"
--End MAKE_ENV--

--PLIST_SUB--
PYTHON_INCLUDEDIR=include/python3.8  PYTHON_LIBDIR=lib/python3.8  PYTHON_PLATFORM=freebsd14  PYTHON_SITELIBDIR=lib/python3.8/site-packages  PYTHON_SUFFIX=38  PYTHON_EXT_SUFFIX=.cpython-38  PYTHON_VER=3.8  PYTHON_VERSION=python3.8 PYTHON2="_at_comment " PYTHON3="" OSREL=14.0 PREFIX=%D LOCALBASE=/usr/local  RESETPREFIX=/usr/local LIB32DIR=lib PERL_VERSION=5.32.1  PERL_VER=5.32  PERL5_MAN1=lib/perl5/site_perl/man/man1  PERL5_MAN3=lib/perl5/site_perl/man/man3  SITE_PERL=lib/perl5/site_perl  SITE_ARCH=lib/perl5/site_perl/mach/5.32 DOCSDIR="share/doc/rust"  EXAMPLESDIR="share/examples/rust"  DATADIR="share/rust"  WWWDIR="www/rust"  ETCDIR="etc/rust"
--End PLIST_SUB--

--SUB_LIST--
PREFIX=/usr/local LOCALBASE=/usr/local  DATADIR=/usr/local/share/rust DOCSDIR=/usr/local/share/doc/rust EXAMPLESDIR=/usr/local/share/examples/rust  WWWDIR=/usr/local/www/rust ETCDIR=/usr/local/etc/rust
--End SUB_LIST--

---Begin make.conf---
USE_PACKAGE_DEPENDS=yes
BATCH=yes
WRKDIRPREFIX=/wrkdirs
PORTSDIR=/usr/ports
PACKAGES=/packages
DISTDIR=/distfiles
PACKAGE_BUILDING=yes
PACKAGE_BUILDING_FLAVORS=yes
#### /usr/local/etc/poudriere.d/make.conf ####
# XXX: We really need this but cannot use it while 'make checksum' does not
# try the next mirror on checksum failure.  It currently retries the same
# failed mirror and then fails rather then trying another.  It *does*
# try the next if the size is mismatched though.
#MASTER_SITE_FREEBSD=yes
# Build ALLOW_MAKE_JOBS_PACKAGES with 2 jobs
MAKE_JOBS_NUMBER=2
#### /usr/ports/Mk/Scripts/ports_env.sh ####
_CCVERSION_921dbbb2=FreeBSD clang version 12.0.1 (git_at_github.com:llvm/llvm-project.git llvmorg-12.0.1-0-gfed41342a82f) Target: x86_64-unknown-freebsd14.0 Thread model: posix InstalledDir: /usr/bin
_ALTCCVERSION_921dbbb2=none
_CXXINTERNAL_acaad9ca=FreeBSD clang version 12.0.1 (git_at_github.com:llvm/llvm-project.git llvmorg-12.0.1-0-gfed41342a82f) Target: x86_64-unknown-freebsd14.0 Thread model: posix InstalledDir: /usr/bin "/usr/bin/ld" "--eh-frame-hdr" "-dynamic-linker" "/libexec/ld-elf.so.1" "--hash-style=both" "--enable-new-dtags" "-o" "a.out" "/usr/lib/crt1.o" "/usr/lib/crti.o" "/usr/lib/crtbegin.o" "-L/usr/lib" "/dev/null" "-lc++" "-lm" "-lgcc" "--as-needed" "-lgcc_s" "--no-as-needed" "-lc" "-lgcc" "--as-needed" "-lgcc_s" "--no-as-needed" "/usr/lib/crtend.o" "/usr/lib/crtn.o"
CC_OUTPUT_921dbbb2_58173849=yes
CC_OUTPUT_921dbbb2_9bdba57c=yes
CC_OUTPUT_921dbbb2_6a4fe7f5=yes
CC_OUTPUT_921dbbb2_6bcac02b=yes
CC_OUTPUT_921dbbb2_67d20829=yes
CC_OUTPUT_921dbbb2_bfa62e83=yes
CC_OUTPUT_921dbbb2_f0b4d593=yes
CC_OUTPUT_921dbbb2_308abb44=yes
CC_OUTPUT_921dbbb2_f00456e5=yes
CC_OUTPUT_921dbbb2_65ad290d=yes
CC_OUTPUT_921dbbb2_f2776b26=yes
CC_OUTPUT_921dbbb2_b2657cc3=yes
CC_OUTPUT_921dbbb2_380987f7=yes
CC_OUTPUT_921dbbb2_160933ec=yes
CC_OUTPUT_921dbbb2_fb62803b=yes
_OBJC_CCVERSION_921dbbb2=FreeBSD clang version 12.0.1 (git_at_github.com:llvm/llvm-project.git llvmorg-12.0.1-0-gfed41342a82f) Target: x86_64-unknown-freebsd14.0 Thread model: posix InstalledDir: /usr/bin
_OBJC_ALTCCVERSION_921dbbb2=none
ARCH=amd64
OPSYS=FreeBSD
_OSRELEASE=14.0-CURRENT
OSREL=14.0
OSVERSION=1400039
PYTHONBASE=/usr/local
HAVE_COMPAT_IA32_KERN=YES
CONFIGURE_MAX_CMD_LEN=524288
HAVE_PORTS_ENV=1
#### Misc Poudriere ####
GID=0
UID=0
---End make.conf---
--Resource limits--
cpu time               (seconds, -t)  unlimited
file size           (512-blocks, -f)  unlimited
data seg size           (kbytes, -d)  33554432
stack size              (kbytes, -s)  524288
core file size      (512-blocks, -c)  unlimited
max memory size         (kbytes, -m)  unlimited
locked memory           (kbytes, -l)  unlimited
max user processes              (-u)  89999
open files                      (-n)  1024
virtual mem size        (kbytes, -v)  unlimited
swap limit              (kbytes, -w)  unlimited
socket buffer size       (bytes, -b)  unlimited
pseudo-terminals                (-p)  unlimited
kqueues                         (-k)  unlimited
umtx shared locks               (-o)  unlimited
--End resource limits--
=======================<phase: check-sanity   >============================
===>  License APACHE20 MIT accepted by the user
===========================================================================
=======================<phase: pkg-depends    >============================
===>   powerpc64-elfv1-rust-bootstrap-1.56.0 depends on file: /usr/local/sbin/pkg - not found
===>   Installing existing package /packages/All/pkg-1.17.3.pkg
[main-amd64-default-job-07] Installing pkg-1.17.3...
[main-amd64-default-job-07] Extracting pkg-1.17.3: .......... done
===>   powerpc64-elfv1-rust-bootstrap-1.56.0 depends on file: /usr/local/sbin/pkg - found
===>   Returning to build of powerpc64-elfv1-rust-bootstrap-1.56.0
===========================================================================
=======================<phase: fetch-depends  >============================
===========================================================================
=======================<phase: fetch          >============================
===>  License APACHE20 MIT accepted by the user
===> Fetching all distfiles required by powerpc64-elfv1-rust-bootstrap-1.56.0 for building
===========================================================================
=======================<phase: checksum       >============================
===>  License APACHE20 MIT accepted by the user
===> Fetching all distfiles required by powerpc64-elfv1-rust-bootstrap-1.56.0 for building
=> SHA256 Checksum OK for rust/rustc-1.56.0-src.tar.xz.
===========================================================================
=======================<phase: extract-depends>============================
===========================================================================
=======================<phase: extract        >============================
===>  License APACHE20 MIT accepted by the user
===> Fetching all distfiles required by powerpc64-elfv1-rust-bootstrap-1.56.0 for building
===>  Extracting for powerpc64-elfv1-rust-bootstrap-1.56.0
=> SHA256 Checksum OK for rust/rustc-1.56.0-src.tar.xz.
===========================================================================
=======================<phase: patch-depends  >============================
===========================================================================
=======================<phase: patch          >============================
===>  Patching for powerpc64-elfv1-rust-bootstrap-1.56.0
===>  Applying extra patch patches for powerpc64-elfv1-rust-bootstrap-1.56.0 from /usr/ports/lang/rust-bootstrap/../rust/files/powerpc64-elfv1
===>  Applying FreeBSD patches for powerpc64-elfv1-rust-bootstrap-1.56.0 from /usr/ports/lang/rust-bootstrap/../rust/files
===========================================================================
=======================<phase: build-depends  >============================
===>   powerpc64-elfv1-rust-bootstrap-1.56.0 depends on package: powerpc64-elfv1-freebsd-sysroot>=a2021.09.14 - not found
===>   Installing existing package /packages/All/powerpc64-elfv1-freebsd-sysroot-a2021.09.14.pkg
[main-amd64-default-job-07] Installing powerpc64-elfv1-freebsd-sysroot-a2021.09.14...
[main-amd64-default-job-07] `-- Installing powerpc64-gcc9-9.3.0_1...
[main-amd64-default-job-07] |   `-- Installing gmp-6.2.1...
[main-amd64-default-job-07] |   | `-- Installing indexinfo-0.3.1...
[main-amd64-default-job-07] |   | `-- Extracting indexinfo-0.3.1: .... done
<snip>
[ 28% 611/2145] Building CXX object lib/Bitcode/Reader/CMakeFiles/LLVMBitReader.dir/BitcodeReader.cpp.o
[ 28% 612/2145] Building CXX object lib/Bitcode/Writer/CMakeFiles/LLVMBitWriter.dir/BitcodeWriterPass.cpp.o
[ 28% 613/2145] Building CXX object lib/Bitcode/Writer/CMakeFiles/LLVMBitWriter.dir/ValueEnumerator.cpp.o
[ 28% 614/2145] Building CXX object lib/Bitcode/Writer/CMakeFiles/LLVMBitWriter.dir/BitcodeWriter.cpp.o
[ 28% 615/2145] Building CXX object lib/Bitstream/Reader/CMakeFiles/LLVMBitstreamReader.dir/BitstreamReader.cpp.o
[ 28% 616/2145] Linking CXX static library lib/libLLVMBitstreamReader.a
[ 28% 617/2145] Building CXX object lib/DWARFLinker/CMakeFiles/LLVMDWARFLinker.dir/DWARFLinkerCompileUnit.cpp.o
[ 28% 618/2145] Building CXX object lib/DWARFLinker/CMakeFiles/LLVMDWARFLinker.dir/DWARFLinkerDeclContext.cpp.o
[ 28% 619/2145] Building CXX object lib/DWARFLinker/CMakeFiles/LLVMDWARFLinker.dir/DWARFLinker.cpp.o
[ 28% 620/2145] Building CXX object lib/Extensions/CMakeFiles/LLVMExtensions.dir/Extensions.cpp.o
[ 28% 621/2145] Linking CXX static library lib/libLLVMExtensions.a
[ 28% 622/2145] Building CXX object lib/Frontend/OpenACC/CMakeFiles/LLVMFrontendOpenACC.dir/ACC.cpp.o
[ 28% 623/2145] Linking CXX static library lib/libLLVMFrontendOpenACC.a
[ 29% 624/2145] Building CXX object lib/DWARFLinker/CMakeFiles/LLVMDWARFLinker.dir/DWARFStreamer.cpp.o
[ 29% 625/2145] Building CXX object lib/Frontend/OpenMP/CMakeFiles/LLVMFrontendOpenMP.dir/OMP.cpp.o
[ 29% 626/2145] Building CXX object lib/Frontend/OpenMP/CMakeFiles/LLVMFrontendOpenMP.dir/OMPContext.cpp.o
[ 29% 627/2145] Building CXX object lib/Transforms/Utils/CMakeFiles/LLVMTransformUtils.dir/AddDiscriminators.cpp.o
[ 29% 628/2145] Building CXX object lib/Transforms/Utils/CMakeFiles/LLVMTransformUtils.dir/AMDGPUEmitPrintf.cpp.o
[ 29% 629/2145] Building CXX object lib/Frontend/OpenMP/CMakeFiles/LLVMFrontendOpenMP.dir/OMPIRBuilder.cpp.o
[ 29% 630/2145] Building CXX object lib/Transforms/Utils/CMakeFiles/LLVMTransformUtils.dir/ASanStackFrameLayout.cpp.o
[ 29% 631/2145] Building CXX object lib/Transforms/Utils/CMakeFiles/LLVMTransformUtils.dir/AssumeBundleBuilder.cpp.o
[ 29% 632/2145] Building CXX object lib/Transforms/Utils/CMakeFiles/LLVMTransformUtils.dir/BasicBlockUtils.cpp.o
[ 29% 633/2145] Building CXX object lib/Transforms/Utils/CMakeFiles/LLVMTransformUtils.dir/BuildLibCalls.cpp.o
[ 29% 634/2145] Building CXX object lib/Transforms/Utils/CMakeFiles/LLVMTransformUtils.dir/BreakCriticalEdges.cpp.o
[ 29% 635/2145] Building CXX object lib/Transforms/Utils/CMakeFiles/LLVMTransformUtils.dir/BypassSlowDivision.cpp.o
[ 29% 636/2145] Building CXX object lib/Transforms/Utils/CMakeFiles/LLVMTransformUtils.dir/CallPromotionUtils.cpp.o
[ 29% 637/2145] Building CXX object lib/Transforms/Utils/CMakeFiles/LLVMTransformUtils.dir/CallGraphUpdater.cpp.o
[ 29% 638/2145] Building CXX object lib/Transforms/Utils/CMakeFiles/LLVMTransformUtils.dir/CanonicalizeAliases.cpp.o
[ 29% 639/2145] Building CXX object lib/Transforms/Utils/CMakeFiles/LLVMTransformUtils.dir/CanonicalizeFreezeInLoops.cpp.o
[ 29% 640/2145] Building CXX object lib/Transforms/Utils/CMakeFiles/LLVMTransformUtils.dir/CloneModule.cpp.o
[ 29% 641/2145] Building CXX object lib/Transforms/Utils/CMakeFiles/LLVMTransformUtils.dir/CloneFunction.cpp.o
[ 29% 642/2145] Building CXX object lib/Transforms/Utils/CMakeFiles/LLVMTransformUtils.dir/CodeMoverUtils.cpp.o
[ 29% 643/2145] Building CXX object lib/Transforms/Utils/CMakeFiles/LLVMTransformUtils.dir/CtorUtils.cpp.o
[ 29% 644/2145] Building CXX object lib/Transforms/Utils/CMakeFiles/LLVMTransformUtils.dir/CodeExtractor.cpp.o
[ 30% 645/2145] Building CXX object lib/Transforms/Utils/CMakeFiles/LLVMTransformUtils.dir/DemoteRegToStack.cpp.o
[ 30% 646/2145] Building CXX object lib/Transforms/Utils/CMakeFiles/LLVMTransformUtils.dir/EntryExitInstrumenter.cpp.o
[ 30% 647/2145] Building CXX object lib/Transforms/Utils/CMakeFiles/LLVMTransformUtils.dir/Debugify.cpp.o
[ 30% 648/2145] Building CXX object lib/Transforms/Utils/CMakeFiles/LLVMTransformUtils.dir/EscapeEnumerator.cpp.o
[ 30% 649/2145] Building CXX object lib/Transforms/Utils/CMakeFiles/LLVMTransformUtils.dir/Evaluator.cpp.o
[ 30% 650/2145] Building CXX object lib/Transforms/Utils/CMakeFiles/LLVMTransformUtils.dir/FlattenCFG.cpp.o
[ 30% 651/2145] Building CXX object lib/Transforms/Utils/CMakeFiles/LLVMTransformUtils.dir/FixIrreducible.cpp.o
[ 30% 652/2145] Building CXX object lib/Transforms/Utils/CMakeFiles/LLVMTransformUtils.dir/FunctionComparator.cpp.o
[ 30% 653/2145] Building CXX object lib/Transforms/Utils/CMakeFiles/LLVMTransformUtils.dir/FunctionImportUtils.cpp.o
[ 30% 654/2145] Building CXX object lib/Transforms/Utils/CMakeFiles/LLVMTransformUtils.dir/GlobalStatus.cpp.o
[ 30% 655/2145] Building CXX object lib/Transforms/Utils/CMakeFiles/LLVMTransformUtils.dir/HelloWorld.cpp.o
[ 30% 656/2145] Building CXX object lib/Transforms/Utils/CMakeFiles/LLVMTransformUtils.dir/GuardUtils.cpp.o
[ 30% 657/2145] Building CXX object lib/Transforms/Utils/CMakeFiles/LLVMTransformUtils.dir/InjectTLIMappings.cpp.o
[ 30% 658/2145] Building CXX object lib/Transforms/Utils/CMakeFiles/LLVMTransformUtils.dir/InstructionNamer.cpp.o
[ 30% 659/2145] Building CXX object lib/Transforms/Utils/CMakeFiles/LLVMTransformUtils.dir/IntegerDivision.cpp.o
[ 30% 660/2145] Building CXX object lib/Transforms/Utils/CMakeFiles/LLVMTransformUtils.dir/InlineFunction.cpp.o
[ 30% 661/2145] Building CXX object lib/Transforms/Utils/CMakeFiles/LLVMTransformUtils.dir/LibCallsShrinkWrap.cpp.o
[ 30% 662/2145] Building CXX object lib/Transforms/Utils/CMakeFiles/LLVMTransformUtils.dir/LCSSA.cpp.o
[ 30% 663/2145] Building CXX object lib/Transforms/Utils/CMakeFiles/LLVMTransformUtils.dir/LoopPeel.cpp.o
[ 30% 664/2145] Building CXX object lib/Transforms/Utils/CMakeFiles/LLVMTransformUtils.dir/Local.cpp.o
[ 30% 665/2145] Building CXX object lib/Transforms/Utils/CMakeFiles/LLVMTransformUtils.dir/LoopRotationUtils.cpp.o
[ 31% 666/2145] Building CXX object lib/Transforms/Utils/CMakeFiles/LLVMTransformUtils.dir/LoopSimplify.cpp.o
[ 31% 667/2145] Building CXX object lib/Transforms/Utils/CMakeFiles/LLVMTransformUtils.dir/LoopUnroll.cpp.o
[ 31% 668/2145] Building CXX object lib/Transforms/Utils/CMakeFiles/LLVMTransformUtils.dir/LoopUnrollAndJam.cpp.o
[ 31% 669/2145] Building CXX object lib/Transforms/Utils/CMakeFiles/LLVMTransformUtils.dir/LoopUnrollRuntime.cpp.o
[ 31% 670/2145] Building CXX object lib/Transforms/Utils/CMakeFiles/LLVMTransformUtils.dir/LoopUtils.cpp.o
[ 31% 671/2145] Building CXX object lib/Transforms/Utils/CMakeFiles/LLVMTransformUtils.dir/LowerInvoke.cpp.o
[ 31% 672/2145] Building CXX object lib/Transforms/Utils/CMakeFiles/LLVMTransformUtils.dir/LoopVersioning.cpp.o
[ 31% 673/2145] Building CXX object lib/Transforms/Utils/CMakeFiles/LLVMTransformUtils.dir/LowerMemIntrinsics.cpp.o
[ 31% 674/2145] Building CXX object lib/Transforms/Utils/CMakeFiles/LLVMTransformUtils.dir/LowerSwitch.cpp.o
[ 31% 675/2145] Building CXX object lib/Transforms/Utils/CMakeFiles/LLVMTransformUtils.dir/MatrixUtils.cpp.o
[ 31% 676/2145] Building CXX object lib/Transforms/Utils/CMakeFiles/LLVMTransformUtils.dir/MemoryOpRemark.cpp.o
[ 31% 677/2145] Building CXX object lib/Transforms/Utils/CMakeFiles/LLVMTransformUtils.dir/Mem2Reg.cpp.o
[ 31% 678/2145] Building CXX object lib/Transforms/Utils/CMakeFiles/LLVMTransformUtils.dir/MetaRenamer.cpp.o
[ 31% 679/2145] Building CXX object lib/Transforms/Utils/CMakeFiles/LLVMTransformUtils.dir/NameAnonGlobals.cpp.o
[ 31% 680/2145] Building CXX object lib/Transforms/Utils/CMakeFiles/LLVMTransformUtils.dir/ModuleUtils.cpp.o
[ 31% 681/2145] Building CXX object lib/Transforms/Utils/CMakeFiles/LLVMTransformUtils.dir/PredicateInfo.cpp.o
[ 31% 682/2145] Building CXX object lib/Transforms/Utils/CMakeFiles/LLVMTransformUtils.dir/PromoteMemoryToRegister.cpp.o
[ 31% 683/2145] Building CXX object lib/Transforms/Utils/CMakeFiles/LLVMTransformUtils.dir/RelLookupTableConverter.cpp.o
[ 31% 684/2145] Building CXX object lib/Transforms/Utils/CMakeFiles/LLVMTransformUtils.dir/SCCPSolver.cpp.o
[ 31% 685/2145] Building CXX object lib/Transforms/Utils/CMakeFiles/LLVMTransformUtils.dir/ScalarEvolutionExpander.cpp.o
[ 31% 686/2145] Building CXX object lib/Transforms/Utils/CMakeFiles/LLVMTransformUtils.dir/StripGCRelocates.cpp.o
[ 31% 687/2145] Building CXX object lib/Transforms/Utils/CMakeFiles/LLVMTransformUtils.dir/SSAUpdater.cpp.o
[ 32% 688/2145] Building CXX object lib/Transforms/Utils/CMakeFiles/LLVMTransformUtils.dir/SampleProfileLoaderBaseUtil.cpp.o
[ 32% 689/2145] Building CXX object lib/Transforms/Utils/CMakeFiles/LLVMTransformUtils.dir/SSAUpdaterBulk.cpp.o
[ 32% 690/2145] Building CXX object lib/Transforms/Utils/CMakeFiles/LLVMTransformUtils.dir/SanitizerStats.cpp.o
[ 32% 691/2145] Building CXX object lib/Transforms/Utils/CMakeFiles/LLVMTransformUtils.dir/SimplifyIndVar.cpp.o
[ 32% 692/2145] Building CXX object lib/Transforms/Utils/CMakeFiles/LLVMTransformUtils.dir/SimplifyLibCalls.cpp.o
[ 32% 693/2145] Building CXX object lib/Transforms/Utils/CMakeFiles/LLVMTransformUtils.dir/SimplifyCFG.cpp.o
[ 32% 694/2145] Building CXX object lib/Transforms/Utils/CMakeFiles/LLVMTransformUtils.dir/SizeOpts.cpp.o
[ 32% 695/2145] Building CXX object lib/Transforms/Utils/CMakeFiles/LLVMTransformUtils.dir/StripNonLineTableDebugInfo.cpp.o
[ 32% 696/2145] Building CXX object lib/Transforms/Utils/CMakeFiles/LLVMTransformUtils.dir/SplitModule.cpp.o
[ 32% 697/2145] Building CXX object lib/Transforms/Utils/CMakeFiles/LLVMTransformUtils.dir/UnifyFunctionExitNodes.cpp.o
[ 32% 698/2145] Building CXX object lib/Transforms/Utils/CMakeFiles/LLVMTransformUtils.dir/SymbolRewriter.cpp.o
[ 32% 699/2145] Building CXX object lib/Transforms/Utils/CMakeFiles/LLVMTransformUtils.dir/UnifyLoopExits.cpp.o
[ 32% 700/2145] Building CXX object lib/Transforms/Utils/CMakeFiles/LLVMTransformUtils.dir/Utils.cpp.o
[ 32% 701/2145] Building CXX object lib/Transforms/Utils/CMakeFiles/LLVMTransformUtils.dir/VNCoercion.cpp.o
[ 32% 702/2145] Building CXX object lib/Transforms/Utils/CMakeFiles/LLVMTransformUtils.dir/ValueMapper.cpp.o
[ 32% 703/2145] Building CXX object lib/Transforms/Instrumentation/CMakeFiles/LLVMInstrumentation.dir/BoundsChecking.cpp.o
[ 32% 704/2145] Building CXX object lib/Transforms/Instrumentation/CMakeFiles/LLVMInstrumentation.dir/CGProfile.cpp.o
[ 32% 705/2145] Building CXX object lib/Transforms/Instrumentation/CMakeFiles/LLVMInstrumentation.dir/AddressSanitizer.cpp.o
[ 32% 706/2145] Building CXX object lib/Transforms/Instrumentation/CMakeFiles/LLVMInstrumentation.dir/ControlHeightReduction.cpp.o
[ 32% 707/2145] Building CXX object lib/Transforms/Instrumentation/CMakeFiles/LLVMInstrumentation.dir/DataFlowSanitizer.cpp.o
[ 32% 708/2145] Building CXX object lib/Transforms/Instrumentation/CMakeFiles/LLVMInstrumentation.dir/GCOVProfiling.cpp.o
[ 33% 709/2145] Building CXX object lib/Transforms/Instrumentation/CMakeFiles/LLVMInstrumentation.dir/MemProfiler.cpp.o
[ 33% 710/2145] Building CXX object lib/Transforms/Instrumentation/CMakeFiles/LLVMInstrumentation.dir/IndirectCallPromotion.cpp.o
[ 33% 711/2145] Building CXX object lib/Transforms/Instrumentation/CMakeFiles/LLVMInstrumentation.dir/Instrumentation.cpp.o
[ 33% 712/2145] Building CXX object lib/Transforms/Instrumentation/CMakeFiles/LLVMInstrumentation.dir/MemorySanitizer.cpp.o
[ 33% 713/2145] Building CXX object lib/Transforms/Instrumentation/CMakeFiles/LLVMInstrumentation.dir/InstrOrderFile.cpp.o
[ 33% 714/2145] Building CXX object lib/Transforms/Instrumentation/CMakeFiles/LLVMInstrumentation.dir/InstrProfiling.cpp.o
[ 33% 715/2145] Building CXX object lib/Transforms/Instrumentation/CMakeFiles/LLVMInstrumentation.dir/PGOInstrumentation.cpp.o
[ 33% 716/2145] Building CXX object lib/Transforms/Instrumentation/CMakeFiles/LLVMInstrumentation.dir/PGOMemOPSizeOpt.cpp.o
[ 33% 717/2145] Building CXX object lib/Transforms/Instrumentation/CMakeFiles/LLVMInstrumentation.dir/PoisonChecking.cpp.o
[ 33% 718/2145] Building CXX object lib/Transforms/Instrumentation/CMakeFiles/LLVMInstrumentation.dir/SanitizerCoverage.cpp.o
[ 33% 719/2145] Building CXX object lib/Transforms/Instrumentation/CMakeFiles/LLVMInstrumentation.dir/ValueProfileCollector.cpp.o
[ 33% 720/2145] Building CXX object lib/Transforms/Instrumentation/CMakeFiles/LLVMInstrumentation.dir/ThreadSanitizer.cpp.o
[ 33% 721/2145] Building CXX object lib/Transforms/Instrumentation/CMakeFiles/LLVMInstrumentation.dir/HWAddressSanitizer.cpp.o
[ 33% 722/2145] Building CXX object lib/Transforms/AggressiveInstCombine/CMakeFiles/LLVMAggressiveInstCombine.dir/AggressiveInstCombine.cpp.o
[ 33% 723/2145] Building CXX object lib/Transforms/AggressiveInstCombine/CMakeFiles/LLVMAggressiveInstCombine.dir/TruncInstCombine.cpp.o
[ 33% 724/2145] Building CXX object lib/Transforms/InstCombine/CMakeFiles/LLVMInstCombine.dir/InstCombineAddSub.cpp.o
[ 33% 725/2145] Building CXX object lib/Transforms/InstCombine/CMakeFiles/LLVMInstCombine.dir/InstructionCombining.cpp.o
[ 33% 726/2145] Building CXX object lib/Transforms/InstCombine/CMakeFiles/LLVMInstCombine.dir/InstCombineAtomicRMW.cpp.o
[ 33% 727/2145] Building CXX object lib/Transforms/InstCombine/CMakeFiles/LLVMInstCombine.dir/InstCombineAndOrXor.cpp.o
[ 33% 728/2145] Building CXX object lib/Transforms/InstCombine/CMakeFiles/LLVMInstCombine.dir/InstCombineCalls.cpp.o
[ 33% 729/2145] Building CXX object lib/Transforms/InstCombine/CMakeFiles/LLVMInstCombine.dir/InstCombineCasts.cpp.o
[ 33% 730/2145] Building CXX object lib/Transforms/InstCombine/CMakeFiles/LLVMInstCombine.dir/InstCombineLoadStoreAlloca.cpp.o
[ 34% 731/2145] Building CXX object lib/Transforms/InstCombine/CMakeFiles/LLVMInstCombine.dir/InstCombineCompares.cpp.o
[ 34% 732/2145] Building CXX object lib/Transforms/InstCombine/CMakeFiles/LLVMInstCombine.dir/InstCombineMulDivRem.cpp.o
[ 34% 733/2145] Building CXX object lib/Transforms/InstCombine/CMakeFiles/LLVMInstCombine.dir/InstCombineNegator.cpp.o
[ 34% 734/2145] Building CXX object lib/Transforms/InstCombine/CMakeFiles/LLVMInstCombine.dir/InstCombinePHI.cpp.o
[ 34% 735/2145] Building CXX object lib/Transforms/InstCombine/CMakeFiles/LLVMInstCombine.dir/InstCombineSelect.cpp.o
[ 34% 736/2145] Building CXX object lib/Transforms/InstCombine/CMakeFiles/LLVMInstCombine.dir/InstCombineShifts.cpp.o
[ 34% 737/2145] Building CXX object lib/Transforms/InstCombine/CMakeFiles/LLVMInstCombine.dir/InstCombineSimplifyDemanded.cpp.o
[ 34% 738/2145] Building CXX object lib/Transforms/InstCombine/CMakeFiles/LLVMInstCombine.dir/InstCombineVectorOps.cpp.o
[ 34% 739/2145] Building CXX object lib/Transforms/Scalar/CMakeFiles/LLVMScalarOpts.dir/AlignmentFromAssumptions.cpp.o
[ 34% 740/2145] Building CXX object lib/Transforms/Scalar/CMakeFiles/LLVMScalarOpts.dir/ADCE.cpp.o
[ 34% 741/2145] Building CXX object lib/Transforms/Scalar/CMakeFiles/LLVMScalarOpts.dir/AnnotationRemarks.cpp.o
[ 34% 742/2145] Building CXX object lib/Transforms/Scalar/CMakeFiles/LLVMScalarOpts.dir/BDCE.cpp.o
[ 34% 743/2145] Building CXX object lib/Transforms/Scalar/CMakeFiles/LLVMScalarOpts.dir/CallSiteSplitting.cpp.o
[ 34% 744/2145] Building CXX object lib/Transforms/Scalar/CMakeFiles/LLVMScalarOpts.dir/ConstantHoisting.cpp.o
[ 34% 745/2145] Building CXX object lib/Transforms/Scalar/CMakeFiles/LLVMScalarOpts.dir/ConstraintElimination.cpp.o
[ 34% 746/2145] Building CXX object lib/Transforms/Scalar/CMakeFiles/LLVMScalarOpts.dir/DCE.cpp.o
[ 34% 747/2145] Building CXX object lib/Transforms/Scalar/CMakeFiles/LLVMScalarOpts.dir/CorrelatedValuePropagation.cpp.o
[ 34% 748/2145] Building CXX object lib/Transforms/Scalar/CMakeFiles/LLVMScalarOpts.dir/DeadStoreElimination.cpp.o
[ 34% 749/2145] Building CXX object lib/Transforms/Scalar/CMakeFiles/LLVMScalarOpts.dir/DFAJumpThreading.cpp.o
[ 34% 750/2145] Building CXX object lib/Transforms/Scalar/CMakeFiles/LLVMScalarOpts.dir/DivRemPairs.cpp.o
[ 34% 751/2145] Building CXX object lib/Transforms/Scalar/CMakeFiles/LLVMScalarOpts.dir/EarlyCSE.cpp.o
[ 35% 752/2145] Building CXX object lib/Transforms/Scalar/CMakeFiles/LLVMScalarOpts.dir/FlattenCFGPass.cpp.o
[ 35% 753/2145] Building CXX object lib/Transforms/Scalar/CMakeFiles/LLVMScalarOpts.dir/GuardWidening.cpp.o
[ 35% 754/2145] Building CXX object lib/Transforms/Scalar/CMakeFiles/LLVMScalarOpts.dir/Float2Int.cpp.o
[ 35% 755/2145] Building CXX object lib/Transforms/Scalar/CMakeFiles/LLVMScalarOpts.dir/GVNHoist.cpp.o
[ 35% 756/2145] Building CXX object lib/Transforms/Scalar/CMakeFiles/LLVMScalarOpts.dir/GVN.cpp.o
[ 35% 757/2145] Building CXX object lib/Transforms/Scalar/CMakeFiles/LLVMScalarOpts.dir/IVUsersPrinter.cpp.o
[ 35% 758/2145] Building CXX object lib/Transforms/Scalar/CMakeFiles/LLVMScalarOpts.dir/GVNSink.cpp.o
[ 35% 759/2145] Building CXX object lib/Transforms/Scalar/CMakeFiles/LLVMScalarOpts.dir/InductiveRangeCheckElimination.cpp.o
[ 35% 760/2145] Building CXX object lib/Transforms/Scalar/CMakeFiles/LLVMScalarOpts.dir/IndVarSimplify.cpp.o
[ 35% 761/2145] Building CXX object lib/Transforms/Scalar/CMakeFiles/LLVMScalarOpts.dir/InferAddressSpaces.cpp.o
[ 35% 762/2145] Building CXX object lib/Transforms/Scalar/CMakeFiles/LLVMScalarOpts.dir/InstSimplifyPass.cpp.o
[ 35% 763/2145] Building CXX object lib/Transforms/Scalar/CMakeFiles/LLVMScalarOpts.dir/JumpThreading.cpp.o
[ 35% 764/2145] Building CXX object lib/Transforms/Scalar/CMakeFiles/LLVMScalarOpts.dir/LoopAccessAnalysisPrinter.cpp.o
[ 35% 765/2145] Building CXX object lib/Transforms/Scalar/CMakeFiles/LLVMScalarOpts.dir/LICM.cpp.o
[ 35% 766/2145] Building CXX object lib/Transforms/Scalar/CMakeFiles/LLVMScalarOpts.dir/LoopSink.cpp.o
[ 35% 767/2145] Building CXX object lib/Transforms/Scalar/CMakeFiles/LLVMScalarOpts.dir/LoopBoundSplit.cpp.o
[ 35% 768/2145] Building CXX object lib/Transforms/Scalar/CMakeFiles/LLVMScalarOpts.dir/LoopDeletion.cpp.o
[ 35% 769/2145] Building CXX object lib/Transforms/Scalar/CMakeFiles/LLVMScalarOpts.dir/LoopDataPrefetch.cpp.o
[ 35% 770/2145] Building CXX object lib/Transforms/Scalar/CMakeFiles/LLVMScalarOpts.dir/LoopDistribute.cpp.o
[ 35% 771/2145] Building CXX object lib/Transforms/Scalar/CMakeFiles/LLVMScalarOpts.dir/LoopFuse.cpp.o
[ 35% 772/2145] Building CXX object lib/Transforms/Scalar/CMakeFiles/LLVMScalarOpts.dir/LoopInstSimplify.cpp.o
[ 35% 773/2145] Building CXX object lib/Transforms/Scalar/CMakeFiles/LLVMScalarOpts.dir/LoopIdiomRecognize.cpp.o
[ 36% 774/2145] Building CXX object lib/Transforms/Scalar/CMakeFiles/LLVMScalarOpts.dir/LoopFlatten.cpp.o
[ 36% 775/2145] Building CXX object lib/Transforms/Scalar/CMakeFiles/LLVMScalarOpts.dir/LoopInterchange.cpp.o
[ 36% 776/2145] Building CXX object lib/Transforms/Scalar/CMakeFiles/LLVMScalarOpts.dir/LoopPassManager.cpp.o
[ 36% 777/2145] Building CXX object lib/Transforms/Scalar/CMakeFiles/LLVMScalarOpts.dir/LoopLoadElimination.cpp.o
[ 36% 778/2145] Building CXX object lib/Transforms/Scalar/CMakeFiles/LLVMScalarOpts.dir/LoopPredication.cpp.o
[ 36% 779/2145] Building CXX object lib/Transforms/Scalar/CMakeFiles/LLVMScalarOpts.dir/LoopRotation.cpp.o
[ 36% 780/2145] Building CXX object lib/Transforms/Scalar/CMakeFiles/LLVMScalarOpts.dir/LoopRerollPass.cpp.o
[ 36% 781/2145] Building CXX object lib/Transforms/Scalar/CMakeFiles/LLVMScalarOpts.dir/LoopSimplifyCFG.cpp.o
[ 36% 782/2145] Building CXX object lib/Transforms/Scalar/CMakeFiles/LLVMScalarOpts.dir/LoopUnrollPass.cpp.o
FAILED: lib/Transforms/Scalar/CMakeFiles/LLVMScalarOpts.dir/LoopUnrollPass.cpp.o 
/usr/local/freebsd-sysroot/powerpc64-elfv1/bin/c++ -DGTEST_HAS_RTTI=0 -D__STDC_CONSTANT_MACROS -D__STDC_FORMAT_MACROS -D__STDC_LIMIT_MACROS -I/wrkdirs/usr/ports/lang/rust-bootstrap/work-powerpc64_elfv1/rustc-1.56.0-src/build/powerpc64-unknown-freebsd/llvm/build/lib/Transforms/Scalar -I/wrkdirs/usr/ports/lang/rust-bootstrap/work-powerpc64_elfv1/rustc-1.56.0-src/src/llvm-project/llvm/lib/Transforms/Scalar -I/wrkdirs/usr/ports/lang/rust-bootstrap/work-powerpc64_elfv1/rustc-1.56.0-src/build/powerpc64-unknown-freebsd/llvm/build/include -I/wrkdirs/usr/ports/lang/rust-bootstrap/work-powerpc64_elfv1/rustc-1.56.0-src/src/llvm-project/llvm/include -ffunction-sections -fdata-sections -fPIC -m64 -pipe -fstack-protector-strong -Wl,-rpath=/usr/local/lib/gcc9 -fno-strict-aliasing -static-libstdc++ -fPIC -fno-semantic-interposition -fvisibility-inlines-hidden -Werror=date-time -Wall -Wextra -Wno-unused-parameter -Wwrite-strings -Wcast-qual -Wno-missing-field-initializers -pedantic -Wno-long-long -Wi
 mplicit-fallthrough -Wno-maybe-uninitialized -Wno-class-memaccess -Wno-redundant-move -Wno-pessimizing-move -Wno-noexcept-type -Wdelete-non-virtual-dtor -Wsuggest-override -Wno-comment -Wmisleading-indentation -fdiagnostics-color -ffunction-sections -fdata-sections -O3 -DNDEBUG  -fno-exceptions -fno-rtti -std=c++14 -MD -MT lib/Transforms/Scalar/CMakeFiles/LLVMScalarOpts.dir/LoopUnrollPass.cpp.o -MF lib/Transforms/Scalar/CMakeFiles/LLVMScalarOpts.dir/LoopUnrollPass.cpp.o.d -o lib/Transforms/Scalar/CMakeFiles/LLVMScalarOpts.dir/LoopUnrollPass.cpp.o -c /wrkdirs/usr/ports/lang/rust-bootstrap/work-powerpc64_elfv1/rustc-1.56.0-src/src/llvm-project/llvm/lib/Transforms/Scalar/LoopUnrollPass.cpp
{standard input}: Assembler messages:
{standard input}:1400: Warning: end of file in string; '"' inserted
powerpc64-unknown-freebsd14.0-g++9: fatal error: Killed signal terminated program cc1plus
compilation terminated.
[ 36% 782/2145] Building CXX object lib/Transforms/Scalar/CMakeFiles/LLVMScalarOpts.dir/LoopStrengthReduce.cpp.o
ninja: build stopped: subcommand failed.
thread 'main' panicked at '
command did not execute successfully, got: exit status: 1

build script failed, must exit now', /wrkdirs/usr/ports/lang/rust-bootstrap/work-powerpc64_elfv1/rustc-1.56.0-src/vendor/cmake/src/lib.rs:885:5
note: run with `RUST_BACKTRACE=1` environment variable to display a backtrace
	finished in 2092.598 seconds
Traceback (most recent call last):
  File "x.py", line 27, in <module>
    bootstrap.main()
  File "/wrkdirs/usr/ports/lang/rust-bootstrap/work-powerpc64_elfv1/rustc-1.56.0-src/src/bootstrap/bootstrap.py", line 1214, in main
    bootstrap(help_triggered)
  File "/wrkdirs/usr/ports/lang/rust-bootstrap/work-powerpc64_elfv1/rustc-1.56.0-src/src/bootstrap/bootstrap.py", line 1200, in bootstrap
    run(args, env=env, verbose=build.verbose, is_bootstrap=True)
  File "/wrkdirs/usr/ports/lang/rust-bootstrap/work-powerpc64_elfv1/rustc-1.56.0-src/src/bootstrap/bootstrap.py", line 153, in run
    raise RuntimeError(err)
RuntimeError: failed to run: /wrkdirs/usr/ports/lang/rust-bootstrap/work-powerpc64_elfv1/rustc-1.56.0-src/build/bootstrap/debug/bootstrap dist --jobs=2 cargo src/librustc library/std
*** Error code 1

Stop.
make: stopped in /usr/ports/lang/rust-bootstrap
Received on Tue Oct 26 2021 - 23:19:17 UTC

Original text of this message