[package - main-arm64-default][databases/foundationdb-devel] Failed for foundationdb-devel-7.0.0.a.20210529 in build

From: <pkg-fallout_at_FreeBSD.org>
Date: Tue, 26 Oct 2021 20:13:53 GMT
You are receiving this mail as a port that you maintain
is failing to build on the FreeBSD package build server.
Please investigate the failure and submit a PR to fix
build.

Maintainer:     dch_at_FreeBSD.org
Log URL:        http://ampere2.nyi.freebsd.org/data/main-arm64-default/pebf5105f9a4d_s179219ea04/logs/foundationdb-devel-7.0.0.a.20210529.log
Build URL:      http://ampere2.nyi.freebsd.org/build.html?mastername=main-arm64-default&build=pebf5105f9a4d_s179219ea04
Log:

=>> Building databases/foundationdb-devel
build started at Tue Oct 26 20:12:52 UTC 2021
port directory: /usr/ports/databases/foundationdb-devel
package name: foundationdb-devel-7.0.0.a.20210529
building for: FreeBSD main-arm64-default-job-09 14.0-CURRENT FreeBSD 14.0-CURRENT 1400039 arm64
maintained by: dch_at_FreeBSD.org
Makefile ident: 
Poudriere version: 3.2.8-21-g883afb07
Host OSVERSION: 1400008
Jail OSVERSION: 1400039
Job Id: 09




!!! Jail is newer than host. (Jail: 1400039, Host: 1400008) !!!
!!! This is not supported. !!!
!!! Host kernel must be same or newer than jail. !!!
!!! Expect build failures. !!!



---Begin Environment---
SHELL=/bin/sh
OSVERSION=1400039
UNAME_v=FreeBSD 14.0-CURRENT 1400039
UNAME_r=14.0-CURRENT
BLOCKSIZE=K
MAIL=/var/mail/root
MM_CHARSET=UTF-8
LANG=C.UTF-8
STATUS=1
HOME=/root
PATH=/sbin:/bin:/usr/sbin:/usr/bin:/usr/local/sbin:/usr/local/bin:/root/bin
LOCALBASE=/usr/local
USER=root
LIBEXECPREFIX=/usr/local/libexec/poudriere
POUDRIERE_VERSION=3.2.8-21-g883afb07
MASTERMNT=/usr/local/poudriere/data/.m/main-arm64-default/ref
POUDRIERE_BUILD_TYPE=bulk
PACKAGE_BUILDING=yes
SAVED_TERM=
PWD=/usr/local/poudriere/data/.m/main-arm64-default/ref/.p/pool
P_PORTS_FEATURES=FLAVORS SELECTED_OPTIONS
MASTERNAME=main-arm64-default
SCRIPTPREFIX=/usr/local/share/poudriere
OLDPWD=/usr/local/poudriere/data/.m/main-arm64-default/ref/.p
SCRIPTPATH=/usr/local/share/poudriere/bulk.sh
POUDRIEREPATH=/usr/local/bin/poudriere
---End Environment---

---Begin Poudriere Port Flags/Env---
PORT_FLAGS=
PKGENV=
FLAVOR=
DEPENDS_ARGS=
MAKE_ARGS=
---End Poudriere Port Flags/Env---

---Begin OPTIONS List---
---End OPTIONS List---

--MAINTAINER--
dch_at_FreeBSD.org
--End MAINTAINER--

--CONFIGURE_ARGS--

--End CONFIGURE_ARGS--

--CONFIGURE_ENV--
MONO_SHARED_DIR="/wrkdirs/usr/ports/databases/foundationdb-devel/work" PYTHON="/usr/local/bin/python3.8" XDG_DATA_HOME=/wrkdirs/usr/ports/databases/foundationdb-devel/work  XDG_CONFIG_HOME=/wrkdirs/usr/ports/databases/foundationdb-devel/work  XDG_CACHE_HOME=/wrkdirs/usr/ports/databases/foundationdb-devel/work/.cache  HOME=/wrkdirs/usr/ports/databases/foundationdb-devel/work TMPDIR="/tmp" PATH=/wrkdirs/usr/ports/databases/foundationdb-devel/work/.bin:/sbin:/bin:/usr/sbin:/usr/bin:/usr/local/sbin:/usr/local/bin:/root/bin SHELL=/bin/sh CONFIG_SHELL=/bin/sh
--End CONFIGURE_ENV--

--MAKE_ENV--
NINJA_STATUS="[%p %s/%t] " MONO_SHARED_DIR="/wrkdirs/usr/ports/databases/foundationdb-devel/work" TZ=UTC OPENSSLBASE=/usr OPENSSLDIR=/etc/ssl OPENSSLINC=/usr/include OPENSSLLIB=/usr/lib XDG_DATA_HOME=/wrkdirs/usr/ports/databases/foundationdb-devel/work  XDG_CONFIG_HOME=/wrkdirs/usr/ports/databases/foundationdb-devel/work  XDG_CACHE_HOME=/wrkdirs/usr/ports/databases/foundationdb-devel/work/.cache  HOME=/wrkdirs/usr/ports/databases/foundationdb-devel/work TMPDIR="/tmp" PATH=/wrkdirs/usr/ports/databases/foundationdb-devel/work/.bin:/sbin:/bin:/usr/sbin:/usr/bin:/usr/local/sbin:/usr/local/bin:/root/bin NO_PIE=yes MK_DEBUG_FILES=no MK_KERNEL_SYMBOLS=no SHELL=/bin/sh NO_LINT=YES DESTDIR=/wrkdirs/usr/ports/databases/foundationdb-devel/work/stage PREFIX=/usr/local  LOCALBASE=/usr/local  CC="cc" CFLAGS="-O2 -pipe  -fstack-protector-strong -fno-strict-aliasing "  CPP="cpp" CPPFLAGS=""  LDFLAGS="  -fstack-protector-strong " LIBS=""  CXX="c++" CXXFLAGS="-O2 -pipe -fstack-protector-strong -fno-st
 rict-aliasing  "  MANPREFIX="/usr/local" BSD_INSTALL_PROGRAM="install  -s -m 555"  BSD_INSTALL_LIB="install  -s -m 0644"  BSD_INSTALL_SCRIPT="install  -m 555"  BSD_INSTALL_DATA="install  -m 0644"  BSD_INSTALL_MAN="install  -m 444"
--End MAKE_ENV--

--PLIST_SUB--
DB_USER=foundationdb DB_GROUP=foundationdb DB_DIR=/var/db/foundationdb  LOG_DIR=/var/log/foundationdb CMAKE_BUILD_TYPE="release" PYTHON_INCLUDEDIR=include/python3.8  PYTHON_LIBDIR=lib/python3.8  PYTHON_PLATFORM=freebsd14  PYTHON_SITELIBDIR=lib/python3.8/site-packages  PYTHON_SUFFIX=38  PYTHON_EXT_SUFFIX=.cpython-38  PYTHON_VER=3.8  PYTHON_VERSION=python3.8 PYTHON2="_at_comment " PYTHON3="" OSREL=14.0 PREFIX=%D LOCALBASE=/usr/local  RESETPREFIX=/usr/local LIB32DIR=lib DOCSDIR="share/doc/foundationdb-devel"  EXAMPLESDIR="share/examples/foundationdb-devel"  DATADIR="share/foundationdb-devel"  WWWDIR="www/foundationdb-devel"  ETCDIR="etc/foundationdb-devel"
--End PLIST_SUB--

--SUB_LIST--
DB_USER=foundationdb DB_GROUP=foundationdb DB_DIR=/var/db/foundationdb  LOG_DIR=/var/log/foundationdb PREFIX=/usr/local LOCALBASE=/usr/local  DATADIR=/usr/local/share/foundationdb-devel DOCSDIR=/usr/local/share/doc/foundationdb-devel EXAMPLESDIR=/usr/local/share/examples/foundationdb-devel  WWWDIR=/usr/local/www/foundationdb-devel ETCDIR=/usr/local/etc/foundationdb-devel
--End SUB_LIST--

---Begin make.conf---
USE_PACKAGE_DEPENDS=yes
BATCH=yes
WRKDIRPREFIX=/wrkdirs
PORTSDIR=/usr/ports
PACKAGES=/packages
DISTDIR=/distfiles
PACKAGE_BUILDING=yes
PACKAGE_BUILDING_FLAVORS=yes
#### /usr/local/etc/poudriere.d/make.conf ####
# XXX: We really need this but cannot use it while 'make checksum' does not
# try the next mirror on checksum failure.  It currently retries the same
# failed mirror and then fails rather then trying another.  It *does*
# try the next if the size is mismatched though.
#MASTER_SITE_FREEBSD=yes
# Build ALLOW_MAKE_JOBS_PACKAGES with 2 jobs
MAKE_JOBS_NUMBER=2
#### /usr/ports/Mk/Scripts/ports_env.sh ####
_CCVERSION_921dbbb2=FreeBSD clang version 12.0.1 (git_at_github.com:llvm/llvm-project.git llvmorg-12.0.1-0-gfed41342a82f) Target: aarch64-unknown-freebsd14.0 Thread model: posix InstalledDir: /usr/bin
_ALTCCVERSION_921dbbb2=none
_CXXINTERNAL_acaad9ca=FreeBSD clang version 12.0.1 (git_at_github.com:llvm/llvm-project.git llvmorg-12.0.1-0-gfed41342a82f) Target: aarch64-unknown-freebsd14.0 Thread model: posix InstalledDir: /usr/bin "/usr/bin/ld" "--eh-frame-hdr" "-dynamic-linker" "/libexec/ld-elf.so.1" "--enable-new-dtags" "-o" "a.out" "/usr/lib/crt1.o" "/usr/lib/crti.o" "/usr/lib/crtbegin.o" "-L/usr/lib" "/dev/null" "-lc++" "-lm" "-lgcc" "--as-needed" "-lgcc_s" "--no-as-needed" "-lc" "-lgcc" "--as-needed" "-lgcc_s" "--no-as-needed" "/usr/lib/crtend.o" "/usr/lib/crtn.o"
CC_OUTPUT_921dbbb2_58173849=yes
CC_OUTPUT_921dbbb2_9bdba57c=yes
CC_OUTPUT_921dbbb2_6a4fe7f5=yes
CC_OUTPUT_921dbbb2_6bcac02b=yes
CC_OUTPUT_921dbbb2_67d20829=yes
CC_OUTPUT_921dbbb2_bfa62e83=yes
CC_OUTPUT_921dbbb2_f0b4d593=yes
CC_OUTPUT_921dbbb2_308abb44=yes
CC_OUTPUT_921dbbb2_f00456e5=yes
CC_OUTPUT_921dbbb2_65ad290d=yes
CC_OUTPUT_921dbbb2_f2776b26=yes
CC_OUTPUT_921dbbb2_b2657cc3=yes
CC_OUTPUT_921dbbb2_380987f7=yes
CC_OUTPUT_921dbbb2_160933ec=yes
CC_OUTPUT_921dbbb2_fb62803b=yes
_OBJC_CCVERSION_921dbbb2=FreeBSD clang version 12.0.1 (git_at_github.com:llvm/llvm-project.git llvmorg-12.0.1-0-gfed41342a82f) Target: aarch64-unknown-freebsd14.0 Thread model: posix InstalledDir: /usr/bin
_OBJC_ALTCCVERSION_921dbbb2=none
ARCH=aarch64
OPSYS=FreeBSD
_OSRELEASE=14.0-CURRENT
OSREL=14.0
OSVERSION=1400039
PYTHONBASE=/usr/local
CONFIGURE_MAX_CMD_LEN=524288
HAVE_PORTS_ENV=1
#### Misc Poudriere ####
GID=0
UID=0
---End make.conf---
--Resource limits--
cpu time               (seconds, -t)  unlimited
file size           (512-blocks, -f)  unlimited
data seg size           (kbytes, -d)  1048576
stack size              (kbytes, -s)  1048576
core file size      (512-blocks, -c)  unlimited
max memory size         (kbytes, -m)  unlimited
locked memory           (kbytes, -l)  unlimited
max user processes              (-u)  89999
open files                      (-n)  1024
virtual mem size        (kbytes, -v)  unlimited
swap limit              (kbytes, -w)  unlimited
socket buffer size       (bytes, -b)  unlimited
pseudo-terminals                (-p)  unlimited
kqueues                         (-k)  unlimited
umtx shared locks               (-o)  unlimited
--End resource limits--
=======================<phase: check-sanity   >============================
===>  License APACHE20 accepted by the user
===========================================================================
=======================<phase: pkg-depends    >============================
===>   foundationdb-devel-7.0.0.a.20210529 depends on file: /usr/local/sbin/pkg - not found
===>   Installing existing package /packages/All/pkg-1.17.3.pkg
[main-arm64-default-job-09] Installing pkg-1.17.3...
[main-arm64-default-job-09] Extracting pkg-1.17.3: .......... done
===>   foundationdb-devel-7.0.0.a.20210529 depends on file: /usr/local/sbin/pkg - found
===>   Returning to build of foundationdb-devel-7.0.0.a.20210529
===========================================================================
=======================<phase: fetch-depends  >============================
===========================================================================
=======================<phase: fetch          >============================
===>  License APACHE20 accepted by the user
===> Fetching all distfiles required by foundationdb-devel-7.0.0.a.20210529 for building
===========================================================================
=======================<phase: checksum       >============================
===>  License APACHE20 accepted by the user
===> Fetching all distfiles required by foundationdb-devel-7.0.0.a.20210529 for building
=> SHA256 Checksum OK for apple-foundationdb-7.0.0.a.20210529-d35da1a_GH0.tar.gz.
===========================================================================
=======================<phase: extract-depends>============================
===========================================================================
=======================<phase: extract        >============================
===>  License APACHE20 accepted by the user
===> Fetching all distfiles required by foundationdb-devel-7.0.0.a.20210529 for building
===>  Extracting for foundationdb-devel-7.0.0.a.20210529
=> SHA256 Checksum OK for apple-foundationdb-7.0.0.a.20210529-d35da1a_GH0.tar.gz.
===========================================================================
=======================<phase: patch-depends  >============================
===========================================================================
=======================<phase: patch          >============================
===>  Patching for foundationdb-devel-7.0.0.a.20210529
===>  Applying FreeBSD patches for foundationdb-devel-7.0.0.a.20210529 from /usr/ports/databases/foundationdb-devel/files
/usr/bin/sed -i.bak 's/OPENSSL_USE_STATIC_LIBS TRUE/OPENSSL_USE_STATIC_LIBS FALSE/'  /wrkdirs/usr/ports/databases/foundationdb-devel/work/foundationdb-d35da1a/cmake/FDBComponents.cmake
===========================================================================
=======================<phase: build-depends  >============================
===>   foundationdb-devel-7.0.0.a.20210529 depends on file: /usr/local/include/doctest/doctest.h - not found
===>   Installing existing package /packages/All/doctest-2.4.6.pkg
[main-arm64-default-job-09] Installing doctest-2.4.6...
[main-arm64-default-job-09] Extracting doctest-2.4.6: ......... done
===>   foundationdb-devel-7.0.0.a.20210529 depends on file: /usr/local/include/doctest/doctest.h - found
===>   Returning to build of foundationdb-devel-7.0.0.a.20210529
===>   foundationdb-devel-7.0.0.a.20210529 depends on file: /usr/local/include/toml.hpp - not found
===>   Installing existing package /packages/All/toml11-3.7.0.pkg
<snip>
-- ADDING SIMULATOR TEST 43 fast/VersionStamp
-- ADDING SIMULATOR TEST 44 fast/Watches
-- ADDING SIMULATOR TEST 45 fast/WriteDuringRead
-- ADDING SIMULATOR TEST 46 fast/WriteDuringReadClean
-- ADDING SIMULATOR TEST 47 rare/CheckRelocation
-- ADDING SIMULATOR TEST 48 rare/ClogUnclog
-- ADDING SIMULATOR TEST 49 rare/CloggedCycleWithKills
-- ADDING SIMULATOR TEST 50 rare/ConflictRangeCheck
-- ADDING SIMULATOR TEST 51 rare/ConflictRangeRYOWCheck
-- ADDING SIMULATOR TEST 52 rare/CycleRollbackClogged
-- ADDING SIMULATOR TEST 53 rare/CycleWithKills
-- ADDING SIMULATOR TEST 54 rare/Downgrade
-- ADDING SIMULATOR TEST 55 rare/FuzzTest
-- ADDING SIMULATOR TEST 56 rare/InventoryTestHeavyWrites
-- ADDING SIMULATOR TEST 57 rare/LargeApiCorrectness
-- ADDING SIMULATOR TEST 58 rare/LargeApiCorrectnessStatus
-- ADDING SIMULATOR TEST 59 rare/RYWDisable
-- ADDING SIMULATOR TEST 60 rare/RandomReadWriteTest
-- ADDING SIMULATOR TEST 61 rare/SwizzledLargeApiCorrectness
-- ADDING SIMULATOR TEST 62 rare/RedwoodCorrectnessBTree
-- ADDING SIMULATOR TEST 63 rare/Throttling
-- ADDING SIMULATOR TEST 64 rare/TransactionTagApiCorrectness
-- ADDING SIMULATOR TEST 65 rare/TransactionTagSwizzledApiCorrectness
-- ADDING SIMULATOR TEST 66 rare/WriteTagThrottling
-- ADDING SIMULATOR TEST 67 restarting/from_7.0.0/SnapIncrementalRestore-1
-- ADDING SIMULATOR TEST 69 restarting/from_7.0.0/ConfigureTestRestart-1
-- ADDING SIMULATOR TEST 71 restarting/from_5.0.0/CycleTestRestart-1
-- ADDING SIMULATOR TEST 73 restarting/from_5.0.0/StorefrontTestRestart-1
-- ADDING SIMULATOR TEST 75 restarting/from_6.2.29/SnapTestAttrition-1
-- ADDING SIMULATOR TEST 77 restarting/from_6.2.29/SnapTestSimpleRestart-1
-- ADDING SIMULATOR TEST 79 restarting/from_6.2.29/SnapTestRestart-1
-- ADDING SIMULATOR TEST 81 restarting/from_6.2.29/SnapCycleRestart-1
-- ADDING SIMULATOR TEST 83 restarting/from_5.1.7/DrUpgradeRestart-1
-- ADDING SIMULATOR TEST 85 restarting/from_5.2.0/ClientTransactionProfilingCorrectness-1
-- ADDING SIMULATOR TEST 87 restarting/from_7.0.0/UpgradeAndBackupRestore-1
-- ADDING SIMULATOR TEST 89 restarting/to_6.3.10/CycleTestRestart-1
-- ADDING SIMULATOR TEST 91 slow/ApiCorrectness
-- ADDING SIMULATOR TEST 92 slow/ApiCorrectnessAtomicRestore
-- ADDING SIMULATOR TEST 93 slow/ApiCorrectnessSwitchover
-- ADDING SIMULATOR TEST 94 slow/ClogWithRollbacks
-- ADDING SIMULATOR TEST 95 slow/CloggedCycleTest
-- ADDING SIMULATOR TEST 96 slow/CloggedStorefront
-- ADDING SIMULATOR TEST 97 slow/CommitBug
-- ADDING SIMULATOR TEST 98 slow/ConfigureTest
-- ADDING SIMULATOR TEST 99 slow/CycleRollbackPlain
-- ADDING SIMULATOR TEST 100 slow/DDBalanceAndRemove
-- ADDING SIMULATOR TEST 101 slow/DDBalanceAndRemoveStatus
-- ADDING SIMULATOR TEST 102 slow/DifferentClustersSameRV
-- ADDING SIMULATOR TEST 103 slow/FastTriggeredWatches
-- ADDING SIMULATOR TEST 104 slow/LowLatencyWithFailures
-- ADDING SIMULATOR TEST 105 slow/MoveKeysClean
-- ADDING SIMULATOR TEST 106 slow/MoveKeysSideband
-- ADDING SIMULATOR TEST 107 slow/RyowCorrectness
-- ADDING SIMULATOR TEST 108 slow/Serializability
-- ADDING SIMULATOR TEST 109 slow/SharedBackupCorrectness
-- ADDING SIMULATOR TEST 110 slow/SharedBackupToDBCorrectness
-- ADDING SIMULATOR TEST 111 slow/StorefrontTest
-- ADDING SIMULATOR TEST 112 slow/SwizzledApiCorrectness
-- ADDING SIMULATOR TEST 113 slow/SwizzledCycleTest
-- ADDING SIMULATOR TEST 114 slow/SwizzledDdBalance
-- ADDING SIMULATOR TEST 115 slow/SwizzledRollbackTimeLapse
-- ADDING SIMULATOR TEST 116 slow/SwizzledRollbackTimeLapseIncrement
-- ADDING SIMULATOR TEST 117 slow/VersionStampBackupToDB
-- ADDING SIMULATOR TEST 118 slow/VersionStampSwitchover
-- ADDING SIMULATOR TEST 119 slow/WriteDuringReadAtomicRestore
-- ADDING SIMULATOR TEST 120 slow/WriteDuringReadSwitchover
-- ADDING SIMULATOR TEST 121 slow/ddbalance
-- ADDING SIMULATOR TEST 122 slow/ParallelRestoreNewBackupCorrectnessAtomicOp
-- ADDING SIMULATOR TEST 123 slow/ParallelRestoreNewBackupCorrectnessCycle
-- ADDING SIMULATOR TEST 124 slow/ParallelRestoreNewBackupCorrectnessMultiCycles
-- ADDING SIMULATOR TEST 125 slow/ParallelRestoreNewBackupWriteDuringReadAtomicRestore
-- ADDING SIMULATOR TEST 126 slow/ParallelRestoreOldBackupCorrectnessAtomicOp
-- ADDING SIMULATOR TEST 127 slow/ParallelRestoreOldBackupCorrectnessCycle
-- ADDING SIMULATOR TEST 128 slow/ParallelRestoreOldBackupCorrectnessMultiCycles
-- ADDING SIMULATOR TEST 129 slow/ParallelRestoreOldBackupWriteDuringReadAtomicRestore
-- ADDING SIMULATOR TEST 130 status/invalid_proc_addresses
-- ADDING SIMULATOR TEST 131 status/local_6_machine_no_replicas_remain
-- ADDING SIMULATOR TEST 132 status/separate_1_of_3_coordinators_remain
-- ADDING SIMULATOR TEST 133 status/separate_2_of_3_coordinators_remain
-- ADDING SIMULATOR TEST 134 status/separate_cannot_write_cluster_file
-- ADDING SIMULATOR TEST 135 status/separate_idle
-- ADDING SIMULATOR TEST 136 status/separate_initializing
-- ADDING SIMULATOR TEST 137 status/separate_no_coordinators
-- ADDING SIMULATOR TEST 138 status/separate_no_database
-- ADDING SIMULATOR TEST 139 status/separate_no_servers
-- ADDING SIMULATOR TEST 140 status/separate_not_enough_servers
-- ADDING SIMULATOR TEST 141 status/single_process_too_many_config_params
-- Adding Client test fdb_c_setup_tests
-- Adding Client test fdb_c_unit_tests
-- Adding Client test fdb_c_external_client_unit_tests
-- Check versions.h on fdb_flow_actors
-- Check versions.h on fdb_flow_tester_actors
-- Check versions.h on tutorial_actors
-- Add html target
-- add_custom_target(html DEPENDS /wrkdirs/usr/ports/databases/foundationdb-devel/work/.build/documentation/html_done)
-- math(EXPRport(0x572578c0d838024 % 8000) + 8000OUTPUT_FORMATDECIMAL)
-- Port is 14244
-- =========================================
--    Components Build Overview 
-- =========================================
-- Build Java Bindings:                  OFF
-- Build with TLS support:               ON
-- Build Go bindings:                    OFF
-- Build Ruby bindings:                  OFF
-- Build Python sdist (make package):    ON
-- Build Documentation (make html):      ON
-- Build Bindings (depends on Python):   ON
-- Configure CTest (depends on Python):  ON
-- Build with RocksDB:                   OFF
-- =========================================
-- CPACK_COMPONENTS_ALL clients-deb;clients-el7;clients-tgz;clients-versioned;server-deb;server-el7;server-tgz;server-versioned
-- Configuring done
-- Generating done
CMake Warning:
  Manually-specified variables were not used by the project:

    BOOST_PYTHON_SUFFIX
    CMAKE_COLOR_MAKEFILE
    CMAKE_MODULE_LINKER_FLAGS
    CMAKE_VERBOSE_MAKEFILE
    Python_ADDITIONAL_VERSIONS


-- Build files have been written to: /wrkdirs/usr/ports/databases/foundationdb-devel/work/.build
===========================================================================
=======================<phase: build          >============================
===>  Building for foundationdb-devel-7.0.0.a.20210529
[  0% 2/793] cd /wrkdirs/usr/ports/databases/foundationdb-devel/work/.build && /usr/local/bin/mcs -r:System,System.Core,System.Data,System.Xml,System.Xml.Linq /wrkdirs/usr/ports/databases/foundationdb-devel/work/foundationdb-d35da1a/fdbclient/vexillographer/c.cs /wrkdirs/usr/ports/databases/foundationdb-devel/work/foundationdb-d35da1a/fdbclient/vexillographer/cpp.cs /wrkdirs/usr/ports/databases/foundationdb-devel/work/foundationdb-d35da1a/fdbclient/vexillographer/java.cs /wrkdirs/usr/ports/databases/foundationdb-devel/work/foundationdb-d35da1a/fdbclient/vexillographer/python.cs /wrkdirs/usr/ports/databases/foundationdb-devel/work/foundationdb-d35da1a/fdbclient/vexillographer/ruby.cs /wrkdirs/usr/ports/databases/foundationdb-devel/work/foundationdb-d35da1a/fdbclient/vexillographer/vexillographer.cs -target:exe -out:/wrkdirs/usr/ports/databases/foundationdb-devel/work/.build/vexillographer.exe
[  0% 3/793] cd /wrkdirs/usr/ports/databases/foundationdb-devel/work/.build && /usr/local/bin/mcs -r:System,System.Core,System.Xml.Linq,System.Data.DataSetExtensions,Microsoft.CSharp,System.Data,System.Xml /wrkdirs/usr/ports/databases/foundationdb-devel/work/foundationdb-d35da1a/flow/actorcompiler/ActorCompiler.cs /wrkdirs/usr/ports/databases/foundationdb-devel/work/foundationdb-d35da1a/flow/actorcompiler/ActorParser.cs /wrkdirs/usr/ports/databases/foundationdb-devel/work/foundationdb-d35da1a/flow/actorcompiler/ParseTree.cs /wrkdirs/usr/ports/databases/foundationdb-devel/work/foundationdb-d35da1a/flow/actorcompiler/Program.cs /wrkdirs/usr/ports/databases/foundationdb-devel/work/foundationdb-d35da1a/flow/actorcompiler/Properties/AssemblyInfo.cs -target:exe -out:actorcompiler.exe
[  0% 4/793] cd /wrkdirs/usr/ports/databases/foundationdb-devel/work/.build && /usr/local/bin/mcs -r:System,System.Core,System.Xml.Linq,System.Data.DataSetExtensions,Microsoft.CSharp,System.Data,System.Xml /wrkdirs/usr/ports/databases/foundationdb-devel/work/foundationdb-d35da1a/flow/coveragetool/Program.cs /wrkdirs/usr/ports/databases/foundationdb-devel/work/foundationdb-d35da1a/flow/coveragetool/Properties/AssemblyInfo.cs -target:exe -out:coveragetool.exe
[  0% 5/793] /usr/bin/c++ -DBOOST_ERROR_CODE_HEADER_ONLY -DBOOST_SYSTEM_NO_DEPRECATED -DNO_INTELLISENSE -I/wrkdirs/usr/ports/databases/foundationdb-devel/work/foundationdb-d35da1a -I/wrkdirs/usr/ports/databases/foundationdb-devel/work/.build -I/usr/local/include -O2 -pipe -fstack-protector-strong -fno-strict-aliasing -O2 -pipe -fstack-protector-strong -fno-strict-aliasing -DCMAKE_BUILD -ggdb -fno-omit-frame-pointer -stdlib=libc++ -Wall -Wextra -Wredundant-move -Wpessimizing-move -Woverloaded-virtual -Wshift-sign-overflow -Wno-comment -Wno-dangling-else -Wno-delete-non-virtual-dtor -Wno-format -Wno-mismatched-tags -Wno-missing-field-initializers -Wno-reorder -Wno-reorder-ctor -Wno-sign-compare -Wno-tautological-pointer-compare -Wno-undefined-var-template -Wno-unknown-pragmas -Wno-unknown-warning-option -Wno-unused-function -Wno-unused-local-typedef -Wno-unused-parameter -Wno-self-assign -Wno-error=format -Wunused-variable -Wno-deprecated -fvisibility=hidden -Wreturn-type -fPIC -march=
 armv8.2-a+crc+simd -DHAVE_OPENSSL -DHAVE_OPENSSL_INIT_NO_AT_EXIT -std=gnu++17 -MD -MT flow/CMakeFiles/stacktrace.dir/stacktrace.amalgamation.cpp.o -MF flow/CMakeFiles/stacktrace.dir/stacktrace.amalgamation.cpp.o.d -o flow/CMakeFiles/stacktrace.dir/stacktrace.amalgamation.cpp.o -c /wrkdirs/usr/ports/databases/foundationdb-devel/work/foundationdb-d35da1a/flow/stacktrace.amalgamation.cpp
[  0% 6/793] : && /usr/local/bin/cmake -E rm -f lib/libstacktrace.a && /usr/bin/llvm-ar qc lib/libstacktrace.a  flow/CMakeFiles/stacktrace.dir/stacktrace.amalgamation.cpp.o && /usr/bin/llvm-ranlib lib/libstacktrace.a && :
[  0% 7/793] cd /wrkdirs/usr/ports/databases/foundationdb-devel/work/.build/flow && /usr/local/bin/cmake -DFILE="/wrkdirs/usr/ports/databases/foundationdb-devel/work/foundationdb-d35da1a/versions.h" -P /wrkdirs/usr/ports/databases/foundationdb-devel/work/foundationdb-d35da1a/cmake/AssertFileDoesntExist.cmake
[  0% 8/793] cd /wrkdirs/usr/ports/databases/foundationdb-devel/work/.build/flow && /usr/local/bin/mono /wrkdirs/usr/ports/databases/foundationdb-devel/work/.build/actorcompiler.exe /wrkdirs/usr/ports/databases/foundationdb-devel/work/foundationdb-d35da1a/flow/ActorCollection.actor.cpp /wrkdirs/usr/ports/databases/foundationdb-devel/work/.build/flow/ActorCollection.actor.g.cpp --generate-probes > /dev/null
[  1% 9/793] cd /wrkdirs/usr/ports/databases/foundationdb-devel/work/.build/flow && /usr/local/bin/mono /wrkdirs/usr/ports/databases/foundationdb-devel/work/.build/actorcompiler.exe /wrkdirs/usr/ports/databases/foundationdb-devel/work/foundationdb-d35da1a/flow/CompressedInt.actor.cpp /wrkdirs/usr/ports/databases/foundationdb-devel/work/.build/flow/CompressedInt.actor.g.cpp --generate-probes > /dev/null
[  1% 10/793] cd /wrkdirs/usr/ports/databases/foundationdb-devel/work/foundationdb-d35da1a/flow && /usr/local/bin/mono /wrkdirs/usr/ports/databases/foundationdb-devel/work/.build/coveragetool.exe /wrkdirs/usr/ports/databases/foundationdb-devel/work/.build/lib/coverage.flow.xml ActorCollection.actor.cpp ActorCollection.h Arena.cpp Arena.h AsioReactor.h CompressedInt.actor.cpp CompressedInt.h Deque.cpp Deque.h DeterministicRandom.cpp DeterministicRandom.h Error.cpp Error.h EventTypes.actor.h FastAlloc.cpp FastAlloc.h FastRef.h FaultInjection.cpp FaultInjection.h FileTraceLogWriter.cpp FileTraceLogWriter.h Hash3.c Hash3.h Histogram.cpp Histogram.h IDispatched.h IRandom.h IThreadPool.cpp IThreadPool.h ITrace.h IndexedSet.actor.h IndexedSet.cpp IndexedSet.h JsonTraceLogFormatter.cpp JsonTraceLogFormatter.h Knobs.cpp Knobs.h MetricSample.h Net2.actor.cpp Net2Packet.cpp Net2Packet.h Platform.actor.cpp Platform.actor.h Platform.h Profiler.actor.cpp Profiler.h SendBufferIterator.h SignalSafeU
 nwind.cpp SignalSafeUnwind.h SimpleOpt.h SystemMonitor.cpp SystemMonitor.h TDMetric.actor.h TDMetric.cpp TLSConfig.actor.cpp TLSConfig.actor.h ThreadHelper.actor.h ThreadHelper.actor.cpp ThreadPrimitives.cpp ThreadPrimitives.h ThreadSafeQueue.h Trace.cpp Trace.h Tracing.h Tracing.actor.cpp TreeBenchmark.h UnitTest.cpp UnitTest.h XmlTraceLogFormatter.cpp XmlTraceLogFormatter.h actorcompiler.h crc32c.h crc32c.cpp error_definitions.h /wrkdirs/usr/ports/databases/foundationdb-devel/work/.build/flow/SourceVersion.h flat_buffers.cpp flat_buffers.h flow.cpp flow.h genericactors.actor.cpp genericactors.actor.h network.cpp network.h rte_memcpy.h serialize.cpp serialize.h stacktrace.h test_memcpy.cpp test_memcpy_perf.cpp version.cpp xxhash.c xxhash.h folly_memcpy.S
[  1% 11/793] cd /wrkdirs/usr/ports/databases/foundationdb-devel/work/.build/flow && /usr/local/bin/mono /wrkdirs/usr/ports/databases/foundationdb-devel/work/.build/actorcompiler.exe /wrkdirs/usr/ports/databases/foundationdb-devel/work/foundationdb-d35da1a/flow/EventTypes.actor.h /wrkdirs/usr/ports/databases/foundationdb-devel/work/.build/flow/EventTypes.actor.g.h --generate-probes > /dev/null
[  1% 12/793] cd /wrkdirs/usr/ports/databases/foundationdb-devel/work/.build/flow && /usr/local/bin/mono /wrkdirs/usr/ports/databases/foundationdb-devel/work/.build/actorcompiler.exe /wrkdirs/usr/ports/databases/foundationdb-devel/work/foundationdb-d35da1a/flow/IndexedSet.actor.h /wrkdirs/usr/ports/databases/foundationdb-devel/work/.build/flow/IndexedSet.actor.g.h --generate-probes > /dev/null
[  1% 13/793] cd /wrkdirs/usr/ports/databases/foundationdb-devel/work/.build/flow && /usr/local/bin/mono /wrkdirs/usr/ports/databases/foundationdb-devel/work/.build/actorcompiler.exe /wrkdirs/usr/ports/databases/foundationdb-devel/work/foundationdb-d35da1a/flow/Net2.actor.cpp /wrkdirs/usr/ports/databases/foundationdb-devel/work/.build/flow/Net2.actor.g.cpp --generate-probes > /dev/null
[  1% 14/793] cd /wrkdirs/usr/ports/databases/foundationdb-devel/work/.build/flow && /usr/local/bin/mono /wrkdirs/usr/ports/databases/foundationdb-devel/work/.build/actorcompiler.exe /wrkdirs/usr/ports/databases/foundationdb-devel/work/foundationdb-d35da1a/flow/Platform.actor.h /wrkdirs/usr/ports/databases/foundationdb-devel/work/.build/flow/Platform.actor.g.h --generate-probes > /dev/null
[  1% 15/793] cd /wrkdirs/usr/ports/databases/foundationdb-devel/work/.build/flow && /usr/local/bin/mono /wrkdirs/usr/ports/databases/foundationdb-devel/work/.build/actorcompiler.exe /wrkdirs/usr/ports/databases/foundationdb-devel/work/foundationdb-d35da1a/flow/Platform.actor.cpp /wrkdirs/usr/ports/databases/foundationdb-devel/work/.build/flow/Platform.actor.g.cpp --generate-probes > /dev/null
[  1% 16/793] cd /wrkdirs/usr/ports/databases/foundationdb-devel/work/.build/flow && /usr/local/bin/mono /wrkdirs/usr/ports/databases/foundationdb-devel/work/.build/actorcompiler.exe /wrkdirs/usr/ports/databases/foundationdb-devel/work/foundationdb-d35da1a/flow/Profiler.actor.cpp /wrkdirs/usr/ports/databases/foundationdb-devel/work/.build/flow/Profiler.actor.g.cpp --generate-probes > /dev/null
[  2% 17/793] cd /wrkdirs/usr/ports/databases/foundationdb-devel/work/.build/flow && /usr/local/bin/mono /wrkdirs/usr/ports/databases/foundationdb-devel/work/.build/actorcompiler.exe /wrkdirs/usr/ports/databases/foundationdb-devel/work/foundationdb-d35da1a/flow/TDMetric.actor.h /wrkdirs/usr/ports/databases/foundationdb-devel/work/.build/flow/TDMetric.actor.g.h --generate-probes > /dev/null
[  2% 18/793] cd /wrkdirs/usr/ports/databases/foundationdb-devel/work/.build/flow && /usr/local/bin/mono /wrkdirs/usr/ports/databases/foundationdb-devel/work/.build/actorcompiler.exe /wrkdirs/usr/ports/databases/foundationdb-devel/work/foundationdb-d35da1a/flow/TLSConfig.actor.cpp /wrkdirs/usr/ports/databases/foundationdb-devel/work/.build/flow/TLSConfig.actor.g.cpp --generate-probes > /dev/null
[  2% 19/793] cd /wrkdirs/usr/ports/databases/foundationdb-devel/work/.build/flow && /usr/local/bin/mono /wrkdirs/usr/ports/databases/foundationdb-devel/work/.build/actorcompiler.exe /wrkdirs/usr/ports/databases/foundationdb-devel/work/foundationdb-d35da1a/flow/TLSConfig.actor.h /wrkdirs/usr/ports/databases/foundationdb-devel/work/.build/flow/TLSConfig.actor.g.h --generate-probes > /dev/null
[  2% 20/793] cd /wrkdirs/usr/ports/databases/foundationdb-devel/work/.build/flow && /usr/local/bin/mono /wrkdirs/usr/ports/databases/foundationdb-devel/work/.build/actorcompiler.exe /wrkdirs/usr/ports/databases/foundationdb-devel/work/foundationdb-d35da1a/flow/ThreadHelper.actor.cpp /wrkdirs/usr/ports/databases/foundationdb-devel/work/.build/flow/ThreadHelper.actor.g.cpp --generate-probes > /dev/null
[  2% 21/793] cd /wrkdirs/usr/ports/databases/foundationdb-devel/work/.build/flow && /usr/local/bin/mono /wrkdirs/usr/ports/databases/foundationdb-devel/work/.build/actorcompiler.exe /wrkdirs/usr/ports/databases/foundationdb-devel/work/foundationdb-d35da1a/flow/ThreadHelper.actor.h /wrkdirs/usr/ports/databases/foundationdb-devel/work/.build/flow/ThreadHelper.actor.g.h --generate-probes > /dev/null
[  2% 22/793] cd /wrkdirs/usr/ports/databases/foundationdb-devel/work/.build/flow && /usr/local/bin/mono /wrkdirs/usr/ports/databases/foundationdb-devel/work/.build/actorcompiler.exe /wrkdirs/usr/ports/databases/foundationdb-devel/work/foundationdb-d35da1a/flow/Tracing.actor.cpp /wrkdirs/usr/ports/databases/foundationdb-devel/work/.build/flow/Tracing.actor.g.cpp --generate-probes > /dev/null
[  2% 23/793] cd /wrkdirs/usr/ports/databases/foundationdb-devel/work/.build/flow && /usr/local/bin/mono /wrkdirs/usr/ports/databases/foundationdb-devel/work/.build/actorcompiler.exe /wrkdirs/usr/ports/databases/foundationdb-devel/work/foundationdb-d35da1a/flow/genericactors.actor.cpp /wrkdirs/usr/ports/databases/foundationdb-devel/work/.build/flow/genericactors.actor.g.cpp --generate-probes > /dev/null
[  2% 24/793] cd /wrkdirs/usr/ports/databases/foundationdb-devel/work/.build/flow && /usr/local/bin/mono /wrkdirs/usr/ports/databases/foundationdb-devel/work/.build/actorcompiler.exe /wrkdirs/usr/ports/databases/foundationdb-devel/work/foundationdb-d35da1a/flow/genericactors.actor.h /wrkdirs/usr/ports/databases/foundationdb-devel/work/.build/flow/genericactors.actor.g.h --generate-probes > /dev/null
[  3% 25/793] cd /wrkdirs/usr/ports/databases/foundationdb-devel/work/foundationdb-d35da1a/fdbrpc && /usr/local/bin/mono /wrkdirs/usr/ports/databases/foundationdb-devel/work/.build/coveragetool.exe /wrkdirs/usr/ports/databases/foundationdb-devel/work/.build/lib/coverage.fdbrpc.xml AsyncFileCached.actor.h AsyncFileEIO.actor.h AsyncFileKAIO.actor.h AsyncFileNonDurable.actor.h AsyncFileReadAhead.actor.h AsyncFileWinASIO.actor.h AsyncFileCached.actor.cpp AsyncFileNonDurable.actor.cpp AsyncFileWriteChecker.cpp FailureMonitor.actor.cpp FlowTransport.actor.cpp genericactors.actor.h genericactors.actor.cpp HealthMonitor.actor.cpp IAsyncFile.actor.cpp LoadBalance.actor.h Locality.cpp Net2FileSystem.cpp networksender.actor.h QueueModel.cpp ReplicationPolicy.cpp ReplicationTypes.cpp ReplicationUtils.cpp SimExternalConnection.actor.cpp SimExternalConnection.h Stats.actor.cpp Stats.h sim2.actor.cpp sim_validation.cpp TimedRequest.h TraceFileIO.cpp
[  3% 26/793] /usr/bin/c++ -DBOOST_ALL_NO_LIB -DBOOST_ERROR_CODE_HEADER_ONLY -DBOOST_SYSTEM_NO_DEPRECATED -DNO_INTELLISENSE -I/wrkdirs/usr/ports/databases/foundationdb-devel/work/foundationdb-d35da1a -I/wrkdirs/usr/ports/databases/foundationdb-devel/work/.build -isystem /usr/local/include -O2 -pipe -fstack-protector-strong -fno-strict-aliasing -O2 -pipe -fstack-protector-strong -fno-strict-aliasing -DCMAKE_BUILD -ggdb -fno-omit-frame-pointer -stdlib=libc++ -Wall -Wextra -Wredundant-move -Wpessimizing-move -Woverloaded-virtual -Wshift-sign-overflow -Wno-comment -Wno-dangling-else -Wno-delete-non-virtual-dtor -Wno-format -Wno-mismatched-tags -Wno-missing-field-initializers -Wno-reorder -Wno-reorder-ctor -Wno-sign-compare -Wno-tautological-pointer-compare -Wno-undefined-var-template -Wno-unknown-pragmas -Wno-unknown-warning-option -Wno-unused-function -Wno-unused-local-typedef -Wno-unused-parameter -Wno-self-assign -Wno-error=format -Wunused-variable -Wno-deprecated -fvisibility=hidden 
 -Wreturn-type -fPIC -march=armv8.2-a+crc+simd -DHAVE_OPENSSL -DHAVE_OPENSSL_INIT_NO_AT_EXIT -pthread -std=gnu++17 -MD -MT flow/CMakeFiles/flow.dir/ActorCollection.actor.g.cpp.o -MF flow/CMakeFiles/flow.dir/ActorCollection.actor.g.cpp.o.d -o flow/CMakeFiles/flow.dir/ActorCollection.actor.g.cpp.o -c /wrkdirs/usr/ports/databases/foundationdb-devel/work/.build/flow/ActorCollection.actor.g.cpp
FAILED: flow/CMakeFiles/flow.dir/ActorCollection.actor.g.cpp.o 
/usr/bin/c++ -DBOOST_ALL_NO_LIB -DBOOST_ERROR_CODE_HEADER_ONLY -DBOOST_SYSTEM_NO_DEPRECATED -DNO_INTELLISENSE -I/wrkdirs/usr/ports/databases/foundationdb-devel/work/foundationdb-d35da1a -I/wrkdirs/usr/ports/databases/foundationdb-devel/work/.build -isystem /usr/local/include -O2 -pipe -fstack-protector-strong -fno-strict-aliasing -O2 -pipe -fstack-protector-strong -fno-strict-aliasing -DCMAKE_BUILD -ggdb -fno-omit-frame-pointer -stdlib=libc++ -Wall -Wextra -Wredundant-move -Wpessimizing-move -Woverloaded-virtual -Wshift-sign-overflow -Wno-comment -Wno-dangling-else -Wno-delete-non-virtual-dtor -Wno-format -Wno-mismatched-tags -Wno-missing-field-initializers -Wno-reorder -Wno-reorder-ctor -Wno-sign-compare -Wno-tautological-pointer-compare -Wno-undefined-var-template -Wno-unknown-pragmas -Wno-unknown-warning-option -Wno-unused-function -Wno-unused-local-typedef -Wno-unused-parameter -Wno-self-assign -Wno-error=format -Wunused-variable -Wno-deprecated -fvisibility=hidden -Wreturn-type 
 -fPIC -march=armv8.2-a+crc+simd -DHAVE_OPENSSL -DHAVE_OPENSSL_INIT_NO_AT_EXIT -pthread -std=gnu++17 -MD -MT flow/CMakeFiles/flow.dir/ActorCollection.actor.g.cpp.o -MF flow/CMakeFiles/flow.dir/ActorCollection.actor.g.cpp.o.d -o flow/CMakeFiles/flow.dir/ActorCollection.actor.g.cpp.o -c /wrkdirs/usr/ports/databases/foundationdb-devel/work/.build/flow/ActorCollection.actor.g.cpp
In file included from /wrkdirs/usr/ports/databases/foundationdb-devel/work/foundationdb-d35da1a/flow/ActorCollection.actor.cpp:21:
In file included from /wrkdirs/usr/ports/databases/foundationdb-devel/work/foundationdb-d35da1a/flow/ActorCollection.h:25:
In file included from /wrkdirs/usr/ports/databases/foundationdb-devel/work/foundationdb-d35da1a/flow/flow.h:41:
/wrkdirs/usr/ports/databases/foundationdb-devel/work/foundationdb-d35da1a/flow/Platform.h:457:16: error: invalid output constraint '=a' in asm
        asm("rdtsc" : "=a"(lo), "=d"(hi));
                      ^
In file included from /wrkdirs/usr/ports/databases/foundationdb-devel/work/foundationdb-d35da1a/flow/ActorCollection.actor.cpp:21:
In file included from /wrkdirs/usr/ports/databases/foundationdb-devel/work/foundationdb-d35da1a/flow/ActorCollection.h:25:
In file included from /wrkdirs/usr/ports/databases/foundationdb-devel/work/foundationdb-d35da1a/flow/flow.h:1049:
In file included from /wrkdirs/usr/ports/databases/foundationdb-devel/work/foundationdb-d35da1a/flow/genericactors.actor.h:28:
In file included from /wrkdirs/usr/ports/databases/foundationdb-devel/work/foundationdb-d35da1a/flow/genericactors.actor.h:38:
In file included from /wrkdirs/usr/ports/databases/foundationdb-devel/work/foundationdb-d35da1a/flow/IndexedSet.h:1385:
In file included from /wrkdirs/usr/ports/databases/foundationdb-devel/work/foundationdb-d35da1a/flow/IndexedSet.actor.h:27:
/wrkdirs/usr/ports/databases/foundationdb-devel/work/foundationdb-d35da1a/flow/IndexedSet.actor.h:50:4: error: use of undeclared identifier '_mm_prefetch'
                        _mm_prefetch((const char*)toFree.back(), _MM_HINT_T0);
                        ^
2 errors generated.
[  3% 26/793] /usr/bin/c++ -DBOOST_ALL_NO_LIB -DBOOST_ERROR_CODE_HEADER_ONLY -DBOOST_SYSTEM_NO_DEPRECATED -DNO_INTELLISENSE -I/wrkdirs/usr/ports/databases/foundationdb-devel/work/foundationdb-d35da1a -I/wrkdirs/usr/ports/databases/foundationdb-devel/work/.build -isystem /usr/local/include -O2 -pipe -fstack-protector-strong -fno-strict-aliasing -O2 -pipe -fstack-protector-strong -fno-strict-aliasing -DCMAKE_BUILD -ggdb -fno-omit-frame-pointer -stdlib=libc++ -Wall -Wextra -Wredundant-move -Wpessimizing-move -Woverloaded-virtual -Wshift-sign-overflow -Wno-comment -Wno-dangling-else -Wno-delete-non-virtual-dtor -Wno-format -Wno-mismatched-tags -Wno-missing-field-initializers -Wno-reorder -Wno-reorder-ctor -Wno-sign-compare -Wno-tautological-pointer-compare -Wno-undefined-var-template -Wno-unknown-pragmas -Wno-unknown-warning-option -Wno-unused-function -Wno-unused-local-typedef -Wno-unused-parameter -Wno-self-assign -Wno-error=format -Wunused-variable -Wno-deprecated -fvisibility=hidden 
 -Wreturn-type -fPIC -march=armv8.2-a+crc+simd -DHAVE_OPENSSL -DHAVE_OPENSSL_INIT_NO_AT_EXIT -pthread -std=gnu++17 -MD -MT flow/CMakeFiles/flow.dir/Arena.cpp.o -MF flow/CMakeFiles/flow.dir/Arena.cpp.o.d -o flow/CMakeFiles/flow.dir/Arena.cpp.o -c /wrkdirs/usr/ports/databases/foundationdb-devel/work/foundationdb-d35da1a/flow/Arena.cpp
FAILED: flow/CMakeFiles/flow.dir/Arena.cpp.o 
/usr/bin/c++ -DBOOST_ALL_NO_LIB -DBOOST_ERROR_CODE_HEADER_ONLY -DBOOST_SYSTEM_NO_DEPRECATED -DNO_INTELLISENSE -I/wrkdirs/usr/ports/databases/foundationdb-devel/work/foundationdb-d35da1a -I/wrkdirs/usr/ports/databases/foundationdb-devel/work/.build -isystem /usr/local/include -O2 -pipe -fstack-protector-strong -fno-strict-aliasing -O2 -pipe -fstack-protector-strong -fno-strict-aliasing -DCMAKE_BUILD -ggdb -fno-omit-frame-pointer -stdlib=libc++ -Wall -Wextra -Wredundant-move -Wpessimizing-move -Woverloaded-virtual -Wshift-sign-overflow -Wno-comment -Wno-dangling-else -Wno-delete-non-virtual-dtor -Wno-format -Wno-mismatched-tags -Wno-missing-field-initializers -Wno-reorder -Wno-reorder-ctor -Wno-sign-compare -Wno-tautological-pointer-compare -Wno-undefined-var-template -Wno-unknown-pragmas -Wno-unknown-warning-option -Wno-unused-function -Wno-unused-local-typedef -Wno-unused-parameter -Wno-self-assign -Wno-error=format -Wunused-variable -Wno-deprecated -fvisibility=hidden -Wreturn-type 
 -fPIC -march=armv8.2-a+crc+simd -DHAVE_OPENSSL -DHAVE_OPENSSL_INIT_NO_AT_EXIT -pthread -std=gnu++17 -MD -MT flow/CMakeFiles/flow.dir/Arena.cpp.o -MF flow/CMakeFiles/flow.dir/Arena.cpp.o.d -o flow/CMakeFiles/flow.dir/Arena.cpp.o -c /wrkdirs/usr/ports/databases/foundationdb-devel/work/foundationdb-d35da1a/flow/Arena.cpp
In file included from /wrkdirs/usr/ports/databases/foundationdb-devel/work/foundationdb-d35da1a/flow/Arena.cpp:21:
In file included from /wrkdirs/usr/ports/databases/foundationdb-devel/work/foundationdb-d35da1a/flow/Arena.h:27:
In file included from /wrkdirs/usr/ports/databases/foundationdb-devel/work/foundationdb-d35da1a/flow/FastAlloc.h:25:
In file included from /wrkdirs/usr/ports/databases/foundationdb-devel/work/foundationdb-d35da1a/flow/Error.h:30:
/wrkdirs/usr/ports/databases/foundationdb-devel/work/foundationdb-d35da1a/flow/Platform.h:457:16: error: invalid output constraint '=a' in asm
        asm("rdtsc" : "=a"(lo), "=d"(hi));
                      ^
In file included from /wrkdirs/usr/ports/databases/foundationdb-devel/work/foundationdb-d35da1a/flow/Arena.cpp:23:
In file included from /wrkdirs/usr/ports/databases/foundationdb-devel/work/foundationdb-d35da1a/flow/UnitTest.h:46:
In file included from /wrkdirs/usr/ports/databases/foundationdb-devel/work/foundationdb-d35da1a/flow/flow.h:1049:
In file included from /wrkdirs/usr/ports/databases/foundationdb-devel/work/foundationdb-d35da1a/flow/genericactors.actor.h:28:
In file included from /wrkdirs/usr/ports/databases/foundationdb-devel/work/foundationdb-d35da1a/flow/genericactors.actor.h:38:
In file included from /wrkdirs/usr/ports/databases/foundationdb-devel/work/foundationdb-d35da1a/flow/IndexedSet.h:1385:
In file included from /wrkdirs/usr/ports/databases/foundationdb-devel/work/foundationdb-d35da1a/flow/IndexedSet.actor.h:27:
/wrkdirs/usr/ports/databases/foundationdb-devel/work/foundationdb-d35da1a/flow/IndexedSet.actor.h:50:4: error: use of undeclared identifier '_mm_prefetch'
                        _mm_prefetch((const char*)toFree.back(), _MM_HINT_T0);
                        ^
2 errors generated.
ninja: build stopped: subcommand failed.
===> Compilation failed unexpectedly.
Try to set MAKE_JOBS_UNSAFE=yes and rebuild before reporting the failure to
the maintainer.
*** Error code 1

Stop.
make: stopped in /usr/ports/databases/foundationdb-devel
Received on Tue Oct 26 2021 - 20:13:53 UTC

Original text of this message