[package - 130amd64-default][cad/horizon-eda] Failed for horizon-eda-2.1.0_1 in build

From: <pkg-fallout_at_FreeBSD.org>
Date: Fri, 12 Nov 2021 05:35:46 GMT
You are receiving this mail as a port that you maintain
is failing to build on the FreeBSD package build server.
Please investigate the failure and submit a PR to fix
build.

Maintainer:     yuri_at_FreeBSD.org
Log URL:        http://beefy16.nyi.freebsd.org/data/130amd64-default/067bd4d9c437/logs/horizon-eda-2.1.0_1.log
Build URL:      http://beefy16.nyi.freebsd.org/build.html?mastername=130amd64-default&build=067bd4d9c437
Log:

=>> Building cad/horizon-eda
build started at Fri Nov 12 05:25:44 UTC 2021
port directory: /usr/ports/cad/horizon-eda
package name: horizon-eda-2.1.0_1
building for: FreeBSD 130amd64-default-job-02 13.0-RELEASE-p5 FreeBSD 13.0-RELEASE-p5 amd64
maintained by: yuri_at_FreeBSD.org
Makefile ident: 
Poudriere version: 3.2.8-21-g883afb07
Host OSVERSION: 1400008
Jail OSVERSION: 1300139
Job Id: 02

---Begin Environment---
SHELL=/bin/csh
OSVERSION=1300139
UNAME_v=FreeBSD 13.0-RELEASE-p5
UNAME_r=13.0-RELEASE-p5
BLOCKSIZE=K
MAIL=/var/mail/root
MM_CHARSET=UTF-8
LANG=C.UTF-8
STATUS=1
HOME=/root
PATH=/sbin:/bin:/usr/sbin:/usr/bin:/usr/local/sbin:/usr/local/bin:/root/bin
LOCALBASE=/usr/local
USER=root
LIBEXECPREFIX=/usr/local/libexec/poudriere
POUDRIERE_VERSION=3.2.8-21-g883afb07
MASTERMNT=/usr/local/poudriere/data/.m/130amd64-default/ref
POUDRIERE_BUILD_TYPE=bulk
PACKAGE_BUILDING=yes
SAVED_TERM=
PWD=/usr/local/poudriere/data/.m/130amd64-default/ref/.p/pool
P_PORTS_FEATURES=FLAVORS SELECTED_OPTIONS
MASTERNAME=130amd64-default
SCRIPTPREFIX=/usr/local/share/poudriere
OLDPWD=/usr/local/poudriere/data/.m/130amd64-default/ref/.p
SCRIPTPATH=/usr/local/share/poudriere/bulk.sh
POUDRIEREPATH=/usr/local/bin/poudriere
---End Environment---

---Begin Poudriere Port Flags/Env---
PORT_FLAGS=
PKGENV=
FLAVOR=
DEPENDS_ARGS=
MAKE_ARGS=
---End Poudriere Port Flags/Env---

---Begin OPTIONS List---
---End OPTIONS List---

--MAINTAINER--
yuri_at_FreeBSD.org
--End MAINTAINER--

--CONFIGURE_ARGS--

--End CONFIGURE_ARGS--

--CONFIGURE_ENV--
MAKE=gmake PKG_CONFIG=pkgconf PYTHON="/usr/local/bin/python3.8" XDG_DATA_HOME=/wrkdirs/usr/ports/cad/horizon-eda/work  XDG_CONFIG_HOME=/wrkdirs/usr/ports/cad/horizon-eda/work  XDG_CACHE_HOME=/wrkdirs/usr/ports/cad/horizon-eda/work/.cache  HOME=/wrkdirs/usr/ports/cad/horizon-eda/work TMPDIR="/tmp" PATH=/wrkdirs/usr/ports/cad/horizon-eda/work/.bin:/sbin:/bin:/usr/sbin:/usr/bin:/usr/local/sbin:/usr/local/bin:/root/bin SHELL=/bin/sh CONFIG_SHELL=/bin/sh CMAKE_PREFIX_PATH="/usr/local" LANG=en_US.UTF-8 LC_ALL=en_US.UTF-8
--End CONFIGURE_ENV--

--MAKE_ENV--
XDG_DATA_HOME=/wrkdirs/usr/ports/cad/horizon-eda/work  XDG_CONFIG_HOME=/wrkdirs/usr/ports/cad/horizon-eda/work  XDG_CACHE_HOME=/wrkdirs/usr/ports/cad/horizon-eda/work/.cache  HOME=/wrkdirs/usr/ports/cad/horizon-eda/work TMPDIR="/tmp" PATH=/wrkdirs/usr/ports/cad/horizon-eda/work/.bin:/sbin:/bin:/usr/sbin:/usr/bin:/usr/local/sbin:/usr/local/bin:/root/bin NO_PIE=yes MK_DEBUG_FILES=no MK_KERNEL_SYMBOLS=no SHELL=/bin/sh NO_LINT=YES LANG=en_US.UTF-8 LC_ALL=en_US.UTF-8 PREFIX=/usr/local  LOCALBASE=/usr/local  CC="clang10" CFLAGS="-O2 -pipe  -fstack-protector-strong -isystem /usr/local/include -fno-strict-aliasing "  CPP="clang-cpp10" CPPFLAGS="-isystem /usr/local/include"  LDFLAGS=" -fstack-protector-strong " LIBS="-L/usr/local/lib"  CXX="clang++10" CXXFLAGS="-O2 -pipe -fstack-protector-strong -isystem /usr/local/include -fno-strict-aliasing  -isystem /usr/local/include "  MANPREFIX="/usr/local" BSD_INSTALL_PROGRAM="install  -s -m 555"  BSD_INSTALL_LIB="install  -s -m 0644"  BSD_INSTALL_SCR
 IPT="install  -m 555"  BSD_INSTALL_DATA="install  -m 0644"  BSD_INSTALL_MAN="install  -m 444"
--End MAKE_ENV--

--PLIST_SUB--
GTK2_VERSION="2.10.0"  GTK3_VERSION="3.0.0"  GTK4_VERSION="4.0.0" PYTHON_INCLUDEDIR=include/python3.8  PYTHON_LIBDIR=lib/python3.8  PYTHON_PLATFORM=freebsd13  PYTHON_SITELIBDIR=lib/python3.8/site-packages  PYTHON_SUFFIX=38  PYTHON_EXT_SUFFIX=.cpython-38  PYTHON_VER=3.8  PYTHON_VERSION=python3.8 PYTHON2="_at_comment " PYTHON3="" OSREL=13.0 PREFIX=%D LOCALBASE=/usr/local  RESETPREFIX=/usr/local LIB32DIR=lib DOCSDIR="share/doc/horizon-eda"  EXAMPLESDIR="share/examples/horizon-eda"  DATADIR="share/horizon-eda"  WWWDIR="www/horizon-eda"  ETCDIR="etc/horizon-eda"
--End PLIST_SUB--

--SUB_LIST--
PREFIX=/usr/local LOCALBASE=/usr/local  DATADIR=/usr/local/share/horizon-eda DOCSDIR=/usr/local/share/doc/horizon-eda EXAMPLESDIR=/usr/local/share/examples/horizon-eda  WWWDIR=/usr/local/www/horizon-eda ETCDIR=/usr/local/etc/horizon-eda
--End SUB_LIST--

---Begin make.conf---
USE_PACKAGE_DEPENDS=yes
BATCH=yes
WRKDIRPREFIX=/wrkdirs
PORTSDIR=/usr/ports
PACKAGES=/packages
DISTDIR=/distfiles
PACKAGE_BUILDING=yes
PACKAGE_BUILDING_FLAVORS=yes
#### /usr/local/etc/poudriere.d/make.conf ####
# XXX: We really need this but cannot use it while 'make checksum' does not
# try the next mirror on checksum failure.  It currently retries the same
# failed mirror and then fails rather then trying another.  It *does*
# try the next if the size is mismatched though.
#MASTER_SITE_FREEBSD=yes
# Build ALLOW_MAKE_JOBS_PACKAGES with 2 jobs
MAKE_JOBS_NUMBER=2
#### /usr/ports/Mk/Scripts/ports_env.sh ####
_CCVERSION_921dbbb2=FreeBSD clang version 11.0.1 (git_at_github.com:llvm/llvm-project.git llvmorg-11.0.1-0-g43ff75f2c3fe) Target: x86_64-unknown-freebsd13.0 Thread model: posix InstalledDir: /usr/bin
_ALTCCVERSION_921dbbb2=none
_CXXINTERNAL_acaad9ca=FreeBSD clang version 11.0.1 (git_at_github.com:llvm/llvm-project.git llvmorg-11.0.1-0-g43ff75f2c3fe) Target: x86_64-unknown-freebsd13.0 Thread model: posix InstalledDir: /usr/bin "/usr/bin/ld" "--eh-frame-hdr" "-dynamic-linker" "/libexec/ld-elf.so.1" "--hash-style=both" "--enable-new-dtags" "-o" "a.out" "/usr/lib/crt1.o" "/usr/lib/crti.o" "/usr/lib/crtbegin.o" "-L/usr/lib" "/dev/null" "-lc++" "-lm" "-lgcc" "--as-needed" "-lgcc_s" "--no-as-needed" "-lc" "-lgcc" "--as-needed" "-lgcc_s" "--no-as-needed" "/usr/lib/crtend.o" "/usr/lib/crtn.o"
CC_OUTPUT_921dbbb2_58173849=yes
CC_OUTPUT_921dbbb2_9bdba57c=yes
CC_OUTPUT_921dbbb2_6a4fe7f5=yes
CC_OUTPUT_921dbbb2_6bcac02b=yes
CC_OUTPUT_921dbbb2_67d20829=yes
CC_OUTPUT_921dbbb2_bfa62e83=yes
CC_OUTPUT_921dbbb2_f0b4d593=yes
CC_OUTPUT_921dbbb2_308abb44=yes
CC_OUTPUT_921dbbb2_f00456e5=yes
CC_OUTPUT_921dbbb2_65ad290d=yes
CC_OUTPUT_921dbbb2_f2776b26=yes
CC_OUTPUT_921dbbb2_b2657cc3=yes
CC_OUTPUT_921dbbb2_380987f7=yes
CC_OUTPUT_921dbbb2_160933ec=yes
CC_OUTPUT_921dbbb2_fb62803b=yes
_OBJC_CCVERSION_921dbbb2=FreeBSD clang version 11.0.1 (git_at_github.com:llvm/llvm-project.git llvmorg-11.0.1-0-g43ff75f2c3fe) Target: x86_64-unknown-freebsd13.0 Thread model: posix InstalledDir: /usr/bin
_OBJC_ALTCCVERSION_921dbbb2=none
ARCH=amd64
OPSYS=FreeBSD
_OSRELEASE=13.0-RELEASE-p5
OSREL=13.0
OSVERSION=1300139
PYTHONBASE=/usr/local
HAVE_COMPAT_IA32_KERN=YES
CONFIGURE_MAX_CMD_LEN=524288
HAVE_PORTS_ENV=1
#### Misc Poudriere ####
GID=0
UID=0
DISABLE_MAKE_JOBS=poudriere
---End make.conf---
--Resource limits--
cpu time               (seconds, -t)  unlimited
file size           (512-blocks, -f)  unlimited
data seg size           (kbytes, -d)  33554432
stack size              (kbytes, -s)  524288
core file size      (512-blocks, -c)  unlimited
max memory size         (kbytes, -m)  unlimited
locked memory           (kbytes, -l)  unlimited
max user processes              (-u)  89999
open files                      (-n)  1024
virtual mem size        (kbytes, -v)  unlimited
swap limit              (kbytes, -w)  unlimited
socket buffer size       (bytes, -b)  unlimited
pseudo-terminals                (-p)  unlimited
kqueues                         (-k)  unlimited
umtx shared locks               (-o)  unlimited
--End resource limits--
=======================<phase: check-sanity   >============================
===>  License GPLv3 accepted by the user
===========================================================================
=======================<phase: pkg-depends    >============================
===>   horizon-eda-2.1.0_1 depends on file: /usr/local/sbin/pkg - not found
===>   Installing existing package /packages/All/pkg-1.17.4.pkg
[130amd64-default-job-02] Installing pkg-1.17.4...
[130amd64-default-job-02] Extracting pkg-1.17.4: .......... done
===>   horizon-eda-2.1.0_1 depends on file: /usr/local/sbin/pkg - found
===>   Returning to build of horizon-eda-2.1.0_1
===========================================================================
=======================<phase: fetch-depends  >============================
===========================================================================
=======================<phase: fetch          >============================
===>  License GPLv3 accepted by the user
===> Fetching all distfiles required by horizon-eda-2.1.0_1 for building
===========================================================================
=======================<phase: checksum       >============================
===>  License GPLv3 accepted by the user
===> Fetching all distfiles required by horizon-eda-2.1.0_1 for building
=> SHA256 Checksum OK for horizon-eda-horizon-v2.1.0_GH0.tar.gz.
===========================================================================
=======================<phase: extract-depends>============================
===========================================================================
=======================<phase: extract        >============================
===>  License GPLv3 accepted by the user
===> Fetching all distfiles required by horizon-eda-2.1.0_1 for building
===>  Extracting for horizon-eda-2.1.0_1
=> SHA256 Checksum OK for horizon-eda-horizon-v2.1.0_GH0.tar.gz.
===========================================================================
=======================<phase: patch-depends  >============================
===========================================================================
=======================<phase: patch          >============================
===>  Patching for horizon-eda-2.1.0_1
===========================================================================
=======================<phase: build-depends  >============================
===>   horizon-eda-2.1.0_1 depends on file: /usr/local/include/boost/optional.hpp - not found
===>   Installing existing package /packages/All/boost-libs-1.72.0_6.pkg
[130amd64-default-job-02] Installing boost-libs-1.72.0_6...
[130amd64-default-job-02] `-- Installing icu-70.1_1,1...
[130amd64-default-job-02] `-- Extracting icu-70.1_1,1: .......... done
[130amd64-default-job-02] Extracting boost-libs-1.72.0_6: .......... done
=====
Message from boost-libs-1.72.0_6:

--
You have built the Boost library with thread support.

Don't forget to add -pthread to your linker options when
linking your code.
===>   horizon-eda-2.1.0_1 depends on file: /usr/local/include/boost/optional.hpp - found
===>   Returning to build of horizon-eda-2.1.0_1
===>   horizon-eda-2.1.0_1 depends on package: cppzmq>0 - not found
===>   Installing existing package /packages/All/cppzmq-4.8.1.pkg
<snip>
 build/obj/src/util/str_util.o
 build/obj/src/pool/pool_manager.o
 build/obj/src/pool/unit.o
 build/obj/src/pool/symbol.o
 build/obj/src/pool/part.o
src/pool/part.cpp:320:25: warning: loop variable '[fl, st]' of type 'const std::__1::pair<const horizon::Part::Flag, horizon::Part::FlagState>' creates a copy from type 'const std::__1::pair<const horizon::Part::Flag, horizon::Part::FlagState>' [-Wrange-loop-construct]
        for (const auto [fl, st] : flags) {
                        ^
src/pool/part.cpp:320:14: note: use reference type 'const std::__1::pair<const horizon::Part::Flag, horizon::Part::FlagState> &' to prevent copying
        for (const auto [fl, st] : flags) {
             ^~~~~~~~~~~~~~~~~~~~~
                        &
1 warning generated.
 build/obj/src/common/common.o
 build/obj/src/common/junction.o
 build/obj/src/common/junction_util.o
 build/obj/src/common/line.o
 build/obj/src/common/arc.o
 build/obj/src/common/layer_provider.o
 build/obj/src/pool/gate.o
 build/obj/src/block/net.o
 build/obj/src/block/bus.o
 build/obj/src/block/block.o
 build/obj/src/pool/entity.o
 build/obj/src/block/component.o
 build/obj/src/block/bom.o
 build/obj/src/block/bom_export_settings.o
 build/obj/src/schematic/schematic.o
 build/obj/src/schematic/sheet.o
 build/obj/src/common/text.o
 build/obj/src/schematic/schematic_junction.o
 build/obj/src/schematic/line_net.o
 build/obj/src/schematic/net_label.o
 build/obj/src/schematic/bus_label.o
 build/obj/src/schematic/bus_ripper.o
 build/obj/src/schematic/schematic_symbol.o
 build/obj/src/schematic/power_symbol.o
 build/obj/src/schematic/schematic_rules.o
 build/obj/src/schematic/rule_single_pin_net.o
 build/obj/src/common/pdf_export_settings.o
 build/obj/src/pool/padstack.o
 build/obj/src/common/polygon.o
 build/obj/src/common/hole.o
 build/obj/src/common/shape.o
 build/obj/src/common/patch_type_names.o
 build/obj/src/pool/package.o
 build/obj/src/package/pad.o
 build/obj/src/package/package_rules.o
 build/obj/src/package/rule_package_checks.o
 build/obj/src/package/rule_clearance_package.o
 build/obj/src/board/board.o
 build/obj/src/board/board_package.o
 build/obj/src/board/track.o
 build/obj/src/board/airwire.o
 build/obj/src/board/via.o
 build/obj/src/board/plane.o
 build/obj/src/board/board_rules.o
 build/obj/src/board/rule_hole_size.o
 build/obj/src/board/rule_clearance_silk_exp_copper.o
 build/obj/src/board/rule_track_width.o
 build/obj/src/board/rule_clearance_copper.o
 build/obj/src/board/rule_parameters.o
 build/obj/src/board/rule_via.o
 build/obj/src/board/rule_clearance_copper_other.o
 build/obj/src/board/rule_plane.o
 build/obj/src/board/rule_diffpair.o
 build/obj/src/board/rule_preflight_checks.o
 build/obj/src/board/rule_clearance_copper_keepout.o
 build/obj/src/board/rule_layer_pair.o
 build/obj/src/board/rule_clearance_same_net.o
 build/obj/3rd_party/delaunator/delaunator.o
3rd_party/delaunator/delaunator.cpp:97:12: warning: unused variable 'dist2' [-Wunused-variable]
    double dist2 = Point::dist2(v0, v1);
           ^
3rd_party/delaunator/delaunator.cpp:123:12: warning: unused variable 'dist2' [-Wunused-variable]
    double dist2 = Point::dist2(v0, v1);
           ^
2 warnings generated.
 build/obj/src/board/airwires.o
 build/obj/src/board/fab_output_settings.o
 build/obj/src/board/board_hole.o
 build/obj/src/board/connection_line.o
 build/obj/src/board/step_export_settings.o
 build/obj/src/board/pnp_export_settings.o
 build/obj/src/board/pnp.o
 build/obj/src/board/board_decal.o
 build/obj/src/pool/pool.o
 build/obj/src/pool/ipool.o
 build/obj/src/pool/pool_info.o
 build/obj/src/util/placement.o
 build/obj/src/util/util.o
 build/obj/src/util/geom_util.o
 build/obj/src/util/csv.o
 build/obj/src/common/object_descr.o
 build/obj/src/block/net_class.o
 build/obj/src/project/project.o
 build/obj/src/util/version.o
 build/obj/src/rules/rules.o
 build/obj/src/rules/rule.o
 build/obj/src/rules/rule_descr.o
 build/obj/src/rules/rule_match.o
 build/obj/src/rules/rule_match_keepout.o
 build/obj/src/rules/rules_import_export.o
 build/obj/src/parameter/program.o
 build/obj/src/parameter/set.o
 build/obj/3rd_party/clipper/clipper.o
3rd_party/clipper/clipper.cpp:3210:14: warning: declaration shadows a local variable [-Wshadow]
    for (int i = 0; i < cnt; ++i)
             ^
3rd_party/clipper/clipper.cpp:3202:31: note: previous declaration is here
  for (PolyOutList::size_type i = 0; i < m_PolyOuts.size(); ++i)
                              ^
1 warning generated.
 build/obj/src/common/dimension.o
 build/obj/src/logger/logger.o
 build/obj/src/parameter/program_polygon.o
 build/obj/src/frame/frame.o
 build/obj/src/common/keepout.o
 build/obj/src/board/board_layers.o
 build/obj/src/pool/pool_parametric.o
 build/obj/src/board/included_board.o
 build/obj/src/board/board_panel.o
 build/obj/src/common/picture.o
 build/obj/src/util/picture_data.o
 build/obj/src/util/picture_load.o
 build/obj/src/pool/decal.o
 build/obj/src/symbol/symbol_rules.o
 build/obj/src/symbol/rule_symbol_checks.o
 build/obj/src/util/file_version.o
 build/obj/src/pool/project_pool.o
 build/obj/src/util/fs_util.o
 build/obj/src/common/grid_settings.o
python3 scripts/make_color_presets.py src/preferences/color_presets/Ancient_technology.board src/preferences/color_presets/Ancient_technology.schematic src/preferences/color_presets/Blueprint.board src/preferences/color_presets/Blueprint.schematic src/preferences/color_presets/Boring_day.board src/preferences/color_presets/Boring_day.schematic src/preferences/color_presets/Bright.board src/preferences/color_presets/Bright.schematic src/preferences/color_presets/Nostalgia.board src/preferences/color_presets/Nostalgia.schematic src/preferences/color_presets/Peltier_cooler.board src/preferences/color_presets/Peltier_cooler.schematic src/preferences/color_presets/Rust.board src/preferences/color_presets/Rust.schematic src/preferences/color_presets/Solarized.schematic src/preferences/color_presets/Venetian_Funk.board src/preferences/color_presets/Venetian_Funk.schematic > src/preferences/color_presets.json
 build/gen/resources.cpp
 build/obj/build/gen/resources.o
 build/gen/version_gen.cpp
 build/obj/build/gen/version_gen.o
 build/gen/help_texts.hpp
 build/gen/help_texts.cpp
 build/obj/build/gen/help_texts.o
 build/obj/3rd_party/router/router/pns_router.o
 build/obj/3rd_party/router/router/pns_item.o
 build/obj/3rd_party/router/router/pns_node.o
 build/obj/3rd_party/router/router/pns_solid.o
 build/obj/3rd_party/router/router/pns_optimizer.o
 build/obj/3rd_party/router/router/pns_topology.o
 build/obj/3rd_party/router/router/pns_walkaround.o
 build/obj/3rd_party/router/router/pns_utils.o
 build/obj/3rd_party/router/router/pns_algo_base.o
 build/obj/3rd_party/router/router/pns_diff_pair_placer.o
 build/obj/3rd_party/router/router/pns_diff_pair.o
 build/obj/3rd_party/router/router/pns_dp_meander_placer.o
 build/obj/3rd_party/router/router/pns_dragger.o
 build/obj/3rd_party/router/router/pns_itemset.o
 build/obj/3rd_party/router/router/pns_line_placer.o
 build/obj/3rd_party/router/router/pns_line.o
 build/obj/3rd_party/router/router/pns_via.o
 build/obj/3rd_party/router/router/pns_logger.o
 build/obj/3rd_party/router/router/pns_meander_placer_base.o
 build/obj/3rd_party/router/router/pns_meander_placer.o
 build/obj/3rd_party/router/router/pns_meander_skew_placer.o
 build/obj/3rd_party/router/router/pns_meander.o
 build/obj/3rd_party/router/router/pns_shove.o
 build/obj/3rd_party/router/router/pns_index.o
 build/obj/3rd_party/router/router/time_limit.o
 build/obj/3rd_party/router/router/pns_routing_settings.o
 build/obj/3rd_party/router/router/pns_sizes_settings.o
 build/obj/3rd_party/router/common/geometry/shape_line_chain.o
 build/obj/3rd_party/router/common/geometry/shape_arc.o
 build/obj/3rd_party/router/common/geometry/shape.o
 build/obj/3rd_party/router/common/geometry/shape_collisions.o
 build/obj/3rd_party/router/common/geometry/seg.o
 build/obj/3rd_party/router/common/geometry/geometry_utils.o
 build/obj/3rd_party/router/common/math/math_util.o
 build/obj/3rd_party/router/wx_compat.o
 build/obj/src/router/pns_horizon_iface.o
 build/obj/src/core/tools/tool_route_track_interactive.o
 build/obj/src/import_step/step_importer.o
src/import_step/step_importer.cpp:190:61: error: no member named 'Nodes' in 'Poly_Triangulation'
    const TColgp_Array1OfPnt &arrPolyNodes = triangulation->Nodes();
                                             ~~~~~~~~~~~~~  ^
src/import_step/step_importer.cpp:191:64: warning: 'Triangles' is deprecated: Deprecated method, Triangle() should be used instead [-Wdeprecated-declarations]
    const Poly_Array1OfTriangle &arrTriangles = triangulation->Triangles();
                                                               ^
/usr/local/include/OpenCASCADE/Poly_Triangulation.hxx:317:3: note: 'Triangles' has been explicitly marked deprecated here
  Standard_DEPRECATED("Deprecated method, Triangle() should be used instead")
  ^
/usr/local/include/OpenCASCADE/Standard_Macro.hxx:154:54: note: expanded from macro 'Standard_DEPRECATED'
  #define Standard_DEPRECATED(theMsg) __attribute__((deprecated(theMsg)))
                                                     ^
src/import_step/step_importer.cpp:192:65: error: no member named 'Normals' in 'Poly_Triangulation'
    const TShort_Array1OfShortReal &arrNormals = triangulation->Normals();
                                                 ~~~~~~~~~~~~~  ^
1 warning and 2 errors generated.
gmake[1]: *** [Makefile:1009: build/obj/src/import_step/step_importer.o] Error 1
gmake[1]: Leaving directory '/wrkdirs/usr/ports/cad/horizon-eda/work/horizon-2.1.0'
*** Error code 1

Stop.
make: stopped in /usr/ports/cad/horizon-eda
Received on Fri Nov 12 2021 - 05:35:46 UTC

Original text of this message