[package - 130releng-armv6-quarterly][shells/ast-ksh] Failed for ast-ksh-20141224_1 in stage

From: <pkg-fallout_at_FreeBSD.org>
Date: Mon, 31 May 2021 18:31:52 GMT
You are receiving this mail as a port that you maintain
is failing to build on the FreeBSD package build server.
Please investigate the failure and submit a PR to fix
build.

Maintainer:     saper_at_saper.info
Log URL:        http://beefy8.nyi.freebsd.org/data/130releng-armv6-quarterly/ec4bc9831585/logs/ast-ksh-20141224_1.log
Build URL:      http://beefy8.nyi.freebsd.org/build.html?mastername=130releng-armv6-quarterly&build=ec4bc9831585
Log:

=>> Building shells/ast-ksh
build started at Mon May 31 18:24:19 UTC 2021
port directory: /usr/ports/shells/ast-ksh
package name: ast-ksh-20141224_1
building for: FreeBSD 130releng-armv6-quarterly-job-14 13.0-RELEASE-p1 FreeBSD 13.0-RELEASE-p1 1300139 arm
maintained by: saper_at_saper.info
Makefile ident: 
Poudriere version: 3.2.8-8-gaf08dbda
Host OSVERSION: 1300121
Jail OSVERSION: 1300139
Job Id: 14




!!! Jail is newer than host. (Jail: 1300139, Host: 1300121) !!!
!!! This is not supported. !!!
!!! Host kernel must be same or newer than jail. !!!
!!! Expect build failures. !!!



---Begin Environment---
SHELL=/bin/csh
UNAME_p=armv6
UNAME_m=arm
ABI_FILE=/usr/lib/crt1.o
OSVERSION=1300139
UNAME_v=FreeBSD 13.0-RELEASE-p1 1300139
UNAME_r=13.0-RELEASE-p1
BLOCKSIZE=K
MAIL=/var/mail/root
MM_CHARSET=UTF-8
LANG=C.UTF-8
STATUS=1
HOME=/root
PATH=/sbin:/bin:/usr/sbin:/usr/bin:/usr/local/sbin:/usr/local/bin:/root/bin
LOCALBASE=/usr/local
QEMU_EMULATING=1
USER=root
LIBEXECPREFIX=/usr/local/libexec/poudriere
POUDRIERE_VERSION=3.2.8-8-gaf08dbda
MASTERMNT=/usr/local/poudriere/data/.m/130releng-armv6-quarterly/ref
POUDRIERE_BUILD_TYPE=bulk
PACKAGE_BUILDING=yes
SAVED_TERM=
PWD=/usr/local/poudriere/data/.m/130releng-armv6-quarterly/ref/.p/pool
P_PORTS_FEATURES=FLAVORS SELECTED_OPTIONS
MASTERNAME=130releng-armv6-quarterly
SCRIPTPREFIX=/usr/local/share/poudriere
OLDPWD=/usr/local/poudriere/data/.m/130releng-armv6-quarterly/ref/.p
SCRIPTPATH=/usr/local/share/poudriere/bulk.sh
POUDRIEREPATH=/usr/local/bin/poudriere
---End Environment---

---Begin Poudriere Port Flags/Env---
PORT_FLAGS=
PKGENV=
FLAVOR=
DEPENDS_ARGS=
MAKE_ARGS=
---End Poudriere Port Flags/Env---

---Begin OPTIONS List---
===> The following configuration options are available for ast-ksh-20141224_1:
     EXAMPLES=on: Build and/or install examples
     STATIC=off: Build static executables and/or libraries
===> Use 'make config' to modify these settings
---End OPTIONS List---

--MAINTAINER--
saper_at_saper.info
--End MAINTAINER--

--CONFIGURE_ARGS--

--End CONFIGURE_ARGS--

--CONFIGURE_ENV--
XDG_DATA_HOME=/wrkdirs/usr/ports/shells/ast-ksh/work  XDG_CONFIG_HOME=/wrkdirs/usr/ports/shells/ast-ksh/work  HOME=/wrkdirs/usr/ports/shells/ast-ksh/work TMPDIR="/tmp" PATH=/wrkdirs/usr/ports/shells/ast-ksh/work/.bin:/sbin:/bin:/usr/sbin:/usr/bin:/usr/local/sbin:/usr/local/bin:/root/bin SHELL=/bin/sh CONFIG_SHELL=/bin/sh
--End CONFIGURE_ENV--

--MAKE_ENV--
CCFLAGS="-Wno-unused-value -Wno-parentheses -Wno-logical-op-parentheses -O2 -pipe  -fstack-protector-strong -fno-strict-aliasing " XDG_DATA_HOME=/wrkdirs/usr/ports/shells/ast-ksh/work  XDG_CONFIG_HOME=/wrkdirs/usr/ports/shells/ast-ksh/work  HOME=/wrkdirs/usr/ports/shells/ast-ksh/work TMPDIR="/tmp" PATH=/wrkdirs/usr/ports/shells/ast-ksh/work/.bin:/sbin:/bin:/usr/sbin:/usr/bin:/usr/local/sbin:/usr/local/bin:/root/bin NO_PIE=yes MK_DEBUG_FILES=no MK_KERNEL_SYMBOLS=no SHELL=/bin/sh NO_LINT=YES PREFIX=/usr/local  LOCALBASE=/usr/local  CC="/nxb-bin/usr/bin/cc" CFLAGS="-O2 -pipe  -fstack-protector-strong -fno-strict-aliasing "  CPP="/nxb-bin/usr/bin/cpp" CPPFLAGS=""  LDFLAGS=" -lm -fstack-protector-strong " LIBS=""  CXX="/nxb-bin/usr/bin/c++" CXXFLAGS="-O2 -pipe -fstack-protector-strong -fno-strict-aliasing  "  MANPREFIX="/usr/local" BSD_INSTALL_PROGRAM="install  -s -m 555"  BSD_INSTALL_LIB="install  -s -m 0644"  BSD_INSTALL_SCRIPT="install  -m 555"  BSD_INSTALL_DATA="install  -m 0644"  BSD
 _INSTALL_MAN="install  -m 444"
--End MAKE_ENV--

--PLIST_SUB--
PORTEXAMPLES="" OSREL=13.0 PREFIX=%D LOCALBASE=/usr/local  RESETPREFIX=/usr/local LIB32DIR=lib DOCSDIR="share/doc/ast-ksh"  EXAMPLESDIR="share/examples/ast-ksh"  DATADIR="share/ast-ksh"  WWWDIR="www/ast-ksh"  ETCDIR="etc/ast-ksh"
--End PLIST_SUB--

--SUB_LIST--
PREFIX=/usr/local LOCALBASE=/usr/local  DATADIR=/usr/local/share/ast-ksh DOCSDIR=/usr/local/share/doc/ast-ksh EXAMPLESDIR=/usr/local/share/examples/ast-ksh  WWWDIR=/usr/local/www/ast-ksh ETCDIR=/usr/local/etc/ast-ksh
--End SUB_LIST--

---Begin make.conf---
.sinclude "/etc/make.nxb.conf"
USE_PACKAGE_DEPENDS=yes
BATCH=yes
WRKDIRPREFIX=/wrkdirs
PORTSDIR=/usr/ports
PACKAGES=/packages
DISTDIR=/distfiles
PACKAGE_BUILDING=yes
PACKAGE_BUILDING_FLAVORS=yes
MACHINE=arm
MACHINE_ARCH=armv6
ARCH=${MACHINE_ARCH}
#### /usr/local/etc/poudriere.d/make.conf ####
# XXX: We really need this but cannot use it while 'make checksum' does not
# try the next mirror on checksum failure.  It currently retries the same
# failed mirror and then fails rather then trying another.  It *does*
# try the next if the size is mismatched though.
#MASTER_SITE_FREEBSD=yes
# Build ALLOW_MAKE_JOBS_PACKAGES with 2 jobs
MAKE_JOBS_NUMBER=2
#### /usr/ports/Mk/Scripts/ports_env.sh ####
_CCVERSION_9d218390=FreeBSD clang version 11.0.1 (git_at_github.com:llvm/llvm-project.git llvmorg-11.0.1-0-g43ff75f2c3fe) Target: armv6-unknown-freebsd13.0-gnueabihf Thread model: posix InstalledDir: /nxb-bin/usr/bin
_ALTCCVERSION_9d218390=none
_CXXINTERNAL_9c45a5b1=FreeBSD clang version 11.0.1 (git_at_github.com:llvm/llvm-project.git llvmorg-11.0.1-0-g43ff75f2c3fe) Target: armv6-unknown-freebsd13.0-gnueabihf Thread model: posix InstalledDir: /nxb-bin/usr/bin "/nxb-bin/usr/bin/ld" "--eh-frame-hdr" "-dynamic-linker" "/libexec/ld-elf.so.1" "--hash-style=both" "--enable-new-dtags" "-o" "a.out" "/usr/lib/crt1.o" "/usr/lib/crti.o" "/usr/lib/crtbegin.o" "-L/usr/lib" "/dev/null" "-lc++" "-lm" "-lgcc" "--as-needed" "-lgcc_s" "--no-as-needed" "-lc" "-lgcc" "--as-needed" "-lgcc_s" "--no-as-needed" "/usr/lib/crtend.o" "/usr/lib/crtn.o"
CC_OUTPUT_9d218390_58173849=yes
CC_OUTPUT_9d218390_9bdba57c=yes
CC_OUTPUT_9d218390_6a4fe7f5=yes
CC_OUTPUT_9d218390_6bcac02b=yes
CC_OUTPUT_9d218390_67d20829=yes
CC_OUTPUT_9d218390_bfa62e83=yes
CC_OUTPUT_9d218390_f0b4d593=yes
CC_OUTPUT_9d218390_308abb44=yes
CC_OUTPUT_9d218390_f00456e5=yes
CC_OUTPUT_9d218390_65ad290d=yes
CC_OUTPUT_9d218390_f2776b26=yes
CC_OUTPUT_9d218390_b2657cc3=yes
CC_OUTPUT_9d218390_380987f7=yes
CC_OUTPUT_9d218390_160933ec=yes
CC_OUTPUT_9d218390_fb62803b=yes
_OBJC_CCVERSION_9d218390=FreeBSD clang version 11.0.1 (git_at_github.com:llvm/llvm-project.git llvmorg-11.0.1-0-g43ff75f2c3fe) Target: armv6-unknown-freebsd13.0-gnueabihf Thread model: posix InstalledDir: /nxb-bin/usr/bin
_OBJC_ALTCCVERSION_9d218390=none
ARCH=armv6
OPSYS=FreeBSD
_OSRELEASE=13.0-RELEASE-p1
OSREL=13.0
OSVERSION=1300139
PYTHONBASE=/usr/local
CONFIGURE_MAX_CMD_LEN=524288
HAVE_PORTS_ENV=1
#### Misc Poudriere ####
GID=0
UID=0
DISABLE_MAKE_JOBS=poudriere
---End make.conf---
---Begin make.nxb.conf---
CC=/nxb-bin/usr/bin/cc
CPP=/nxb-bin/usr/bin/cpp
CXX=/nxb-bin/usr/bin/c++
NM=/nxb-bin/usr/bin/nm
LD=/nxb-bin/usr/bin/ld
OBJCOPY=/nxb-bin/usr/bin/objcopy
SIZE=/nxb-bin/usr/bin/size
STRIPBIN=/nxb-bin/usr/bin/strip
SED=/nxb-bin/usr/bin/sed
RANLIB=/nxb-bin/usr/bin/ranlib
YACC=/nxb-bin/usr/bin/yacc
MAKE=/nxb-bin/usr/bin/make
STRINGS=/nxb-bin/usr/bin/strings
AWK=/nxb-bin/usr/bin/awk
FLEX=/nxb-bin/usr/bin/flex
---End make.nxb.conf---
--Resource limits--
cpu time               (seconds, -t)  unlimited
file size           (512-blocks, -f)  unlimited
data seg size           (kbytes, -d)  33554432
stack size              (kbytes, -s)  524288
core file size      (512-blocks, -c)  unlimited
max memory size         (kbytes, -m)  unlimited
locked memory           (kbytes, -l)  unlimited
max user processes              (-u)  89999
open files                      (-n)  1024
virtual mem size        (kbytes, -v)  unlimited
swap limit              (kbytes, -w)  unlimited
socket buffer size       (bytes, -b)  unlimited
pseudo-terminals                (-p)  unlimited
kqueues                         (-k)  unlimited
umtx shared locks               (-o)  unlimited
--End resource limits--
=======================<phase: check-sanity   >============================
===>  License EPL accepted by the user
===========================================================================
=======================<phase: pkg-depends    >============================
===>   ast-ksh-20141224_1 depends on file: /usr/local/sbin/pkg - not found
===>   Installing existing package /packages/All/pkg-1.16.3.txz
[130releng-armv6-quarterly-job-14] Installing pkg-1.16.3...
[130releng-armv6-quarterly-job-14] Extracting pkg-1.16.3: .......... done
===>   ast-ksh-20141224_1 depends on file: /usr/local/sbin/pkg - found
===>   Returning to build of ast-ksh-20141224_1
===========================================================================
=======================<phase: fetch-depends  >============================
===========================================================================
=======================<phase: fetch          >============================
===>  License EPL accepted by the user
===> Fetching all distfiles required by ast-ksh-20141224_1 for building
<snip>
+ /wrkdirs/usr/ports/shells/ast-ksh/work/ast-ksh93v/arch/armv6-unknown-freebsd13.0-gnueabihf/lib/make/ppcc -o ANSI -o DOTI -o GNU -o DYNAMIC -o -dD -o -L -o 'EXPORT=ALL' /nxb-bin/usr/bin/cpp cc -Wno-unused-value -Wno-parentheses -Wno-logical-op-parentheses -O2 -pipe -fstack-protector-strong -fno-strict-aliasing -I-D/wrkdirs/usr/ports/shells/ast-ksh/work/ast-ksh93v/arch/armv6-unknown-freebsd13.0-gnueabihf/lib/probe/C/pp/1AB42E17fbincc -I. -I/wrkdirs/usr/ports/shells/ast-ksh/work/ast-ksh93v/src/cmd/ksh93/include -I../../../include/ast '-DUSAGE_LICENSE="[-author?David Korn <dgkorn_at_gmail.com>][-copyright?Copyright (c) 1982-2021 AT&T Intellectual Property][-license?http://www.eclipse.org/org/documents/epl-v10.html][--catalog?libshell]"' '-D_API_ast=20130625' '-DERROR_CONTEXT_T=Error_context_t' -D_PACKAGE_ast -DSHOPT_COMPLETE -DSHOPT_EDPREDICT -DSHOPT_MULTIBYTE -DKSHELL -DSHOPT_FIXEDARRAY -D_BLD_shell -DSHOPT_POLL -DSHOPT_BASH -DSHOPT_STATS -DSHOPT_NAMESPACE -DSHOPT_COSHELL -DSHOPT_PFSH -c
  /wrkdirs/usr/ports/shells/ast-ksh/work/ast-ksh93v/src/cmd/ksh93/edit/pcomplete.c
cpp: error: no such file or directory: 'pcomplete.i'
make [cmd/ksh93]: *** exit code 1 making pcomplete.o
+ /wrkdirs/usr/ports/shells/ast-ksh/work/ast-ksh93v/arch/armv6-unknown-freebsd13.0-gnueabihf/lib/make/ppcc -o ANSI -o DOTI -o GNU -o DYNAMIC -o -dD -o -L -o 'EXPORT=ALL' /nxb-bin/usr/bin/cpp cc -Wno-unused-value -Wno-parentheses -Wno-logical-op-parentheses -O2 -pipe -fstack-protector-strong -fno-strict-aliasing -I-D/wrkdirs/usr/ports/shells/ast-ksh/work/ast-ksh93v/arch/armv6-unknown-freebsd13.0-gnueabihf/lib/probe/C/pp/1AB42E17fbincc -I. -I/wrkdirs/usr/ports/shells/ast-ksh/work/ast-ksh93v/src/cmd/ksh93/include -I../../../include/ast '-DBASH_MACHTYPE="0-gnueabihf-unknown-armv6-unknown-freebsd13"' '-DBASH_HOSTTYPE="0-gnueabihf"' -DSHOPT_RAWONLY '-DUSAGE_LICENSE="[-author?David Korn <dgkorn_at_gmail.com>][-copyright?Copyright (c) 1982-2021 AT&T Intellectual Property][-license?http://www.eclipse.org/org/documents/epl-v10.html][--catalog?libshell]"' -DSHOPT_FIXEDARRAY -D_BLD_shell '-D_API_ast=20130625' '-DERROR_CONTEXT_T=Error_context_t' -D_PACKAGE_ast -DSHOPT_COMPLETE -DSHOPT_POLL -DSHOPT_B
 ASH -DKSHELL -DSHOPT_SUID_EXEC -DSHOPT_BRACEPAT -DSHOPT_STATS -DSHOPT_NAMESPACE -DSHOPT_COSHELL -DSHOPT_PFSH -c /wrkdirs/usr/ports/shells/ast-ksh/work/ast-ksh93v/src/cmd/ksh93/sh/bash.c
cpp: error: no such file or directory: 'bash.i'
make [cmd/ksh93]: *** exit code 1 making bash.o
+ /wrkdirs/usr/ports/shells/ast-ksh/work/ast-ksh93v/arch/armv6-unknown-freebsd13.0-gnueabihf/lib/make/ppcc -o ANSI -o DOTI -o GNU -o DYNAMIC -o -dD -o -L -o 'EXPORT=ALL' /nxb-bin/usr/bin/cpp cc -Wno-unused-value -Wno-parentheses -Wno-logical-op-parentheses -O2 -pipe -fstack-protector-strong -fno-strict-aliasing -I-D/wrkdirs/usr/ports/shells/ast-ksh/work/ast-ksh93v/arch/armv6-unknown-freebsd13.0-gnueabihf/lib/probe/C/pp/1AB42E17fbincc -c bash_pre_rc.c
cpp: error: no such file or directory: 'bash_pre_rc.i'
make [cmd/ksh93]: *** exit code 1 making bash_pre_rc.o
+ /wrkdirs/usr/ports/shells/ast-ksh/work/ast-ksh93v/arch/armv6-unknown-freebsd13.0-gnueabihf/lib/make/ppcc -o ANSI -o DOTI -o GNU -o DYNAMIC -o -dD -o -L -o 'EXPORT=ALL' /nxb-bin/usr/bin/cpp cc -Wno-unused-value -Wno-parentheses -Wno-logical-op-parentheses -O2 -pipe -fstack-protector-strong -fno-strict-aliasing -I-D/wrkdirs/usr/ports/shells/ast-ksh/work/ast-ksh93v/arch/armv6-unknown-freebsd13.0-gnueabihf/lib/probe/C/pp/1AB42E17fbincc -I. -I/wrkdirs/usr/ports/shells/ast-ksh/work/ast-ksh93v/src/cmd/ksh93/include -I../../../include/ast '-D_API_ast=20130625' -D_PACKAGE_ast '-DERROR_CONTEXT_T=Error_context_t' -DSHOPT_COMPLETE -DSHOPT_POLL -D_BLD_shell -DSHOPT_BASH -DSHOPT_FIXEDARRAY -DKSHELL -DSHOPT_MULTIBYTE -DSHOPT_STATS -DSHOPT_NAMESPACE -DSHOPT_COSHELL -DSHOPT_PFSH -c /wrkdirs/usr/ports/shells/ast-ksh/work/ast-ksh93v/src/cmd/ksh93/bltins/poll.c
cpp: error: no such file or directory: 'poll.i'
make [cmd/ksh93]: warning: don't know how to make .ALL : ksh : +ldll
make [cmd/ksh93]: warning: don't know how to make .ALL : ksh : +lcmd
make [cmd/ksh93]: *** exit code 1 making poll.o
+ /wrkdirs/usr/ports/shells/ast-ksh/work/ast-ksh93v/arch/armv6-unknown-freebsd13.0-gnueabihf/lib/make/ppcc -o ANSI -o DOTI -o GNU -o DYNAMIC -o -dD -o -L -o 'EXPORT=ALL' /nxb-bin/usr/bin/cpp cc -Wno-unused-value -Wno-parentheses -Wno-logical-op-parentheses -O2 -pipe -fstack-protector-strong -fno-strict-aliasing -I-D/wrkdirs/usr/ports/shells/ast-ksh/work/ast-ksh93v/arch/armv6-unknown-freebsd13.0-gnueabihf/lib/probe/C/pp/1AB42E17fbincc -I. -I/wrkdirs/usr/ports/shells/ast-ksh/work/ast-ksh93v/src/cmd/ksh93/include -I../../../include/ast -DSHOPT_BRACEPAT '-DSH_DICT="libshell"' '-D_API_ast=20130625' -D_PACKAGE_ast '-DERROR_CONTEXT_T=Error_context_t' -DSHOPT_STATS -DSHOPT_NAMESPACE -DSHOPT_COSHELL -DSHOPT_PFSH -DSHOPT_BASH -DSHOPT_FIXEDARRAY '-DUSAGE_LICENSE="[-author?David Korn <dgkorn_at_gmail.com>][-copyright?Copyright (c) 1982-2021 AT&T Intellectual Property][-license?http://www.eclipse.org/org/documents/epl-v10.html][--catalog?libshell]"' -c /wrkdirs/usr/ports/shells/ast-ksh/work/ast-ksh9
 3v/src/cmd/ksh93/sh/shcomp.c
cpp: error: no such file or directory: 'shcomp.i'
make [cmd/ksh93]: ".DLL.cc-O,-D_BLD_DLL,-fPIC", line 8: *** exit code 1 making shcomp.o
+ set -
cmd/ksh93/cc-O,-D_BLD_DLL,-fPIC:
make [cmd/ksh93/cc-O,-D_BLD_DLL,-fPIC]: warning: don't know how to make .DLL.ALL : shell : libshell.a : alarm.o : /wrkdirs/usr/ports/shells/ast-ksh/work/ast-ksh93v/src/cmd/ksh93/bltins/alarm.c : FEATURE/time
make [cmd/ksh93/cc-O,-D_BLD_DLL,-fPIC]: warning: don't know how to make .DLL.ALL : shell : libshell.a : alarm.o : /wrkdirs/usr/ports/shells/ast-ksh/work/ast-ksh93v/src/cmd/ksh93/bltins/alarm.c : /wrkdirs/usr/ports/shells/ast-ksh/work/ast-ksh93v/src/cmd/ksh93/include/builtins.h : FEATURE/dynamic
make [cmd/ksh93/cc-O,-D_BLD_DLL,-fPIC]: warning: don't know how to make .DLL.ALL : shell : libshell.a : alarm.o : /wrkdirs/usr/ports/shells/ast-ksh/work/ast-ksh93v/src/cmd/ksh93/bltins/alarm.c : /wrkdirs/usr/ports/shells/ast-ksh/work/ast-ksh93v/src/cmd/ksh93/include/defs.h : /wrkdirs/usr/ports/shells/ast-ksh/work/ast-ksh93v/src/cmd/ksh93/include/shell.h : shellapi.h : FEATURE/shellapi
make [cmd/ksh93/cc-O,-D_BLD_DLL,-fPIC]: warning: don't know how to make .DLL.ALL : shell : libshell.a : alarm.o : /wrkdirs/usr/ports/shells/ast-ksh/work/ast-ksh93v/src/cmd/ksh93/bltins/alarm.c : /wrkdirs/usr/ports/shells/ast-ksh/work/ast-ksh93v/src/cmd/ksh93/include/defs.h : /wrkdirs/usr/ports/shells/ast-ksh/work/ast-ksh93v/src/cmd/ksh93/include/shell.h : /wrkdirs/usr/ports/shells/ast-ksh/work/ast-ksh93v/src/cmd/ksh93/include/nval.h : nvapi.h : FEATURE/nvapi
make [cmd/ksh93/cc-O,-D_BLD_DLL,-fPIC]: warning: don't know how to make .DLL.ALL : shell : libshell.a : alarm.o : /wrkdirs/usr/ports/shells/ast-ksh/work/ast-ksh93v/src/cmd/ksh93/bltins/alarm.c : /wrkdirs/usr/ports/shells/ast-ksh/work/ast-ksh93v/src/cmd/ksh93/include/defs.h : /wrkdirs/usr/ports/shells/ast-ksh/work/ast-ksh93v/src/cmd/ksh93/include/fault.h : FEATURE/sigfeatures
make [cmd/ksh93/cc-O,-D_BLD_DLL,-fPIC]: warning: don't know how to make .DLL.ALL : shell : libshell.a : alarm.o : /wrkdirs/usr/ports/shells/ast-ksh/work/ast-ksh93v/src/cmd/ksh93/bltins/alarm.c : /wrkdirs/usr/ports/shells/ast-ksh/work/ast-ksh93v/src/cmd/ksh93/include/defs.h : FEATURE/externs
+ /wrkdirs/usr/ports/shells/ast-ksh/work/ast-ksh93v/arch/armv6-unknown-freebsd13.0-gnueabihf/lib/make/ppcc -o ANSI -o DOTI -o GNU -o DYNAMIC -o -dD -o -L -o 'EXPORT=ALL' /nxb-bin/usr/bin/cpp cc -O -D_BLD_DLL -fPIC -I-D/wrkdirs/usr/ports/shells/ast-ksh/work/ast-ksh93v/arch/armv6-unknown-freebsd13.0-gnueabihf/lib/probe/C/pp/1AB42E17fbincc -I. -I/wrkdirs/usr/ports/shells/ast-ksh/work/ast-ksh93v/src/cmd/ksh93/include -I/wrkdirs/usr/ports/shells/ast-ksh/work/ast-ksh93v/include/ast '-D_API_ast=20130625' -D_PACKAGE_ast -DSHOPT_COMPLETE -DSHOPT_POLL -D_BLD_shell -DSHOPT_BASH '-DERROR_CONTEXT_T=Error_context_t' -DSHOPT_FIXEDARRAY -DSHOPT_SUID_EXEC -DSHOPT_BRACEPAT -DSHOPT_STATS -DSHOPT_NAMESPACE -DSHOPT_COSHELL -DSHOPT_PFSH -c /wrkdirs/usr/ports/shells/ast-ksh/work/ast-ksh93v/src/cmd/ksh93/bltins/cd_pwd.c
cpp: error: no such file or directory: 'cd_pwd.i'
make [cmd/ksh93/cc-O,-D_BLD_DLL,-fPIC]: *** exit code 1 making cd_pwd.o
+ /wrkdirs/usr/ports/shells/ast-ksh/work/ast-ksh93v/arch/armv6-unknown-freebsd13.0-gnueabihf/lib/make/ppcc -o ANSI -o DOTI -o GNU -o DYNAMIC -o -dD -o -L -o 'EXPORT=ALL' /nxb-bin/usr/bin/cpp cc -O -D_BLD_DLL -fPIC -I-D/wrkdirs/usr/ports/shells/ast-ksh/work/ast-ksh93v/arch/armv6-unknown-freebsd13.0-gnueabihf/lib/probe/C/pp/1AB42E17fbincc -I. -I/wrkdirs/usr/ports/shells/ast-ksh/work/ast-ksh93v/src/cmd/ksh93/include -I/wrkdirs/usr/ports/shells/ast-ksh/work/ast-ksh93v/include/ast -DSHOPT_COMPLETE -DSHOPT_POLL -D_BLD_shell -DSHOPT_BASH '-D_API_ast=20130625' '-DERROR_CONTEXT_T=Error_context_t' -D_PACKAGE_ast -DSHOPT_STATS -DSHOPT_NAMESPACE -DSHOPT_COSHELL -DSHOPT_PFSH -DSHOPT_FIXEDARRAY -c /wrkdirs/usr/ports/shells/ast-ksh/work/ast-ksh93v/src/cmd/ksh93/bltins/cflow.c
cpp: error: no such file or directory: 'cflow.i'
make [cmd/ksh93/cc-O,-D_BLD_DLL,-fPIC]: *** exit code 1 making cflow.o
+ /wrkdirs/usr/ports/shells/ast-ksh/work/ast-ksh93v/arch/armv6-unknown-freebsd13.0-gnueabihf/lib/make/ppcc -o ANSI -o DOTI -o GNU -o DYNAMIC -o -dD -o -L -o 'EXPORT=ALL' /nxb-bin/usr/bin/cpp cc -O -D_BLD_DLL -fPIC -I-D/wrkdirs/usr/ports/shells/ast-ksh/work/ast-ksh93v/arch/armv6-unknown-freebsd13.0-gnueabihf/lib/probe/C/pp/1AB42E17fbincc -I. -I/wrkdirs/usr/ports/shells/ast-ksh/work/ast-ksh93v/src/cmd/ksh93/include -I/wrkdirs/usr/ports/shells/ast-ksh/work/ast-ksh93v/include/ast -DSHOPT_STATS -DSHOPT_NAMESPACE -DSHOPT_COSHELL -DSHOPT_PFSH -DSHOPT_BASH -D_BLD_shell '-D_API_ast=20130625' -D_PACKAGE_ast '-DERROR_CONTEXT_T=Error_context_t' -DSHOPT_FIXEDARRAY -c /wrkdirs/usr/ports/shells/ast-ksh/work/ast-ksh93v/src/cmd/ksh93/sh/deparse.c
cpp: error: no such file or directory: 'deparse.i'
make [cmd/ksh93/cc-O,-D_BLD_DLL,-fPIC]: *** exit code 1 making deparse.o
+ /wrkdirs/usr/ports/shells/ast-ksh/work/ast-ksh93v/arch/armv6-unknown-freebsd13.0-gnueabihf/lib/make/ppcc -o ANSI -o DOTI -o GNU -o DYNAMIC -o -dD -o -L -o 'EXPORT=ALL' /nxb-bin/usr/bin/cpp cc -O -D_BLD_DLL -fPIC -I-D/wrkdirs/usr/ports/shells/ast-ksh/work/ast-ksh93v/arch/armv6-unknown-freebsd13.0-gnueabihf/lib/probe/C/pp/1AB42E17fbincc -I. -I/wrkdirs/usr/ports/shells/ast-ksh/work/ast-ksh93v/src/cmd/ksh93/include -I/wrkdirs/usr/ports/shells/ast-ksh/work/ast-ksh93v/include/ast '-DERROR_CATALOG="libshell"' '-DUSAGE_LICENSE="[-author?David Korn <dgkorn_at_gmail.com>][-copyright?Copyright (c) 1982-2021 AT&T Intellectual Property][-license?http://www.eclipse.org/org/documents/epl-v10.html][--catalog?libshell]"' -DSHOPT_STATS -DSHOPT_NAMESPACE -DSHOPT_COSHELL -DSHOPT_PFSH -DSHOPT_BASH -D_BLD_shell '-D_API_ast=20130625' -D_PACKAGE_ast '-DERROR_CONTEXT_T=Error_context_t' -DSHOPT_FIXEDARRAY -c /wrkdirs/usr/ports/shells/ast-ksh/work/ast-ksh93v/src/cmd/ksh93/bltins/enum.c
cpp: error: no such file or directory: 'enum.i'
make [cmd/ksh93/cc-O,-D_BLD_DLL,-fPIC]: *** exit code 1 making enum.o
+ /wrkdirs/usr/ports/shells/ast-ksh/work/ast-ksh93v/arch/armv6-unknown-freebsd13.0-gnueabihf/lib/make/ppcc -o ANSI -o DOTI -o GNU -o DYNAMIC -o -dD -o -L -o 'EXPORT=ALL' /nxb-bin/usr/bin/cpp cc -O -D_BLD_DLL -fPIC -I-D/wrkdirs/usr/ports/shells/ast-ksh/work/ast-ksh93v/arch/armv6-unknown-freebsd13.0-gnueabihf/lib/probe/C/pp/1AB42E17fbincc -I. -I/wrkdirs/usr/ports/shells/ast-ksh/work/ast-ksh93v/src/cmd/ksh93/include -I/wrkdirs/usr/ports/shells/ast-ksh/work/ast-ksh93v/include/ast -DSHOPT_NAMESPACE -DSHOPT_COMPLETE -DSHOPT_POLL -D_BLD_shell -DSHOPT_BASH '-D_API_ast=20130625' '-DERROR_CONTEXT_T=Error_context_t' -D_PACKAGE_ast -DSHOPT_STATS -DSHOPT_COSHELL -DSHOPT_PFSH -DSHOPT_FIXEDARRAY -c /wrkdirs/usr/ports/shells/ast-ksh/work/ast-ksh93v/src/cmd/ksh93/bltins/getopts.c
cpp: error: no such file or directory: 'getopts.i'
make [cmd/ksh93/cc-O,-D_BLD_DLL,-fPIC]: warning: don't know how to make .DLL.ALL : shell : libshell.a : hist.o : /wrkdirs/usr/ports/shells/ast-ksh/work/ast-ksh93v/src/cmd/ksh93/bltins/hist.c : /wrkdirs/usr/ports/shells/ast-ksh/work/ast-ksh93v/src/cmd/ksh93/include/edit.h : FEATURE/locale
make [cmd/ksh93/cc-O,-D_BLD_DLL,-fPIC]: *** exit code 1 making getopts.o
+ /wrkdirs/usr/ports/shells/ast-ksh/work/ast-ksh93v/arch/armv6-unknown-freebsd13.0-gnueabihf/lib/make/ppcc -o ANSI -o DOTI -o GNU -o DYNAMIC -o -dD -o -L -o 'EXPORT=ALL' /nxb-bin/usr/bin/cpp cc -O -D_BLD_DLL -fPIC -I-D/wrkdirs/usr/ports/shells/ast-ksh/work/ast-ksh93v/arch/armv6-unknown-freebsd13.0-gnueabihf/lib/probe/C/pp/1AB42E17fbincc -I. -I/wrkdirs/usr/ports/shells/ast-ksh/work/ast-ksh93v/src/cmd/ksh93/include -I/wrkdirs/usr/ports/shells/ast-ksh/work/ast-ksh93v/include/ast -DSHOPT_COMPLETE -DSHOPT_EDPREDICT -DSHOPT_MULTIBYTE -DKSHELL -DSHOPT_POLL -D_BLD_shell -DSHOPT_BASH '-D_API_ast=20130625' '-DERROR_CONTEXT_T=Error_context_t' -D_PACKAGE_ast -DSHOPT_FIXEDARRAY -DSHOPT_STATS -DSHOPT_NAMESPACE -DSHOPT_COSHELL -DSHOPT_PFSH -c /wrkdirs/usr/ports/shells/ast-ksh/work/ast-ksh93v/src/cmd/ksh93/bltins/hist.c
cpp: error: no such file or directory: 'hist.i'
make [cmd/ksh93/cc-O,-D_BLD_DLL,-fPIC]: *** exit code 1 making hist.o
+ /wrkdirs/usr/ports/shells/ast-ksh/work/ast-ksh93v/arch/armv6-unknown-freebsd13.0-gnueabihf/lib/make/ppcc -o ANSI -o DOTI -o GNU -o DYNAMIC -o -dD -o -L -o 'EXPORT=ALL' /nxb-bin/usr/bin/cpp cc -O -D_BLD_DLL -fPIC -I-D/wrkdirs/usr/ports/shells/ast-ksh/work/ast-ksh93v/arch/armv6-unknown-freebsd13.0-gnueabihf/lib/probe/C/pp/1AB42E17fbincc -I. -I/wrkdirs/usr/ports/shells/ast-ksh/work/ast-ksh93v/src/cmd/ksh93/include -I/wrkdirs/usr/ports/shells/ast-ksh/work/ast-ksh93v/include/ast '-D_API_ast=20130625' -D_PACKAGE_ast '-DERROR_CONTEXT_T=Error_context_t' -DSHOPT_COSHELL -DSHOPT_COMPLETE -DSHOPT_POLL -D_BLD_shell -DSHOPT_BASH -DSHOPT_FIXEDARRAY -DKSHELL -DSHOPT_SUID_EXEC -DSHOPT_BRACEPAT -DSHOPT_STATS -DSHOPT_NAMESPACE -DSHOPT_PFSH -c /wrkdirs/usr/ports/shells/ast-ksh/work/ast-ksh93v/src/cmd/ksh93/bltins/misc.c
cpp: error: no such file or directory: 'misc.i'
make [cmd/ksh93/cc-O,-D_BLD_DLL,-fPIC]: *** exit code 1 making misc.o
+ /wrkdirs/usr/ports/shells/ast-ksh/work/ast-ksh93v/arch/armv6-unknown-freebsd13.0-gnueabihf/lib/make/ppcc -o ANSI -o DOTI -o GNU -o DYNAMIC -o -dD -o -L -o 'EXPORT=ALL' /nxb-bin/usr/bin/cpp cc -O -D_BLD_DLL -fPIC -I-D/wrkdirs/usr/ports/shells/ast-ksh/work/ast-ksh93v/arch/armv6-unknown-freebsd13.0-gnueabihf/lib/probe/C/pp/1AB42E17fbincc -I. -I/wrkdirs/usr/ports/shells/ast-ksh/work/ast-ksh93v/src/cmd/ksh93/include -I/wrkdirs/usr/ports/shells/ast-ksh/work/ast-ksh93v/include/ast -DSHOPT_MULTIBYTE '-D_API_ast=20130625' '-DERROR_CONTEXT_T=Error_context_t' -D_PACKAGE_ast -DSHOPT_STATS -DSHOPT_NAMESPACE -DSHOPT_COSHELL -DSHOPT_PFSH -DSHOPT_BASH -D_BLD_shell -DSHOPT_FIXEDARRAY -DSHOPT_COMPLETE -DSHOPT_POLL -DKSHELL -c /wrkdirs/usr/ports/shells/ast-ksh/work/ast-ksh93v/src/cmd/ksh93/bltins/print.c
cpp: error: no such file or directory: 'print.i'
make [cmd/ksh93/cc-O,-D_BLD_DLL,-fPIC]: *** exit code 1 making print.o
+ /wrkdirs/usr/ports/shells/ast-ksh/work/ast-ksh93v/arch/armv6-unknown-freebsd13.0-gnueabihf/lib/make/ppcc -o ANSI -o DOTI -o GNU -o DYNAMIC -o -dD -o -L -o 'EXPORT=ALL' /nxb-bin/usr/bin/cpp cc -O -D_BLD_DLL -fPIC -I-D/wrkdirs/usr/ports/shells/ast-ksh/work/ast-ksh93v/arch/armv6-unknown-freebsd13.0-gnueabihf/lib/probe/C/pp/1AB42E17fbincc -I. -I/wrkdirs/usr/ports/shells/ast-ksh/work/ast-ksh93v/src/cmd/ksh93/include -I/wrkdirs/usr/ports/shells/ast-ksh/work/ast-ksh93v/include/ast -DSHOPT_MULTIBYTE -DSHOPT_COMPLETE -DSHOPT_EDPREDICT -DKSHELL '-D_API_ast=20130625' '-DERROR_CONTEXT_T=Error_context_t' -D_PACKAGE_ast -DSHOPT_POLL -D_BLD_shell -DSHOPT_BASH -DSHOPT_FIXEDARRAY -DSHOPT_STATS -DSHOPT_NAMESPACE -DSHOPT_COSHELL -DSHOPT_PFSH -c /wrkdirs/usr/ports/shells/ast-ksh/work/ast-ksh93v/src/cmd/ksh93/bltins/read.c
make [cmd/ksh93/cc-O,-D_BLD_DLL,-fPIC]: warning: don't know how to make .DLL.ALL : shell : libshell.a : sleep.o : /wrkdirs/usr/ports/shells/ast-ksh/work/ast-ksh93v/src/cmd/ksh93/bltins/sleep.c : FEATURE/poll
cpp: error: no such file or directory: 'read.i'
make [cmd/ksh93/cc-O,-D_BLD_DLL,-fPIC]: *** exit code 1 making read.o
+ /wrkdirs/usr/ports/shells/ast-ksh/work/ast-ksh93v/arch/armv6-unknown-freebsd13.0-gnueabihf/lib/make/ppcc -o ANSI -o DOTI -o GNU -o DYNAMIC -o -dD -o -L -o 'EXPORT=ALL' /nxb-bin/usr/bin/cpp cc -O -D_BLD_DLL -fPIC -I-D/wrkdirs/usr/ports/shells/ast-ksh/work/ast-ksh93v/arch/armv6-unknown-freebsd13.0-gnueabihf/lib/probe/C/pp/1AB42E17fbincc -I. -I/wrkdirs/usr/ports/shells/ast-ksh/work/ast-ksh93v/src/cmd/ksh93/include -I/wrkdirs/usr/ports/shells/ast-ksh/work/ast-ksh93v/include/ast -DSHOPT_COMPLETE -DSHOPT_POLL -D_BLD_shell -DSHOPT_BASH '-D_API_ast=20130625' '-DERROR_CONTEXT_T=Error_context_t' -D_PACKAGE_ast -DSHOPT_COSHELL -DSHOPT_STATS -DSHOPT_NAMESPACE -DSHOPT_PFSH -DSHOPT_FIXEDARRAY -c /wrkdirs/usr/ports/shells/ast-ksh/work/ast-ksh93v/src/cmd/ksh93/bltins/trap.c
cpp: error: no such file or directory: 'trap.i'
make [cmd/ksh93/cc-O,-D_BLD_DLL,-fPIC]: *** exit code 1 making trap.o
+ /wrkdirs/usr/ports/shells/ast-ksh/work/ast-ksh93v/arch/armv6-unknown-freebsd13.0-gnueabihf/lib/make/ppcc -o ANSI -o DOTI -o GNU -o DYNAMIC -o -dD -o -L -o 'EXPORT=ALL' /nxb-bin/usr/bin/cpp cc -O -D_BLD_DLL -fPIC -I-D/wrkdirs/usr/ports/shells/ast-ksh/work/ast-ksh93v/arch/armv6-unknown-freebsd13.0-gnueabihf/lib/probe/C/pp/1AB42E17fbincc -I. -I/wrkdirs/usr/ports/shells/ast-ksh/work/ast-ksh93v/src/cmd/ksh93/include -I/wrkdirs/usr/ports/shells/ast-ksh/work/ast-ksh93v/include/ast -DSHOPT_FIXEDARRAY -D_BLD_shell '-D_API_ast=20130625' '-DERROR_CONTEXT_T=Error_context_t' -D_PACKAGE_ast -DSHOPT_COMPLETE -DSHOPT_POLL -DSHOPT_BASH -DSHOPT_STATS -DSHOPT_NAMESPACE -DSHOPT_COSHELL -DSHOPT_PFSH -c /wrkdirs/usr/ports/shells/ast-ksh/work/ast-ksh93v/src/cmd/ksh93/bltins/ulimit.c
cpp: error: no such file or directory: 'ulimit.i'
make [cmd/ksh93/cc-O,-D_BLD_DLL,-fPIC]: *** exit code 1 making ulimit.o
+ /wrkdirs/usr/ports/shells/ast-ksh/work/ast-ksh93v/arch/armv6-unknown-freebsd13.0-gnueabihf/lib/make/ppcc -o ANSI -o DOTI -o GNU -o DYNAMIC -o -dD -o -L -o 'EXPORT=ALL' /nxb-bin/usr/bin/cpp cc -O -D_BLD_DLL -fPIC -I-D/wrkdirs/usr/ports/shells/ast-ksh/work/ast-ksh93v/arch/armv6-unknown-freebsd13.0-gnueabihf/lib/probe/C/pp/1AB42E17fbincc -I. -I/wrkdirs/usr/ports/shells/ast-ksh/work/ast-ksh93v/src/cmd/ksh93/include -I/wrkdirs/usr/ports/shells/ast-ksh/work/ast-ksh93v/include/ast -DSHOPT_COMPLETE -DSHOPT_POLL -D_BLD_shell -DSHOPT_BASH '-D_API_ast=20130625' '-DERROR_CONTEXT_T=Error_context_t' -D_PACKAGE_ast -DSHOPT_FIXEDARRAY -c /wrkdirs/usr/ports/shells/ast-ksh/work/ast-ksh93v/src/cmd/ksh93/bltins/umask.c
cpp: error: no such file or directory: 'umask.i'
make [cmd/ksh93/cc-O,-D_BLD_DLL,-fPIC]: *** exit code 1 making umask.o
+ /wrkdirs/usr/ports/shells/ast-ksh/work/ast-ksh93v/arch/armv6-unknown-freebsd13.0-gnueabihf/lib/make/ppcc -o ANSI -o DOTI -o GNU -o DYNAMIC -o -dD -o -L -o 'EXPORT=ALL' /nxb-bin/usr/bin/cpp cc -O -D_BLD_DLL -fPIC -I-D/wrkdirs/usr/ports/shells/ast-ksh/work/ast-ksh93v/arch/armv6-unknown-freebsd13.0-gnueabihf/lib/probe/C/pp/1AB42E17fbincc -I. -I/wrkdirs/usr/ports/shells/ast-ksh/work/ast-ksh93v/src/cmd/ksh93/include -I/wrkdirs/usr/ports/shells/ast-ksh/work/ast-ksh93v/include/ast -DSHOPT_COMPLETE -DSHOPT_POLL -D_BLD_shell -DSHOPT_BASH '-D_API_ast=20130625' '-DERROR_CONTEXT_T=Error_context_t' -D_PACKAGE_ast -DSHOPT_KIA -DSHOPT_MULTIBYTE -DSHOPT_SUID_EXEC -DSHOPT_BRACEPAT -DSHOPT_STATS -DSHOPT_NAMESPACE -DSHOPT_COSHELL -DSHOPT_PFSH -DSHOPT_FIXEDARRAY -c /wrkdirs/usr/ports/shells/ast-ksh/work/ast-ksh93v/src/cmd/ksh93/bltins/whence.c
make [cmd/ksh93/cc-O,-D_BLD_DLL,-fPIC]: warning: don't know how to make .DLL.ALL : shell : libshell.a : main.o : /wrkdirs/usr/ports/shells/ast-ksh/work/ast-ksh93v/src/cmd/ksh93/sh/main.c : FEATURE/execargs
make [cmd/ksh93/cc-O,-D_BLD_DLL,-fPIC]: warning: don't know how to make .DLL.ALL : shell : libshell.a : main.o : /wrkdirs/usr/ports/shells/ast-ksh/work/ast-ksh93v/src/cmd/ksh93/sh/main.c : FEATURE/pstat
cpp: error: no such file or directory: 'whence.i'
make [cmd/ksh93/cc-O,-D_BLD_DLL,-fPIC]: *** exit code 1 making whence.o
+ /wrkdirs/usr/ports/shells/ast-ksh/work/ast-ksh93v/arch/armv6-unknown-freebsd13.0-gnueabihf/lib/make/ppcc -o ANSI -o DOTI -o GNU -o DYNAMIC -o -dD -o -L -o 'EXPORT=ALL' /nxb-bin/usr/bin/cpp cc -O -D_BLD_DLL -fPIC -I-D/wrkdirs/usr/ports/shells/ast-ksh/work/ast-ksh93v/arch/armv6-unknown-freebsd13.0-gnueabihf/lib/probe/C/pp/1AB42E17fbincc -I. -I/wrkdirs/usr/ports/shells/ast-ksh/work/ast-ksh93v/src/cmd/ksh93/include -I/wrkdirs/usr/ports/shells/ast-ksh/work/ast-ksh93v/include/ast -DSHOPT_NAMESPACE -DSHOPT_COSHELL -DSHOPT_SUID_EXEC -DSHOPT_BRACEPAT -D_BLD_shell -DSHOPT_STATS -DSHOPT_PFSH -DSHOPT_BASH '-D_API_ast=20130625' -D_PACKAGE_ast '-DERROR_CONTEXT_T=Error_context_t' -DSHOPT_FIXEDARRAY -DSHOPT_COMPLETE -DSHOPT_POLL -c /wrkdirs/usr/ports/shells/ast-ksh/work/ast-ksh93v/src/cmd/ksh93/sh/nvdisc.c
cpp: error: no such file or directory: 'nvdisc.i'
make [cmd/ksh93/cc-O,-D_BLD_DLL,-fPIC]: *** exit code 1 making nvdisc.o
+ /wrkdirs/usr/ports/shells/ast-ksh/work/ast-ksh93v/arch/armv6-unknown-freebsd13.0-gnueabihf/lib/make/ppcc -o ANSI -o DOTI -o GNU -o DYNAMIC -o -dD -o -L -o 'EXPORT=ALL' /nxb-bin/usr/bin/cpp cc -O -D_BLD_DLL -fPIC -I-D/wrkdirs/usr/ports/shells/ast-ksh/work/ast-ksh93v/arch/armv6-unknown-freebsd13.0-gnueabihf/lib/probe/C/pp/1AB42E17fbincc -I. -I/wrkdirs/usr/ports/shells/ast-ksh/work/ast-ksh93v/src/cmd/ksh93/include -I/wrkdirs/usr/ports/shells/ast-ksh/work/ast-ksh93v/include/ast -DSHOPT_FIXEDARRAY -DSHOPT_NAMESPACE '-DUSAGE_LICENSE="[-author?David Korn <dgkorn_at_gmail.com>][-copyright?Copyright (c) 1982-2021 AT&T Intellectual Property][-license?http://www.eclipse.org/org/documents/epl-v10.html][--catalog?libshell]"' '-D_API_ast=20130625' '-DERROR_CONTEXT_T=Error_context_t' -D_PACKAGE_ast -DSHOPT_BASH -D_BLD_shell -DKSHELL -DSHOPT_STATS -DSHOPT_COSHELL -DSHOPT_PFSH -c /wrkdirs/usr/ports/shells/ast-ksh/work/ast-ksh93v/src/cmd/ksh93/sh/nvtype.c
cpp: error: no such file or directory: 'nvtype.i'
make [cmd/ksh93/cc-O,-D_BLD_DLL,-fPIC]: *** exit code 1 making nvtype.o
+ /wrkdirs/usr/ports/shells/ast-ksh/work/ast-ksh93v/arch/armv6-unknown-freebsd13.0-gnueabihf/lib/make/ppcc -o ANSI -o DOTI -o GNU -o DYNAMIC -o -dD -o -L -o 'EXPORT=ALL' /nxb-bin/usr/bin/cpp cc -O -D_BLD_DLL -fPIC -I-D/wrkdirs/usr/ports/shells/ast-ksh/work/ast-ksh93v/arch/armv6-unknown-freebsd13.0-gnueabihf/lib/probe/C/pp/1AB42E17fbincc -I. -I/wrkdirs/usr/ports/shells/ast-ksh/work/ast-ksh93v/src/cmd/ksh93/include -I/wrkdirs/usr/ports/shells/ast-ksh/work/ast-ksh93v/include/ast -DSHOPT_FIXEDARRAY -DSHOPT_COMPLETE -DSHOPT_POLL -D_BLD_shell -DSHOPT_BASH '-D_API_ast=20130625' '-DERROR_CONTEXT_T=Error_context_t' -D_PACKAGE_ast -DSHOPT_STATS -DSHOPT_NAMESPACE -DSHOPT_COSHELL -DSHOPT_PFSH -DSHOPT_MULTIBYTE -c /wrkdirs/usr/ports/shells/ast-ksh/work/ast-ksh93v/src/cmd/ksh93/sh/arith.c
cpp: error: no such file or directory: 'arith.i'
make [cmd/ksh93/cc-O,-D_BLD_DLL,-fPIC]: *** exit code 1 making arith.o
+ /wrkdirs/usr/ports/shells/ast-ksh/work/ast-ksh93v/arch/armv6-unknown-freebsd13.0-gnueabihf/lib/make/ppcc -o ANSI -o DOTI -o GNU -o DYNAMIC -o -dD -o -L -o 'EXPORT=ALL' /nxb-bin/usr/bin/cpp cc -O -D_BLD_DLL -fPIC -I-D/wrkdirs/usr/ports/shells/ast-ksh/work/ast-ksh93v/arch/armv6-unknown-freebsd13.0-gnueabihf/lib/probe/C/pp/1AB42E17fbincc -I. -I/wrkdirs/usr/ports/shells/ast-ksh/work/ast-ksh93v/src/cmd/ksh93/include -I/wrkdirs/usr/ports/shells/ast-ksh/work/ast-ksh93v/include/ast -DSHOPT_FIXEDARRAY -D_BLD_shell '-D_API_ast=20130625' '-DERROR_CONTEXT_T=Error_context_t' -D_PACKAGE_ast -DSHOPT_STATS -DSHOPT_NAMESPACE -DSHOPT_COSHELL -DSHOPT_PFSH -DSHOPT_BASH -c /wrkdirs/usr/ports/shells/ast-ksh/work/ast-ksh93v/src/cmd/ksh93/sh/array.c
cpp: error: no such file or directory: 'array.i'
make [cmd/ksh93/cc-O,-D_BLD_DLL,-fPIC]: *** exit code 1 making array.o
+ /wrkdirs/usr/ports/shells/ast-ksh/work/ast-ksh93v/arch/armv6-unknown-freebsd13.0-gnueabihf/lib/make/ppcc -o ANSI -o DOTI -o GNU -o DYNAMIC -o -dD -o -L -o 'EXPORT=ALL' /nxb-bin/usr/bin/cpp cc -O -D_BLD_DLL -fPIC -I-D/wrkdirs/usr/ports/shells/ast-ksh/work/ast-ksh93v/arch/armv6-unknown-freebsd13.0-gnueabihf/lib/probe/C/pp/1AB42E17fbincc -I. -I/wrkdirs/usr/ports/shells/ast-ksh/work/ast-ksh93v/src/cmd/ksh93/include -I/wrkdirs/usr/ports/shells/ast-ksh/work/ast-ksh93v/include/ast -DSHOPT_COMPLETE -DSHOPT_MULTIBYTE '-D_API_ast=20130625' '-DERROR_CONTEXT_T=Error_context_t' -D_PACKAGE_ast -DSHOPT_EDPREDICT -DKSHELL -DSHOPT_BASH -D_BLD_shell -DSHOPT_SUID_EXEC -DSHOPT_BRACEPAT -DSHOPT_STATS -DSHOPT_NAMESPACE -DSHOPT_COSHELL -DSHOPT_PFSH -DSHOPT_FIXEDARRAY -c /wrkdirs/usr/ports/shells/ast-ksh/work/ast-ksh93v/src/cmd/ksh93/edit/completion.c
cpp: error: no such file or directory: 'completion.i'
make [cmd/ksh93/cc-O,-D_BLD_DLL,-fPIC]: *** exit code 1 making completion.o
+ /wrkdirs/usr/ports/shells/ast-ksh/work/ast-ksh93v/arch/armv6-unknown-freebsd13.0-gnueabihf/lib/make/ppcc -o ANSI -o DOTI -o GNU -o DYNAMIC -o -dD -o -L -o 'EXPORT=ALL' /nxb-bin/usr/bin/cpp cc -O -D_BLD_DLL -fPIC -I-D/wrkdirs/usr/ports/shells/ast-ksh/work/ast-ksh93v/arch/armv6-unknown-freebsd13.0-gnueabihf/lib/probe/C/pp/1AB42E17fbincc -I. -I/wrkdirs/usr/ports/shells/ast-ksh/work/ast-ksh93v/src/cmd/ksh93/include -I/wrkdirs/usr/ports/shells/ast-ksh/work/ast-ksh93v/include/ast -DSHOPT_COMPLETE -DSHOPT_EDPREDICT -DSHOPT_MULTIBYTE -DKSHELL -DSHOPT_KIA '-D_API_ast=20130625' -D_PACKAGE_ast -D_BLD_shell '-DERROR_CONTEXT_T=Error_context_t' -DSHOPT_COSHELL -DSHOPT_STATS -DSHOPT_NAMESPACE -DSHOPT_PFSH -DSHOPT_BASH -DSHOPT_FIXEDARRAY -c /wrkdirs/usr/ports/shells/ast-ksh/work/ast-ksh93v/src/cmd/ksh93/sh/defs.c
make [cmd/ksh93/cc-O,-D_BLD_DLL,-fPIC]: warning: don't know how to make .DLL.ALL : shell : libshell.a : edit.o : /wrkdirs/usr/ports/shells/ast-ksh/work/ast-ksh93v/src/cmd/ksh93/edit/edit.c : FEATURE/cmds
cpp: error: no such file or directory: 'defs.i'
make [cmd/ksh93/cc-O,-D_BLD_DLL,-fPIC]: *** exit code 1 making defs.o
+ /wrkdirs/usr/ports/shells/ast-ksh/work/ast-ksh93v/arch/armv6-unknown-freebsd13.0-gnueabihf/lib/make/ppcc -o ANSI -o DOTI -o GNU -o DYNAMIC -o -dD -o -L -o 'EXPORT=ALL' /nxb-bin/usr/bin/cpp cc -O -D_BLD_DLL -fPIC -I-D/wrkdirs/usr/ports/shells/ast-ksh/work/ast-ksh93v/arch/armv6-unknown-freebsd13.0-gnueabihf/lib/probe/C/pp/1AB42E17fbincc -I. -I/wrkdirs/usr/ports/shells/ast-ksh/work/ast-ksh93v/src/cmd/ksh93/include -I/wrkdirs/usr/ports/shells/ast-ksh/work/ast-ksh93v/include/ast -DSHOPT_BASH -DSHOPT_BRACEPAT -DSHOPT_SUID_EXEC -D_BLD_shell -DSHOPT_STATS -DSHOPT_NAMESPACE -DSHOPT_COSHELL -DSHOPT_PFSH '-D_API_ast=20130625' -D_PACKAGE_ast '-DERROR_CONTEXT_T=Error_context_t' -DSHOPT_FIXEDARRAY -DKSHELL -c /wrkdirs/usr/ports/shells/ast-ksh/work/ast-ksh93v/src/cmd/ksh93/sh/expand.c
cpp: error: no such file or directory: 'expand.i'
make [cmd/ksh93/cc-O,-D_BLD_DLL,-fPIC]: *** exit code 1 making expand.o
+ /wrkdirs/usr/ports/shells/ast-ksh/work/ast-ksh93v/arch/armv6-unknown-freebsd13.0-gnueabihf/lib/make/ppcc -o ANSI -o DOTI -o GNU -o DYNAMIC -o -dD -o -L -o 'EXPORT=ALL' /nxb-bin/usr/bin/cpp cc -O -D_BLD_DLL -fPIC -I-D/wrkdirs/usr/ports/shells/ast-ksh/work/ast-ksh93v/arch/armv6-unknown-freebsd13.0-gnueabihf/lib/probe/C/pp/1AB42E17fbincc -I. -I/wrkdirs/usr/ports/shells/ast-ksh/work/ast-ksh93v/src/cmd/ksh93/include -I/wrkdirs/usr/ports/shells/ast-ksh/work/ast-ksh93v/include/ast '-DUSAGE_LICENSE="[-author?David Korn <dgkorn_at_gmail.com>][-copyright?Copyright (c) 1982-2021 AT&T Intellectual Property][-license?http://www.eclipse.org/org/documents/epl-v10.html][--catalog?libshell]"' '-D_API_ast=20130625' '-DERROR_CONTEXT_T=Error_context_t' -D_PACKAGE_ast -DSHOPT_COMPLETE -DSHOPT_POLL -D_BLD_shell -DSHOPT_BASH -DKSHELL -DSHOPT_STATS -DSHOPT_NAMESPACE -DSHOPT_COSHELL -DSHOPT_PFSH -DSHOPT_FIXEDARRAY -c /wrkdirs/usr/ports/shells/ast-ksh/work/ast-ksh93v/src/cmd/ksh93/bltins/regress.c
cpp: error: no such file or directory: 'regress.i'
make [cmd/ksh93/cc-O,-D_BLD_DLL,-fPIC]: *** exit code 1 making regress.o
+ /wrkdirs/usr/ports/shells/ast-ksh/work/ast-ksh93v/arch/armv6-unknown-freebsd13.0-gnueabihf/lib/make/ppcc -o ANSI -o DOTI -o GNU -o DYNAMIC -o -dD -o -L -o 'EXPORT=ALL' /nxb-bin/usr/bin/cpp cc -O -D_BLD_DLL -fPIC -I-D/wrkdirs/usr/ports/shells/ast-ksh/work/ast-ksh93v/arch/armv6-unknown-freebsd13.0-gnueabihf/lib/probe/C/pp/1AB42E17fbincc -I. -I/wrkdirs/usr/ports/shells/ast-ksh/work/ast-ksh93v/src/cmd/ksh93/include -I/wrkdirs/usr/ports/shells/ast-ksh/work/ast-ksh93v/include/ast -DSHOPT_KIA '-D_API_ast=20130625' -D_PACKAGE_ast -DSHOPT_COMPLETE -DSHOPT_POLL -D_BLD_shell -DSHOPT_BASH '-DERROR_CONTEXT_T=Error_context_t' -DSHOPT_SUID_EXEC -DSHOPT_BRACEPAT -DSHOPT_STATS -DSHOPT_NAMESPACE -DSHOPT_COSHELL -DSHOPT_PFSH -DSHOPT_FIXEDARRAY -DSHOPT_MULTIBYTE -DKSHELL -c /wrkdirs/usr/ports/shells/ast-ksh/work/ast-ksh93v/src/cmd/ksh93/sh/fault.c
cpp: error: no such file or directory: 'fault.i'
make [cmd/ksh93/cc-O,-D_BLD_DLL,-fPIC]: *** exit code 1 making fault.o
+ /wrkdirs/usr/ports/shells/ast-ksh/work/ast-ksh93v/arch/armv6-unknown-freebsd13.0-gnueabihf/lib/make/ppcc -o ANSI -o DOTI -o GNU -o DYNAMIC -o -dD -o -L -o 'EXPORT=ALL' /nxb-bin/usr/bin/cpp cc -O -D_BLD_DLL -fPIC -I-D/wrkdirs/usr/ports/shells/ast-ksh/work/ast-ksh93v/arch/armv6-unknown-freebsd13.0-gnueabihf/lib/probe/C/pp/1AB42E17fbincc -I/wrkdirs/usr/ports/shells/ast-ksh/work/ast-ksh93v/src/cmd/ksh93/include -I/wrkdirs/usr/ports/shells/ast-ksh/work/ast-ksh93v/include/ast -DSHOPT_MULTIBYTE '-D_API_ast=20130625' -D_PACKAGE_ast '-DERROR_CONTEXT_T=Error_context_t' -c /wrkdirs/usr/ports/shells/ast-ksh/work/ast-ksh93v/src/cmd/ksh93/sh/fcin.c
cpp: error: no such file or directory: 'fcin.i'
make [cmd/ksh93/cc-O,-D_BLD_DLL,-fPIC]: *** exit code 1 making fcin.o
+ /wrkdirs/usr/ports/shells/ast-ksh/work/ast-ksh93v/arch/armv6-unknown-freebsd13.0-gnueabihf/lib/make/ppcc -o ANSI -o DOTI -o GNU -o DYNAMIC -o -dD -o -L -o 'EXPORT=ALL' /nxb-bin/usr/bin/cpp cc -O -D_BLD_DLL -fPIC -I-D/wrkdirs/usr/ports/shells/ast-ksh/work/ast-ksh93v/arch/armv6-unknown-freebsd13.0-gnueabihf/lib/probe/C/pp/1AB42E17fbincc -I. -I/wrkdirs/usr/ports/shells/ast-ksh/work/ast-ksh93v/src/cmd/ksh93/include -I/wrkdirs/usr/ports/shells/ast-ksh/work/ast-ksh93v/include/ast -DSHOPT_COSHELL -DSHOPT_SUID_EXEC -DSHOPT_BRACEPAT -D_BLD_shell -DSHOPT_STATS -DSHOPT_NAMESPACE -DSHOPT_PFSH -DSHOPT_BASH '-D_API_ast=20130625' -D_PACKAGE_ast '-DERROR_CONTEXT_T=Error_context_t' -DSHOPT_FIXEDARRAY -DKSHELL -c /wrkdirs/usr/ports/shells/ast-ksh/work/ast-ksh93v/src/cmd/ksh93/sh/jobs.c
cpp: error: no such file or directory: 'jobs.i'
make [cmd/ksh93/cc-O,-D_BLD_DLL,-fPIC]: *** exit code 1 making jobs.o
+ /wrkdirs/usr/ports/shells/ast-ksh/work/ast-ksh93v/arch/armv6-unknown-freebsd13.0-gnueabihf/lib/make/ppcc -o ANSI -o DOTI -o GNU -o DYNAMIC -o -dD -o -L -o 'EXPORT=ALL' /nxb-bin/usr/bin/cpp cc -O -D_BLD_DLL -fPIC -I-D/wrkdirs/usr/ports/shells/ast-ksh/work/ast-ksh93v/arch/armv6-unknown-freebsd13.0-gnueabihf/lib/probe/C/pp/1AB42E17fbincc -I. -I/wrkdirs/usr/ports/shells/ast-ksh/work/ast-ksh93v/src/cmd/ksh93/include -I/wrkdirs/usr/ports/shells/ast-ksh/work/ast-ksh93v/include/ast -DSHOPT_BASH -DSHOPT_MULTIBYTE -DSHOPT_KIA '-D_API_ast=20130625' -D_PACKAGE_ast -D_BLD_shell '-DERROR_CONTEXT_T=Error_context_t' -DKSHELL -DSHOPT_STATS -DSHOPT_NAMESPACE -DSHOPT_COSHELL -DSHOPT_PFSH -DSHOPT_FIXEDARRAY -c /wrkdirs/usr/ports/shells/ast-ksh/work/ast-ksh93v/src/cmd/ksh93/sh/lex.c
cpp: error: no such file or directory: 'lex.i'
make [cmd/ksh93/cc-O,-D_BLD_DLL,-fPIC]: *** exit code 1 making lex.o
+ /wrkdirs/usr/ports/shells/ast-ksh/work/ast-ksh93v/arch/armv6-unknown-freebsd13.0-gnueabihf/lib/make/ppcc -o ANSI -o DOTI -o GNU -o DYNAMIC -o -dD -o -L -o 'EXPORT=ALL' /nxb-bin/usr/bin/cpp cc -O -D_BLD_DLL -fPIC -I-D/wrkdirs/usr/ports/shells/ast-ksh/work/ast-ksh93v/arch/armv6-unknown-freebsd13.0-gnueabihf/lib/probe/C/pp/1AB42E17fbincc -I. -I/wrkdirs/usr/ports/shells/ast-ksh/work/ast-ksh93v/src/cmd/ksh93/include -I/wrkdirs/usr/ports/shells/ast-ksh/work/ast-ksh93v/include/ast -DSHOPT_BRACEPAT -DKSHELL -DSHOPT_COSHELL -DSHOPT_OPTIMIZE -DSHOPT_FIXEDARRAY -DSHOPT_BASH -DSHOPT_FILESCAN '-D_API_ast=20130625' '-DERROR_CONTEXT_T=Error_context_t' -D_PACKAGE_ast -DSHOPT_MULTIBYTE -DSHOPT_STATS -DSHOPT_NAMESPACE -DSHOPT_PFSH -D_BLD_shell -DSHOPT_SUID_EXEC -DSHOPT_KIA -c /wrkdirs/usr/ports/shells/ast-ksh/work/ast-ksh93v/src/cmd/ksh93/sh/macro.c
cpp: error: no such file or directory: 'macro.i'
make [cmd/ksh93/cc-O,-D_BLD_DLL,-fPIC]: *** exit code 1 making macro.o
+ /wrkdirs/usr/ports/shells/ast-ksh/work/ast-ksh93v/arch/armv6-unknown-freebsd13.0-gnueabihf/lib/make/ppcc -o ANSI -o DOTI -o GNU -o DYNAMIC -o -dD -o -L -o 'EXPORT=ALL' /nxb-bin/usr/bin/cpp cc -O -D_BLD_DLL -fPIC -I-D/wrkdirs/usr/ports/shells/ast-ksh/work/ast-ksh93v/arch/armv6-unknown-freebsd13.0-gnueabihf/lib/probe/C/pp/1AB42E17fbincc -I. -I/wrkdirs/usr/ports/shells/ast-ksh/work/ast-ksh93v/src/cmd/ksh93/include -I/wrkdirs/usr/ports/shells/ast-ksh/work/ast-ksh93v/include/ast -DSHOPT_FIXEDARRAY '-D_API_ast=20130625' '-DERROR_CONTEXT_T=Error_context_t' -D_PACKAGE_ast -DSHOPT_MULTIBYTE -D_BLD_shell -DSHOPT_STATS -DSHOPT_NAMESPACE -DSHOPT_COSHELL -DSHOPT_PFSH -DSHOPT_BASH -c /wrkdirs/usr/ports/shells/ast-ksh/work/ast-ksh93v/src/cmd/ksh93/sh/nvtree.c
cpp: error: no such file or directory: 'nvtree.i'
make [cmd/ksh93/cc-O,-D_BLD_DLL,-fPIC]: *** exit code 1 making nvtree.o
+ /wrkdirs/usr/ports/shells/ast-ksh/work/ast-ksh93v/arch/armv6-unknown-freebsd13.0-gnueabihf/lib/make/ppcc -o ANSI -o DOTI -o GNU -o DYNAMIC -o -dD -o -L -o 'EXPORT=ALL' /nxb-bin/usr/bin/cpp cc -O -D_BLD_DLL -fPIC -I-D/wrkdirs/usr/ports/shells/ast-ksh/work/ast-ksh93v/arch/armv6-unknown-freebsd13.0-gnueabihf/lib/probe/C/pp/1AB42E17fbincc -I. -I/wrkdirs/usr/ports/shells/ast-ksh/work/ast-ksh93v/src/cmd/ksh93/include -I/wrkdirs/usr/ports/shells/ast-ksh/work/ast-ksh93v/include/ast -DSHOPT_NAMESPACE -DSHOPT_BASH -DSHOPT_COSHELL -DSHOPT_SUID_EXEC -DSHOPT_BRACEPAT -D_BLD_shell -DSHOPT_STATS -DSHOPT_PFSH '-D_API_ast=20130625' -D_PACKAGE_ast '-DERROR_CONTEXT_T=Error_context_t' -DSHOPT_FIXEDARRAY -DSHOPT_KIA -DSHOPT_COMPLETE -DSHOPT_POLL -DSHOPT_MULTIBYTE -DKSHELL -c /wrkdirs/usr/ports/shells/ast-ksh/work/ast-ksh93v/src/cmd/ksh93/sh/parse.c
cpp: error: no such file or directory: 'parse.i'
make [cmd/ksh93/cc-O,-D_BLD_DLL,-fPIC]: *** exit code 1 making parse.o
+ /wrkdirs/usr/ports/shells/ast-ksh/work/ast-ksh93v/arch/armv6-unknown-freebsd13.0-gnueabihf/lib/make/ppcc -o ANSI -o DOTI -o GNU -o DYNAMIC -o -dD -o -L -o 'EXPORT=ALL' /nxb-bin/usr/bin/cpp cc -O -D_BLD_DLL -fPIC -I-D/wrkdirs/usr/ports/shells/ast-ksh/work/ast-ksh93v/arch/armv6-unknown-freebsd13.0-gnueabihf/lib/probe/C/pp/1AB42E17fbincc -I. -I/wrkdirs/usr/ports/shells/ast-ksh/work/ast-ksh93v/src/cmd/ksh93/include -I/wrkdirs/usr/ports/shells/ast-ksh/work/ast-ksh93v/include/ast -DSHOPT_MULTIBYTE '-D_API_ast=20130625' -D_PACKAGE_ast -DSHOPT_STATS -DSHOPT_NAMESPACE -DSHOPT_COSHELL -DSHOPT_PFSH -DSHOPT_BASH -D_BLD_shell '-DERROR_CONTEXT_T=Error_context_t' -DSHOPT_FIXEDARRAY -c /wrkdirs/usr/ports/shells/ast-ksh/work/ast-ksh93v/src/cmd/ksh93/sh/string.c
cpp: error: no such file or directory: 'string.i'
make [cmd/ksh93/cc-O,-D_BLD_DLL,-fPIC]: *** exit code 1 making string.o
+ /wrkdirs/usr/ports/shells/ast-ksh/work/ast-ksh93v/arch/armv6-unknown-freebsd13.0-gnueabihf/lib/make/ppcc -o ANSI -o DOTI -o GNU -o DYNAMIC -o -dD -o -L -o 'EXPORT=ALL' /nxb-bin/usr/bin/cpp cc -O -D_BLD_DLL -fPIC -I-D/wrkdirs/usr/ports/shells/ast-ksh/work/ast-ksh93v/arch/armv6-unknown-freebsd13.0-gnueabihf/lib/probe/C/pp/1AB42E17fbincc -I. -I/wrkdirs/usr/ports/shells/ast-ksh/work/ast-ksh93v/src/cmd/ksh93/include -I/wrkdirs/usr/ports/shells/ast-ksh/work/ast-ksh93v/include/ast -DSHOPT_COSHELL -DSHOPT_SUID_EXEC -DSHOPT_BRACEPAT -D_BLD_shell -DSHOPT_STATS -DSHOPT_NAMESPACE -DSHOPT_PFSH -DSHOPT_BASH '-D_API_ast=20130625' -D_PACKAGE_ast '-DERROR_CONTEXT_T=Error_context_t' -DSHOPT_FIXEDARRAY -DSHOPT_KIA -DSHOPT_MULTIBYTE -DKSHELL -c /wrkdirs/usr/ports/shells/ast-ksh/work/ast-ksh93v/src/cmd/ksh93/sh/subshell.c
cpp: error: no such file or directory: 'subshell.i'
make [cmd/ksh93/cc-O,-D_BLD_DLL,-fPIC]: *** exit code 1 making subshell.o
+ /wrkdirs/usr/ports/shells/ast-ksh/work/ast-ksh93v/arch/armv6-unknown-freebsd13.0-gnueabihf/lib/make/ppcc -o ANSI -o DOTI -o GNU -o DYNAMIC -o -dD -o -L -o 'EXPORT=ALL' /nxb-bin/usr/bin/cpp cc -O -D_BLD_DLL -fPIC -I-D/wrkdirs/usr/ports/shells/ast-ksh/work/ast-ksh93v/arch/armv6-unknown-freebsd13.0-gnueabihf/lib/probe/C/pp/1AB42E17fbincc -I. -I/wrkdirs/usr/ports/shells/ast-ksh/work/ast-ksh93v/src/cmd/ksh93/include -I/wrkdirs/usr/ports/shells/ast-ksh/work/ast-ksh93v/include/ast -DSHOPT_BASH -D_BLD_shell -DKSHELL '-D_API_ast=20130625' -D_PACKAGE_ast '-DERROR_CONTEXT_T=Error_context_t' -DSHOPT_SUID_EXEC -DSHOPT_BRACEPAT -DSHOPT_STATS -DSHOPT_NAMESPACE -DSHOPT_COSHELL -DSHOPT_PFSH -DSHOPT_FIXEDARRAY -c /wrkdirs/usr/ports/shells/ast-ksh/work/ast-ksh93v/src/cmd/ksh93/sh/tdump.c
cpp: error: no such file or directory: 'tdump.i'
make [cmd/ksh93/cc-O,-D_BLD_DLL,-fPIC]: *** exit code 1 making tdump.o
+ /wrkdirs/usr/ports/shells/ast-ksh/work/ast-ksh93v/arch/armv6-unknown-freebsd13.0-gnueabihf/lib/make/ppcc -o ANSI -o DOTI -o GNU -o DYNAMIC -o -dD -o -L -o 'EXPORT=ALL' /nxb-bin/usr/bin/cpp cc -O -D_BLD_DLL -fPIC -I-D/wrkdirs/usr/ports/shells/ast-ksh/work/ast-ksh93v/arch/armv6-unknown-freebsd13.0-gnueabihf/lib/probe/C/pp/1AB42E17fbincc -I. -I/wrkdirs/usr/ports/shells/ast-ksh/work/ast-ksh93v/src/cmd/ksh93/include -I/wrkdirs/usr/ports/shells/ast-ksh/work/ast-ksh93v/include/ast -DSHOPT_BASH -D_BLD_shell -DKSHELL '-D_API_ast=20130625' -D_PACKAGE_ast '-DERROR_CONTEXT_T=Error_context_t' -DSHOPT_SUID_EXEC -DSHOPT_BRACEPAT -DSHOPT_STATS -DSHOPT_NAMESPACE -DSHOPT_COSHELL -DSHOPT_PFSH -DSHOPT_FIXEDARRAY -c /wrkdirs/usr/ports/shells/ast-ksh/work/ast-ksh93v/src/cmd/ksh93/sh/trestore.c
cpp: error: no such file or directory: 'trestore.i'
make [cmd/ksh93/cc-O,-D_BLD_DLL,-fPIC]: *** exit code 1 making trestore.o
+ /wrkdirs/usr/ports/shells/ast-ksh/work/ast-ksh93v/arch/armv6-unknown-freebsd13.0-gnueabihf/lib/make/ppcc -o ANSI -o DOTI -o GNU -o DYNAMIC -o -dD -o -L -o 'EXPORT=ALL' /nxb-bin/usr/bin/cpp cc -O -D_BLD_DLL -fPIC -I-D/wrkdirs/usr/ports/shells/ast-ksh/work/ast-ksh93v/arch/armv6-unknown-freebsd13.0-gnueabihf/lib/probe/C/pp/1AB42E17fbincc -I. -I/wrkdirs/usr/ports/shells/ast-ksh/work/ast-ksh93v/src/cmd/ksh93/include -I/wrkdirs/usr/ports/shells/ast-ksh/work/ast-ksh93v/include/ast -DSHOPT_STATS -DSHOPT_NAMESPACE -DSHOPT_COSHELL -DSHOPT_PFSH -DSHOPT_BASH -D_BLD_shell '-D_API_ast=20130625' -D_PACKAGE_ast '-DERROR_CONTEXT_T=Error_context_t' -DSHOPT_FIXEDARRAY -c /wrkdirs/usr/ports/shells/ast-ksh/work/ast-ksh93v/src/cmd/ksh93/sh/waitevent.c
cpp: error: no such file or directory: 'waitevent.i'
make [cmd/ksh93/cc-O,-D_BLD_DLL,-fPIC]: *** exit code 1 making waitevent.o
+ /wrkdirs/usr/ports/shells/ast-ksh/work/ast-ksh93v/arch/armv6-unknown-freebsd13.0-gnueabihf/lib/make/ppcc -o ANSI -o DOTI -o GNU -o DYNAMIC -o -dD -o -L -o 'EXPORT=ALL' /nxb-bin/usr/bin/cpp cc -O -D_BLD_DLL -fPIC -I-D/wrkdirs/usr/ports/shells/ast-ksh/work/ast-ksh93v/arch/armv6-unknown-freebsd13.0-gnueabihf/lib/probe/C/pp/1AB42E17fbincc -I/wrkdirs/usr/ports/shells/ast-ksh/work/ast-ksh93v/src/cmd/ksh93/include -I/wrkdirs/usr/ports/shells/ast-ksh/work/ast-ksh93v/include/ast '-D_API_ast=20130625' -D_PACKAGE_ast '-DERROR_CONTEXT_T=Error_context_t' -c /wrkdirs/usr/ports/shells/ast-ksh/work/ast-ksh93v/src/cmd/ksh93/sh/env.c
cpp: error: no such file or directory: 'env.i'
make [cmd/ksh93/cc-O,-D_BLD_DLL,-fPIC]: *** exit code 1 making env.o
+ /wrkdirs/usr/ports/shells/ast-ksh/work/ast-ksh93v/arch/armv6-unknown-freebsd13.0-gnueabihf/lib/make/ppcc -o ANSI -o DOTI -o GNU -o DYNAMIC -o -dD -o -L -o 'EXPORT=ALL' /nxb-bin/usr/bin/cpp cc -O -D_BLD_DLL -fPIC -I-D/wrkdirs/usr/ports/shells/ast-ksh/work/ast-ksh93v/arch/armv6-unknown-freebsd13.0-gnueabihf/lib/probe/C/pp/1AB42E17fbincc -I. -I/wrkdirs/usr/ports/shells/ast-ksh/work/ast-ksh93v/src/cmd/ksh93/include -I/wrkdirs/usr/ports/shells/ast-ksh/work/ast-ksh93v/include/ast -DSHOPT_COMPLETE -DSHOPT_EDPREDICT -DSHOPT_MULTIBYTE -DKSHELL -DSHOPT_STATS -DSHOPT_NAMESPACE -DSHOPT_COSHELL -DSHOPT_PFSH -DSHOPT_BASH -D_BLD_shell '-D_API_ast=20130625' -D_PACKAGE_ast '-DERROR_CONTEXT_T=Error_context_t' -DSHOPT_FIXEDARRAY -c /wrkdirs/usr/ports/shells/ast-ksh/work/ast-ksh93v/src/cmd/ksh93/edit/hexpand.c
cpp: error: no such file or directory: 'hexpand.i'
make [cmd/ksh93/cc-O,-D_BLD_DLL,-fPIC]: *** exit code 1 making hexpand.o
+ /wrkdirs/usr/ports/shells/ast-ksh/work/ast-ksh93v/arch/armv6-unknown-freebsd13.0-gnueabihf/lib/make/ppcc -o ANSI -o DOTI -o GNU -o DYNAMIC -o -dD -o -L -o 'EXPORT=ALL' /nxb-bin/usr/bin/cpp cc -O -D_BLD_DLL -fPIC -I-D/wrkdirs/usr/ports/shells/ast-ksh/work/ast-ksh93v/arch/armv6-unknown-freebsd13.0-gnueabihf/lib/probe/C/pp/1AB42E17fbincc -I/wrkdirs/usr/ports/shells/ast-ksh/work/ast-ksh93v/src/cmd/ksh93/include -I/wrkdirs/usr/ports/shells/ast-ksh/work/ast-ksh93v/include/ast '-D_API_ast=20130625' '-DERROR_CONTEXT_T=Error_context_t' -D_PACKAGE_ast -c /wrkdirs/usr/ports/shells/ast-ksh/work/ast-ksh93v/src/cmd/ksh93/data/limits.c
make [cmd/ksh93/cc-O,-D_BLD_DLL,-fPIC]: warning: don't know how to make .DLL.ALL : shell : libshell.a : strdata.o : /wrkdirs/usr/ports/shells/ast-ksh/work/ast-ksh93v/src/cmd/ksh93/data/strdata.c : FEATURE/math
cpp: error: no such file or directory: 'limits.i'
make [cmd/ksh93/cc-O,-D_BLD_DLL,-fPIC]: *** exit code 1 making limits.o
+ /wrkdirs/usr/ports/shells/ast-ksh/work/ast-ksh93v/arch/armv6-unknown-freebsd13.0-gnueabihf/lib/make/ppcc -o ANSI -o DOTI -o GNU -o DYNAMIC -o -dD -o -L -o 'EXPORT=ALL' /nxb-bin/usr/bin/cpp cc -O -D_BLD_DLL -fPIC -I-D/wrkdirs/usr/ports/shells/ast-ksh/work/ast-ksh93v/arch/armv6-unknown-freebsd13.0-gnueabihf/lib/probe/C/pp/1AB42E17fbincc -I. -I/wrkdirs/usr/ports/shells/ast-ksh/work/ast-ksh93v/src/cmd/ksh93/include -I/wrkdirs/usr/ports/shells/ast-ksh/work/ast-ksh93v/include/ast '-DUSAGE_LICENSE="[-author?David Korn <dgkorn_at_gmail.com>][-copyright?Copyright (c) 1982-2021 AT&T Intellectual Property][-license?http://www.eclipse.org/org/documents/epl-v10.html][--catalog?libshell]"' -DSHOPT_STATS -DSHOPT_NAMESPACE -DSHOPT_COSHELL -DSHOPT_PFSH -DSHOPT_BASH -D_BLD_shell '-D_API_ast=20130625' -D_PACKAGE_ast '-DERROR_CONTEXT_T=Error_context_t' -DSHOPT_FIXEDARRAY -c /wrkdirs/usr/ports/shells/ast-ksh/work/ast-ksh93v/src/cmd/ksh93/data/testops.c
cpp: error: no such file or directory: 'testops.i'
make [cmd/ksh93/cc-O,-D_BLD_DLL,-fPIC]: *** exit code 1 making testops.o
+ /wrkdirs/usr/ports/shells/ast-ksh/work/ast-ksh93v/arch/armv6-unknown-freebsd13.0-gnueabihf/lib/make/ppcc -o ANSI -o DOTI -o GNU -o DYNAMIC -o -dD -o -L -o 'EXPORT=ALL' /nxb-bin/usr/bin/cpp cc -O -D_BLD_DLL -fPIC -I-D/wrkdirs/usr/ports/shells/ast-ksh/work/ast-ksh93v/arch/armv6-unknown-freebsd13.0-gnueabihf/lib/probe/C/pp/1AB42E17fbincc -I. -I/wrkdirs/usr/ports/shells/ast-ksh/work/ast-ksh93v/src/cmd/ksh93/include -I/wrkdirs/usr/ports/shells/ast-ksh/work/ast-ksh93v/include/ast -DSHOPT_NAMESPACE -DSHOPT_KIA -DSHOPT_MULTIBYTE '-D_API_ast=20130625' -D_PACKAGE_ast -D_BLD_shell '-DERROR_CONTEXT_T=Error_context_t' -DSHOPT_FIXEDARRAY -c /wrkdirs/usr/ports/shells/ast-ksh/work/ast-ksh93v/src/cmd/ksh93/data/keywords.c
cpp: error: no such file or directory: 'keywords.i'
make [cmd/ksh93/cc-O,-D_BLD_DLL,-fPIC]: *** exit code 1 making keywords.o
+ /wrkdirs/usr/ports/shells/ast-ksh/work/ast-ksh93v/arch/armv6-unknown-freebsd13.0-gnueabihf/lib/make/ppcc -o ANSI -o DOTI -o GNU -o DYNAMIC -o -dD -o -L -o 'EXPORT=ALL' /nxb-bin/usr/bin/cpp cc -O -D_BLD_DLL -fPIC -I-D/wrkdirs/usr/ports/shells/ast-ksh/work/ast-ksh93v/arch/armv6-unknown-freebsd13.0-gnueabihf/lib/probe/C/pp/1AB42E17fbincc -I. -I/wrkdirs/usr/ports/shells/ast-ksh/work/ast-ksh93v/src/cmd/ksh93/include -I/wrkdirs/usr/ports/shells/ast-ksh/work/ast-ksh93v/include/ast -DSHOPT_PFSH -DSHOPT_BASH -DSHOPT_FIXEDARRAY -D_BLD_shell '-D_API_ast=20130625' '-DERROR_CONTEXT_T=Error_context_t' -D_PACKAGE_ast -DSHOPT_STATS -DSHOPT_NAMESPACE -DSHOPT_COSHELL -c /wrkdirs/usr/ports/shells/ast-ksh/work/ast-ksh93v/src/cmd/ksh93/data/options.c
cpp: error: no such file or directory: 'options.i'
make [cmd/ksh93/cc-O,-D_BLD_DLL,-fPIC]: *** exit code 1 making options.o
+ /wrkdirs/usr/ports/shells/ast-ksh/work/ast-ksh93v/arch/armv6-unknown-freebsd13.0-gnueabihf/lib/make/ppcc -o ANSI -o DOTI -o GNU -o DYNAMIC -o -dD -o -L -o 'EXPORT=ALL' /nxb-bin/usr/bin/cpp cc -O -D_BLD_DLL -fPIC -I-D/wrkdirs/usr/ports/shells/ast-ksh/work/ast-ksh93v/arch/armv6-unknown-freebsd13.0-gnueabihf/lib/probe/C/pp/1AB42E17fbincc -I. -I/wrkdirs/usr/ports/shells/ast-ksh/work/ast-ksh93v/src/cmd/ksh93/include -I/wrkdirs/usr/ports/shells/ast-ksh/work/ast-ksh93v/include/ast -DSHOPT_STATS -DSHOPT_NAMESPACE -DSHOPT_COSHELL -DSHOPT_PFSH -DSHOPT_BASH -D_BLD_shell '-D_API_ast=20130625' -D_PACKAGE_ast '-DERROR_CONTEXT_T=Error_context_t' -DSHOPT_FIXEDARRAY -c /wrkdirs/usr/ports/shells/ast-ksh/work/ast-ksh93v/src/cmd/ksh93/data/signals.c
cpp: error: no such file or directory: 'signals.i'
make [cmd/ksh93/cc-O,-D_BLD_DLL,-fPIC]: *** exit code 1 making signals.o
+ /wrkdirs/usr/ports/shells/ast-ksh/work/ast-ksh93v/arch/armv6-unknown-freebsd13.0-gnueabihf/lib/make/ppcc -o ANSI -o DOTI -o GNU -o DYNAMIC -o -dD -o -L -o 'EXPORT=ALL' /nxb-bin/usr/bin/cpp cc -O -D_BLD_DLL -fPIC -I-D/wrkdirs/usr/ports/shells/ast-ksh/work/ast-ksh93v/arch/armv6-unknown-freebsd13.0-gnueabihf/lib/probe/C/pp/1AB42E17fbincc -I/wrkdirs/usr/ports/shells/ast-ksh/work/ast-ksh93v/src/cmd/ksh93/include -I/wrkdirs/usr/ports/shells/ast-ksh/work/ast-ksh93v/include/ast -DSHOPT_BRACEPAT -DSHOPT_NAMESPACE -DSHOPT_MULTIBYTE '-D_API_ast=20130625' -D_PACKAGE_ast '-DERROR_CONTEXT_T=Error_context_t' -c /wrkdirs/usr/ports/shells/ast-ksh/work/ast-ksh93v/src/cmd/ksh93/data/lexstates.c
cpp: error: no such file or directory: 'lexstates.i'
make [cmd/ksh93/cc-O,-D_BLD_DLL,-fPIC]: *** exit code 1 making lexstates.o
+ /wrkdirs/usr/ports/shells/ast-ksh/work/ast-ksh93v/arch/armv6-unknown-freebsd13.0-gnueabihf/lib/make/ppcc -o ANSI -o DOTI -o GNU -o DYNAMIC -o -dD -o -L -o 'EXPORT=ALL' /nxb-bin/usr/bin/cpp cc -O -D_BLD_DLL -fPIC -I-D/wrkdirs/usr/ports/shells/ast-ksh/work/ast-ksh93v/arch/armv6-unknown-freebsd13.0-gnueabihf/lib/probe/C/pp/1AB42E17fbincc -I. -I/wrkdirs/usr/ports/shells/ast-ksh/work/ast-ksh93v/src/cmd/ksh93/include -I/wrkdirs/usr/ports/shells/ast-ksh/work/ast-ksh93v/include/ast '-DUSAGE_LICENSE="[-author?David Korn <dgkorn_at_gmail.com>][-copyright?Copyright (c) 1982-2021 AT&T Intellectual Property][-license?http://www.eclipse.org/org/documents/epl-v10.html][--catalog?libshell]"' '-D_API_ast=20130625' '-DERROR_CONTEXT_T=Error_context_t' -D_PACKAGE_ast -DSHOPT_COMPLETE -DSHOPT_EDPREDICT -DSHOPT_MULTIBYTE -DKSHELL -DSHOPT_FIXEDARRAY -D_BLD_shell -DSHOPT_POLL -DSHOPT_BASH -DSHOPT_STATS -DSHOPT_NAMESPACE -DSHOPT_COSHELL -DSHOPT_PFSH -c /wrkdirs/usr/ports/shells/ast-ksh/work/ast-ksh93v/src/cmd
 /ksh93/edit/pcomplete.c
cpp: error: no such file or directory: 'pcomplete.i'
make [cmd/ksh93/cc-O,-D_BLD_DLL,-fPIC]: *** exit code 1 making pcomplete.o
+ /wrkdirs/usr/ports/shells/ast-ksh/work/ast-ksh93v/arch/armv6-unknown-freebsd13.0-gnueabihf/lib/make/ppcc -o ANSI -o DOTI -o GNU -o DYNAMIC -o -dD -o -L -o 'EXPORT=ALL' /nxb-bin/usr/bin/cpp cc -O -D_BLD_DLL -fPIC -I-D/wrkdirs/usr/ports/shells/ast-ksh/work/ast-ksh93v/arch/armv6-unknown-freebsd13.0-gnueabihf/lib/probe/C/pp/1AB42E17fbincc -I. -I/wrkdirs/usr/ports/shells/ast-ksh/work/ast-ksh93v/src/cmd/ksh93/include -I/wrkdirs/usr/ports/shells/ast-ksh/work/ast-ksh93v/include/ast '-DBASH_MACHTYPE="0-gnueabihf-unknown-armv6-unknown-freebsd13"' '-DBASH_HOSTTYPE="0-gnueabihf"' -DSHOPT_RAWONLY '-DUSAGE_LICENSE="[-author?David Korn <dgkorn_at_gmail.com>][-copyright?Copyright (c) 1982-2021 AT&T Intellectual Property][-license?http://www.eclipse.org/org/documents/epl-v10.html][--catalog?libshell]"' -DSHOPT_FIXEDARRAY -D_BLD_shell '-D_API_ast=20130625' '-DERROR_CONTEXT_T=Error_context_t' -D_PACKAGE_ast -DSHOPT_COMPLETE -DSHOPT_POLL -DSHOPT_BASH -DKSHELL -DSHOPT_SUID_EXEC -DSHOPT_BRACEPAT -DSHOPT_ST
 ATS -DSHOPT_NAMESPACE -DSHOPT_COSHELL -DSHOPT_PFSH -c /wrkdirs/usr/ports/shells/ast-ksh/work/ast-ksh93v/src/cmd/ksh93/sh/bash.c
cpp: error: no such file or directory: 'bash.i'
make [cmd/ksh93/cc-O,-D_BLD_DLL,-fPIC]: *** exit code 1 making bash.o
+ /wrkdirs/usr/ports/shells/ast-ksh/work/ast-ksh93v/arch/armv6-unknown-freebsd13.0-gnueabihf/lib/make/ppcc -o ANSI -o DOTI -o GNU -o DYNAMIC -o -dD -o -L -o 'EXPORT=ALL' /nxb-bin/usr/bin/cpp cc -O -D_BLD_DLL -fPIC -I-D/wrkdirs/usr/ports/shells/ast-ksh/work/ast-ksh93v/arch/armv6-unknown-freebsd13.0-gnueabihf/lib/probe/C/pp/1AB42E17fbincc -c bash_pre_rc.c
cpp: error: no such file or directory: 'bash_pre_rc.i'
make [cmd/ksh93/cc-O,-D_BLD_DLL,-fPIC]: *** exit code 1 making bash_pre_rc.o
+ /wrkdirs/usr/ports/shells/ast-ksh/work/ast-ksh93v/arch/armv6-unknown-freebsd13.0-gnueabihf/lib/make/ppcc -o ANSI -o DOTI -o GNU -o DYNAMIC -o -dD -o -L -o 'EXPORT=ALL' /nxb-bin/usr/bin/cpp cc -O -D_BLD_DLL -fPIC -I-D/wrkdirs/usr/ports/shells/ast-ksh/work/ast-ksh93v/arch/armv6-unknown-freebsd13.0-gnueabihf/lib/probe/C/pp/1AB42E17fbincc -I. -I/wrkdirs/usr/ports/shells/ast-ksh/work/ast-ksh93v/src/cmd/ksh93/include -I/wrkdirs/usr/ports/shells/ast-ksh/work/ast-ksh93v/include/ast '-D_API_ast=20130625' -D_PACKAGE_ast '-DERROR_CONTEXT_T=Error_context_t' -DSHOPT_COMPLETE -DSHOPT_POLL -D_BLD_shell -DSHOPT_BASH -DSHOPT_FIXEDARRAY -DKSHELL -DSHOPT_MULTIBYTE -DSHOPT_STATS -DSHOPT_NAMESPACE -DSHOPT_COSHELL -DSHOPT_PFSH -c /wrkdirs/usr/ports/shells/ast-ksh/work/ast-ksh93v/src/cmd/ksh93/bltins/poll.c
cpp: error: no such file or directory: 'poll.i'
make [cmd/ksh93/cc-O,-D_BLD_DLL,-fPIC]: *** exit code 1 making poll.o
make [cmd/ksh93/cc-O,-D_BLD_DLL,-fPIC]: *** 57 actions failed
make [cmd/ksh93]: ".DLL.cc-O,-D_BLD_DLL,-fPIC", line 8: *** exit code 1 making cc-O,-D_BLD_DLL,-fPIC
make [cmd/ksh93]: *** 68 actions failed
make: *** exit code 1 making cmd/ksh93
+ set -
lib:
+ set -
cmd/vcodexlib:
+ set -
cmd/sortlib:
+ set -
cmd/paxlib:
+ set -
cmd/kshlib:
+ set -
cmd/dsslib:
+ set -
cmd/codexlib:
+ set -
cmd:
make: *** 7 actions failed
package: make done  at Mon May 31 18:31:51 UTC 2021 in /wrkdirs/usr/ports/shells/ast-ksh/work/ast-ksh93v/arch/armv6-unknown-freebsd13.0-gnueabihf
===========================================================================
=======================<phase: run-depends    >============================
===========================================================================
=======================<phase: stage          >============================
===>  Staging for ast-ksh-20141224_1
===>   Generating temporary packing list
install  -s -m 555 /wrkdirs/usr/ports/shells/ast-ksh/work/ast-ksh93v/bin/ksh /wrkdirs/usr/ports/shells/ast-ksh/work/stage/usr/local/bin/ksh93
install: /wrkdirs/usr/ports/shells/ast-ksh/work/ast-ksh93v/bin/ksh: No such file or directory
*** Error code 71

Stop.
make: stopped in /usr/ports/shells/ast-ksh
Received on Mon May 31 2021 - 18:31:52 UTC

Original text of this message