[package - main-arm64-default][archivers/paq] Failed for paq-20140131_6 in build

From: <pkg-fallout_at_FreeBSD.org>
Date: Wed, 19 May 2021 15:28:03 GMT
You are receiving this mail as a port that you maintain
is failing to build on the FreeBSD package build server.
Please investigate the failure and submit a PR to fix
build.

Maintainer:     ports_at_FreeBSD.org
Log URL:        http://ampere2.nyi.freebsd.org/data/main-arm64-default/p7bfc2c072607_s8d2b4b2e7c/logs/paq-20140131_6.log
Build URL:      http://ampere2.nyi.freebsd.org/build.html?mastername=main-arm64-default&build=p7bfc2c072607_s8d2b4b2e7c
Log:

=>> Building archivers/paq
build started at Wed May 19 15:27:44 UTC 2021
port directory: /usr/ports/archivers/paq
package name: paq-20140131_6
building for: FreeBSD main-arm64-default-job-06 14.0-CURRENT FreeBSD 14.0-CURRENT 1400013 arm64
maintained by: ports_at_FreeBSD.org
Makefile ident: 
Poudriere version: 3.2.8-8-gaf08dbda
Host OSVERSION: 1400008
Jail OSVERSION: 1400013
Job Id: 06




!!! Jail is newer than host. (Jail: 1400013, Host: 1400008) !!!
!!! This is not supported. !!!
!!! Host kernel must be same or newer than jail. !!!
!!! Expect build failures. !!!



---Begin Environment---
SHELL=/bin/csh
OSVERSION=1400013
UNAME_v=FreeBSD 14.0-CURRENT 1400013
UNAME_r=14.0-CURRENT
BLOCKSIZE=K
MAIL=/var/mail/root
MM_CHARSET=UTF-8
LANG=C.UTF-8
STATUS=1
HOME=/root
PATH=/sbin:/bin:/usr/sbin:/usr/bin:/usr/local/sbin:/usr/local/bin:/root/bin
LOCALBASE=/usr/local
USER=root
LIBEXECPREFIX=/usr/local/libexec/poudriere
POUDRIERE_VERSION=3.2.8-8-gaf08dbda
MASTERMNT=/usr/local/poudriere/data/.m/main-arm64-default/ref
POUDRIERE_BUILD_TYPE=bulk
PACKAGE_BUILDING=yes
SAVED_TERM=
PWD=/usr/local/poudriere/data/.m/main-arm64-default/ref/.p/pool
P_PORTS_FEATURES=FLAVORS SELECTED_OPTIONS
MASTERNAME=main-arm64-default
SCRIPTPREFIX=/usr/local/share/poudriere
OLDPWD=/usr/local/poudriere/data/.m/main-arm64-default/ref/.p
SCRIPTPATH=/usr/local/share/poudriere/bulk.sh
POUDRIEREPATH=/usr/local/bin/poudriere
---End Environment---

---Begin Poudriere Port Flags/Env---
PORT_FLAGS=
PKGENV=
FLAVOR=
DEPENDS_ARGS=
MAKE_ARGS=
---End Poudriere Port Flags/Env---

---Begin OPTIONS List---
===> The following configuration options are available for paq-20140131_6:
     DOCS=on: Build and/or install documentation
     OPENMP=off: Parallel processing support via OpenMP
===> Use 'make config' to modify these settings
---End OPTIONS List---

--MAINTAINER--
ports_at_FreeBSD.org
--End MAINTAINER--

--CONFIGURE_ARGS--

--End CONFIGURE_ARGS--

--CONFIGURE_ENV--
XDG_DATA_HOME=/wrkdirs/usr/ports/archivers/paq/work  XDG_CONFIG_HOME=/wrkdirs/usr/ports/archivers/paq/work  HOME=/wrkdirs/usr/ports/archivers/paq/work TMPDIR="/tmp" PATH=/wrkdirs/usr/ports/archivers/paq/work/.bin:/sbin:/bin:/usr/sbin:/usr/bin:/usr/local/sbin:/usr/local/bin:/root/bin SHELL=/bin/sh CONFIG_SHELL=/bin/sh
--End CONFIGURE_ENV--

--MAKE_ENV--
XDG_DATA_HOME=/wrkdirs/usr/ports/archivers/paq/work  XDG_CONFIG_HOME=/wrkdirs/usr/ports/archivers/paq/work  HOME=/wrkdirs/usr/ports/archivers/paq/work TMPDIR="/tmp" PATH=/wrkdirs/usr/ports/archivers/paq/work/.bin:/sbin:/bin:/usr/sbin:/usr/bin:/usr/local/sbin:/usr/local/bin:/root/bin NO_PIE=yes MK_DEBUG_FILES=no MK_KERNEL_SYMBOLS=no SHELL=/bin/sh NO_LINT=YES PREFIX=/usr/local  LOCALBASE=/usr/local  CC="cc" CFLAGS="-O2 -pipe  -fstack-protector-strong -fno-strict-aliasing "  CPP="cpp" CPPFLAGS=""  LDFLAGS=" -fstack-protector-strong " LIBS=""  CXX="c++" CXXFLAGS="-O2 -pipe -fstack-protector-strong -fno-strict-aliasing  -DNDEBUG "  MANPREFIX="/usr/local" BSD_INSTALL_PROGRAM="install  -s -m 555"  BSD_INSTALL_LIB="install  -s -m 0644"  BSD_INSTALL_SCRIPT="install  -m 555"  BSD_INSTALL_DATA="install  -m 0644"  BSD_INSTALL_MAN="install  -m 444"
--End MAKE_ENV--

--PLIST_SUB--
PORTDOCS="" OSREL=14.0 PREFIX=%D LOCALBASE=/usr/local  RESETPREFIX=/usr/local LIB32DIR=lib DOCSDIR="share/doc/paq"  EXAMPLESDIR="share/examples/paq"  DATADIR="share/paq"  WWWDIR="www/paq"  ETCDIR="etc/paq"
--End PLIST_SUB--

--SUB_LIST--
PREFIX=/usr/local LOCALBASE=/usr/local  DATADIR=/usr/local/share/paq DOCSDIR=/usr/local/share/doc/paq EXAMPLESDIR=/usr/local/share/examples/paq  WWWDIR=/usr/local/www/paq ETCDIR=/usr/local/etc/paq
--End SUB_LIST--

---Begin make.conf---
USE_PACKAGE_DEPENDS=yes
BATCH=yes
WRKDIRPREFIX=/wrkdirs
PORTSDIR=/usr/ports
PACKAGES=/packages
DISTDIR=/distfiles
PACKAGE_BUILDING=yes
PACKAGE_BUILDING_FLAVORS=yes
#### /usr/local/etc/poudriere.d/make.conf ####
# XXX: We really need this but cannot use it while 'make checksum' does not
# try the next mirror on checksum failure.  It currently retries the same
# failed mirror and then fails rather then trying another.  It *does*
# try the next if the size is mismatched though.
#MASTER_SITE_FREEBSD=yes
# Build ALLOW_MAKE_JOBS_PACKAGES with 2 jobs
MAKE_JOBS_NUMBER=2
#### /usr/ports/Mk/Scripts/ports_env.sh ####
_CCVERSION_921dbbb2=FreeBSD clang version 11.0.1 (git_at_github.com:llvm/llvm-project.git llvmorg-11.0.1-0-g43ff75f2c3fe) Target: aarch64-unknown-freebsd14.0 Thread model: posix InstalledDir: /usr/bin
_ALTCCVERSION_921dbbb2=none
_CXXINTERNAL_acaad9ca=FreeBSD clang version 11.0.1 (git_at_github.com:llvm/llvm-project.git llvmorg-11.0.1-0-g43ff75f2c3fe) Target: aarch64-unknown-freebsd14.0 Thread model: posix InstalledDir: /usr/bin "/usr/bin/ld" "--eh-frame-hdr" "-dynamic-linker" "/libexec/ld-elf.so.1" "--enable-new-dtags" "-o" "a.out" "/usr/lib/crt1.o" "/usr/lib/crti.o" "/usr/lib/crtbegin.o" "-L/usr/lib" "/dev/null" "-lc++" "-lm" "-lgcc" "--as-needed" "-lgcc_s" "--no-as-needed" "-lc" "-lgcc" "--as-needed" "-lgcc_s" "--no-as-needed" "/usr/lib/crtend.o" "/usr/lib/crtn.o"
CC_OUTPUT_921dbbb2_58173849=yes
CC_OUTPUT_921dbbb2_9bdba57c=yes
CC_OUTPUT_921dbbb2_6a4fe7f5=yes
CC_OUTPUT_921dbbb2_6bcac02b=yes
CC_OUTPUT_921dbbb2_67d20829=yes
CC_OUTPUT_921dbbb2_bfa62e83=yes
CC_OUTPUT_921dbbb2_f0b4d593=yes
CC_OUTPUT_921dbbb2_308abb44=yes
CC_OUTPUT_921dbbb2_f00456e5=yes
CC_OUTPUT_921dbbb2_65ad290d=yes
CC_OUTPUT_921dbbb2_f2776b26=yes
CC_OUTPUT_921dbbb2_b2657cc3=yes
CC_OUTPUT_921dbbb2_380987f7=yes
CC_OUTPUT_921dbbb2_160933ec=yes
CC_OUTPUT_921dbbb2_fb62803b=yes
_OBJC_CCVERSION_921dbbb2=FreeBSD clang version 11.0.1 (git_at_github.com:llvm/llvm-project.git llvmorg-11.0.1-0-g43ff75f2c3fe) Target: aarch64-unknown-freebsd14.0 Thread model: posix InstalledDir: /usr/bin
_OBJC_ALTCCVERSION_921dbbb2=none
ARCH=aarch64
OPSYS=FreeBSD
_OSRELEASE=14.0-CURRENT
OSREL=14.0
OSVERSION=1400013
PYTHONBASE=/usr/local
CONFIGURE_MAX_CMD_LEN=524288
HAVE_PORTS_ENV=1
#### Misc Poudriere ####
GID=0
UID=0
---End make.conf---
--Resource limits--
cpu time               (seconds, -t)  unlimited
file size           (512-blocks, -f)  unlimited
data seg size           (kbytes, -d)  1048576
stack size              (kbytes, -s)  1048576
core file size      (512-blocks, -c)  unlimited
max memory size         (kbytes, -m)  unlimited
locked memory           (kbytes, -l)  unlimited
max user processes              (-u)  89999
open files                      (-n)  1024
virtual mem size        (kbytes, -v)  unlimited
swap limit              (kbytes, -w)  unlimited
socket buffer size       (bytes, -b)  unlimited
pseudo-terminals                (-p)  unlimited
kqueues                         (-k)  unlimited
umtx shared locks               (-o)  unlimited
--End resource limits--
=======================<phase: check-sanity   >============================
===>   NOTICE:

The paq port currently does not have a maintainer. As a result, it is
more likely to have unresolved issues, not be up-to-date, or even be removed in
the future. To volunteer to maintain this port, please create an issue at:

https://bugs.freebsd.org/bugzilla

More information about port maintainership is available at:

https://www.freebsd.org/doc/en/articles/contributing/ports-contributing.html#maintain-port

===>  License GPLv3 MIT accepted by the user
===========================================================================
=======================<phase: pkg-depends    >============================
===>   paq-20140131_6 depends on file: /usr/local/sbin/pkg - not found
===>   Installing existing package /packages/All/pkg-1.16.3.txz
[main-arm64-default-job-06] Installing pkg-1.16.3...
[main-arm64-default-job-06] Extracting pkg-1.16.3: .......... done
===>   paq-20140131_6 depends on file: /usr/local/sbin/pkg - found
===>   Returning to build of paq-20140131_6
===========================================================================
=======================<phase: fetch-depends  >============================
===========================================================================
=======================<phase: fetch          >============================
===>   NOTICE:

The paq port currently does not have a maintainer. As a result, it is
more likely to have unresolved issues, not be up-to-date, or even be removed in
the future. To volunteer to maintain this port, please create an issue at:

https://bugs.freebsd.org/bugzilla

More information about port maintainership is available at:

https://www.freebsd.org/doc/en/articles/contributing/ports-contributing.html#maintain-port

===>  License GPLv3 MIT accepted by the user
===> Fetching all distfiles required by paq-20140131_6 for building
===========================================================================
=======================<phase: checksum       >============================
<snip>
=> SHA256 Checksum OK for paq/bmp_j4c.zip.
=> SHA256 Checksum OK for paq/bwt.1.zip.
=> SHA256 Checksum OK for paq/bwt_j3.zip.
=> SHA256 Checksum OK for paq/bwt_slowmode1.zip.
=> SHA256 Checksum OK for paq/calgarytest.zpaq.
=> SHA256 Checksum OK for paq/calgarytest2.zpaq.
=> SHA256 Checksum OK for paq/exe_j1.zip.
=> SHA256 Checksum OK for paq/fast.cfg.
=> SHA256 Checksum OK for paq/jpg_test2.zip.
=> SHA256 Checksum OK for paq/lazy210.zip.
=> SHA256 Checksum OK for paq/lz1.zip.
=> SHA256 Checksum OK for paq/max.cfg.
=> SHA256 Checksum OK for paq/mid.cfg.
=> SHA256 Checksum OK for paq/min.zip.
=> SHA256 Checksum OK for paq/zpsfx.100.zip.
=> SHA256 Checksum OK for paq/zpsfx101.cpp.
=> SHA256 Checksum OK for paq/zpaq1.pdf.
=> SHA256 Checksum OK for paq/zpaq202.pdf.
=> SHA256 Checksum OK for paq/zpaq203.pdf.
=> SHA256 Checksum OK for paq/zpaq204.pdf.
===========================================================================
=======================<phase: patch-depends  >============================
===========================================================================
=======================<phase: patch          >============================
===>  Patching for paq-20140131_6
===>   Converting DOS text files to UNIX text files
===>  Applying FreeBSD patches for paq-20140131_6 from /usr/ports/archivers/paq/files
===========================================================================
=======================<phase: build-depends  >============================
===========================================================================
=======================<phase: lib-depends    >============================
===========================================================================
=======================<phase: configure      >============================
===>  Configuring for paq-20140131_6
===========================================================================
=======================<phase: build          >============================
===>  Building for paq-20140131_6
bwt_.cpp:13:9: warning: 'NDEBUG' macro redefined [-Wmacro-redefined]
#define NDEBUG  // remove for debugging
        ^
<command line>:1:9: note: previous definition is here
#define NDEBUG 1
        ^
1 warning generated.
exe_jo.cpp:76:1: warning: non-void function does not return a value in all control paths [-Wreturn-type]
}
^
1 warning generated.
jpeg_jo.cpp:127:13: warning: using the result of an assignment as a condition without parentheses [-Wparentheses]
      if (c = fgetc(in)) {
          ~~^~~~~~~~~~~
jpeg_jo.cpp:127:13: note: place parentheses around the assignment to silence this warning
      if (c = fgetc(in)) {
            ^
          (            )
jpeg_jo.cpp:127:13: note: use '==' to turn this assignment into an equality comparison
      if (c = fgetc(in)) {
            ^
            ==
1 warning generated.
c++: warning: treating 'c' input as 'c++' when in C++ mode, this behavior is deprecated [-Wdeprecated]
libzpaq.cpp:2755:3: error: constant expression evaluates to -1 which cannot be narrowed to type 'char' [-Wc++11-narrowing]
  -1,0,17,104,74,4,95,1,59,112,10,25,59,112,10,25,
  ^~
libzpaq.cpp:2755:3: note: insert an explicit cast to silence this issue
  -1,0,17,104,74,4,95,1,59,112,10,25,59,112,10,25,
  ^~
  static_cast<char>( )
libzpaq.cpp:2757:9: error: constant expression evaluates to -49 which cannot be narrowed to type 'char' [-Wc++11-narrowing]
  25,69,-49,8,112,56,0,
        ^~~
libzpaq.cpp:2757:9: note: insert an explicit cast to silence this issue
  25,69,-49,8,112,56,0,
        ^~~
        static_cast<char>( )
libzpaq.cpp:2760:3: error: constant expression evaluates to -60 which cannot be narrowed to type 'char' [-Wc++11-narrowing]
  -60,0,5,9,0,0,22,1,-96,3,5,8,13,1,8,16,
  ^~~
libzpaq.cpp:2760:3: note: insert an explicit cast to silence this issue
  -60,0,5,9,0,0,22,1,-96,3,5,8,13,1,8,16,
  ^~~
  static_cast<char>( )
libzpaq.cpp:2760:22: error: constant expression evaluates to -96 which cannot be narrowed to type 'char' [-Wc++11-narrowing]
  -60,0,5,9,0,0,22,1,-96,3,5,8,13,1,8,16,
                     ^~~
libzpaq.cpp:2760:22: note: insert an explicit cast to silence this issue
  -60,0,5,9,0,0,22,1,-96,3,5,8,13,1,8,16,
                     ^~~
                     static_cast<char>( )
libzpaq.cpp:2763:9: error: constant expression evaluates to -1 which cannot be narrowed to type 'char' [-Wc++11-narrowing]
  15,24,-1,7,8,0,16,10,-1,6,0,15,16,24,0,9,
        ^~
libzpaq.cpp:2763:9: note: insert an explicit cast to silence this issue
  15,24,-1,7,8,0,16,10,-1,6,0,15,16,24,0,9,
        ^~
        static_cast<char>( )
libzpaq.cpp:2763:24: error: constant expression evaluates to -1 which cannot be narrowed to type 'char' [-Wc++11-narrowing]
  15,24,-1,7,8,0,16,10,-1,6,0,15,16,24,0,9,
                       ^~
libzpaq.cpp:2763:24: note: insert an explicit cast to silence this issue
  15,24,-1,7,8,0,16,10,-1,6,0,15,16,24,0,9,
                       ^~
                       static_cast<char>( )
libzpaq.cpp:2764:11: error: constant expression evaluates to -1 which cannot be narrowed to type 'char' [-Wc++11-narrowing]
  8,17,32,-1,6,8,17,18,16,-1,9,16,19,32,-1,6,
          ^~
libzpaq.cpp:2764:11: note: insert an explicit cast to silence this issue
  8,17,32,-1,6,8,17,18,16,-1,9,16,19,32,-1,6,
          ^~
          static_cast<char>( )
libzpaq.cpp:2764:27: error: constant expression evaluates to -1 which cannot be narrowed to type 'char' [-Wc++11-narrowing]
  8,17,32,-1,6,8,17,18,16,-1,9,16,19,32,-1,6,
                          ^~
libzpaq.cpp:2764:27: note: insert an explicit cast to silence this issue
  8,17,32,-1,6,8,17,18,16,-1,9,16,19,32,-1,6,
                          ^~
                          static_cast<char>( )
libzpaq.cpp:2764:41: error: constant expression evaluates to -1 which cannot be narrowed to type 'char' [-Wc++11-narrowing]
  8,17,32,-1,6,8,17,18,16,-1,9,16,19,32,-1,6,
                                        ^~
libzpaq.cpp:2764:41: note: insert an explicit cast to silence this issue
  8,17,32,-1,6,8,17,18,16,-1,9,16,19,32,-1,6,
                                        ^~
                                        static_cast<char>( )
libzpaq.cpp:2767:38: error: constant expression evaluates to -73 which cannot be narrowed to type 'char' [-Wc++11-narrowing]
  59,10,59,112,10,25,59,112,10,25,69,-73,32,-17,64,47,
                                     ^~~
libzpaq.cpp:2767:38: note: insert an explicit cast to silence this issue
  59,10,59,112,10,25,59,112,10,25,69,-73,32,-17,64,47,
                                     ^~~
                                     static_cast<char>( )
libzpaq.cpp:2767:45: error: constant expression evaluates to -17 which cannot be narrowed to type 'char' [-Wc++11-narrowing]
  59,10,59,112,10,25,59,112,10,25,69,-73,32,-17,64,47,
                                            ^~~
libzpaq.cpp:2767:45: note: insert an explicit cast to silence this issue
  59,10,59,112,10,25,59,112,10,25,69,-73,32,-17,64,47,
                                            ^~~
                                            static_cast<char>( )
libzpaq.cpp:2768:6: error: constant expression evaluates to -25 which cannot be narrowed to type 'char' [-Wc++11-narrowing]
  14,-25,91,47,10,25,60,26,48,-122,-105,20,112,63,9,70,
     ^~~
libzpaq.cpp:2768:6: note: insert an explicit cast to silence this issue
  14,-25,91,47,10,25,60,26,48,-122,-105,20,112,63,9,70,
     ^~~
     static_cast<char>( )
libzpaq.cpp:2768:31: error: constant expression evaluates to -122 which cannot be narrowed to type 'char' [-Wc++11-narrowing]
  14,-25,91,47,10,25,60,26,48,-122,-105,20,112,63,9,70,
                              ^~~~
libzpaq.cpp:2768:31: note: insert an explicit cast to silence this issue
  14,-25,91,47,10,25,60,26,48,-122,-105,20,112,63,9,70,
                              ^~~~
                              static_cast<char>( )
libzpaq.cpp:2768:36: error: constant expression evaluates to -105 which cannot be narrowed to type 'char' [-Wc++11-narrowing]
  14,-25,91,47,10,25,60,26,48,-122,-105,20,112,63,9,70,
                                   ^~~~
libzpaq.cpp:2768:36: note: insert an explicit cast to silence this issue
  14,-25,91,47,10,25,60,26,48,-122,-105,20,112,63,9,70,
                                   ^~~~
                                   static_cast<char>( )
libzpaq.cpp:2769:3: error: constant expression evaluates to -33 which cannot be narrowed to type 'char' [-Wc++11-narrowing]
  -33,0,39,3,25,112,26,52,25,25,74,10,4,59,112,25,
  ^~~
libzpaq.cpp:2769:3: note: insert an explicit cast to silence this issue
  -33,0,39,3,25,112,26,52,25,25,74,10,4,59,112,25,
  ^~~
  static_cast<char>( )
libzpaq.cpp:2770:36: error: constant expression evaluates to -113 which cannot be narrowed to type 'char' [-Wc++11-narrowing]
  10,4,59,112,25,10,4,59,112,25,65,-113,-44,72,4,59,
                                   ^~~~
libzpaq.cpp:2770:36: note: insert an explicit cast to silence this issue
  10,4,59,112,25,10,4,59,112,25,65,-113,-44,72,4,59,
                                   ^~~~
                                   static_cast<char>( )
libzpaq.cpp:2770:41: error: constant expression evaluates to -44 which cannot be narrowed to type 'char' [-Wc++11-narrowing]
  10,4,59,112,25,10,4,59,112,25,65,-113,-44,72,4,59,
                                        ^~~
libzpaq.cpp:2770:41: note: insert an explicit cast to silence this issue
  10,4,59,112,25,10,4,59,112,25,65,-113,-44,72,4,59,
                                        ^~~
                                        static_cast<char>( )
libzpaq.cpp:2771:9: error: constant expression evaluates to -113 which cannot be narrowed to type 'char' [-Wc++11-narrowing]
  112,8,-113,-40,8,68,-81,60,60,25,69,-49,9,112,25,25,
        ^~~~
libzpaq.cpp:2771:9: note: insert an explicit cast to silence this issue
  112,8,-113,-40,8,68,-81,60,60,25,69,-49,9,112,25,25,
        ^~~~
        static_cast<char>( )
libzpaq.cpp:2771:14: error: constant expression evaluates to -40 which cannot be narrowed to type 'char' [-Wc++11-narrowing]
  112,8,-113,-40,8,68,-81,60,60,25,69,-49,9,112,25,25,
             ^~~
libzpaq.cpp:2771:14: note: insert an explicit cast to silence this issue
  112,8,-113,-40,8,68,-81,60,60,25,69,-49,9,112,25,25,
             ^~~
             static_cast<char>( )
fatal error: too many errors emitted, stopping now [-ferror-limit=]
20 errors generated.
*** Error code 1

Stop.
make: stopped in /usr/ports/archivers/paq
Received on Wed May 19 2021 - 15:28:03 UTC

Original text of this message