[package - 122powerpc64-quarterly][editors/poke] Failed for poke-1.0 in build

From: <pkg-fallout_at_FreeBSD.org>
Date: Tue, 29 Jun 2021 04:45:38 GMT
You are receiving this mail as a port that you maintain
is failing to build on the FreeBSD package build server.
Please investigate the failure and submit a PR to fix
build.

Maintainer:     mistresssilvara_at_hotmail.com
Log URL:        http://foul1.nyi.freebsd.org/data/122powerpc64-quarterly/ae162bd98935/logs/poke-1.0.log
Build URL:      http://foul1.nyi.freebsd.org/build.html?mastername=122powerpc64-quarterly&build=ae162bd98935
Log:

=>> Building editors/poke
build started at Tue Jun 29 04:40:24 UTC 2021
port directory: /usr/ports/editors/poke
package name: poke-1.0
building for: FreeBSD 122powerpc64-quarterly-job-12 12.2-RELEASE FreeBSD 12.2-RELEASE powerpc
maintained by: mistresssilvara_at_hotmail.com
Makefile ident: 
Poudriere version: 3.2.8-8-gaf08dbda
Host OSVERSION: 1400008
Jail OSVERSION: 1202000
Job Id: 12

---Begin Environment---
SHELL=/bin/csh
OSVERSION=1202000
UNAME_v=FreeBSD 12.2-RELEASE
UNAME_r=12.2-RELEASE
BLOCKSIZE=K
MAIL=/var/mail/root
STATUS=1
HOME=/root
PATH=/sbin:/bin:/usr/sbin:/usr/bin:/usr/local/sbin:/usr/local/bin:/root/bin
LOCALBASE=/usr/local
USER=root
LIBEXECPREFIX=/usr/local/libexec/poudriere
POUDRIERE_VERSION=3.2.8-8-gaf08dbda
MASTERMNT=/usr/local/poudriere/data/.m/122powerpc64-quarterly/ref
POUDRIERE_BUILD_TYPE=bulk
PACKAGE_BUILDING=yes
SAVED_TERM=
PWD=/usr/local/poudriere/data/.m/122powerpc64-quarterly/ref/.p/pool
P_PORTS_FEATURES=FLAVORS SELECTED_OPTIONS
MASTERNAME=122powerpc64-quarterly
SCRIPTPREFIX=/usr/local/share/poudriere
OLDPWD=/usr/local/poudriere/data/.m/122powerpc64-quarterly/ref/.p
SCRIPTPATH=/usr/local/share/poudriere/bulk.sh
POUDRIEREPATH=/usr/local/bin/poudriere
---End Environment---

---Begin Poudriere Port Flags/Env---
PORT_FLAGS=
PKGENV=
FLAVOR=
DEPENDS_ARGS=
MAKE_ARGS=
---End Poudriere Port Flags/Env---

---Begin OPTIONS List---
===> The following configuration options are available for poke-1.0:
     EXAMPLES=on: Build and/or install examples
     NLS=on: Native Language Support
===> Use 'make config' to modify these settings
---End OPTIONS List---

--MAINTAINER--
mistresssilvara_at_hotmail.com
--End MAINTAINER--

--CONFIGURE_ARGS--
--disable-gui --enable-nls --prefix=/usr/local ${_LATE_CONFIGURE_ARGS}
--End CONFIGURE_ARGS--

--CONFIGURE_ENV--
MAKE=gmake PKG_CONFIG=pkgconf XDG_DATA_HOME=/wrkdirs/usr/ports/editors/poke/work  XDG_CONFIG_HOME=/wrkdirs/usr/ports/editors/poke/work  HOME=/wrkdirs/usr/ports/editors/poke/work TMPDIR="/tmp" PATH=/wrkdirs/usr/ports/editors/poke/work/.bin:/sbin:/bin:/usr/sbin:/usr/bin:/usr/local/sbin:/usr/local/bin:/root/bin SHELL=/bin/sh CONFIG_SHELL=/bin/sh CONFIG_SITE=/usr/ports/Templates/config.site lt_cv_sys_max_cmd_len=524288
--End CONFIGURE_ENV--

--MAKE_ENV--
XDG_DATA_HOME=/wrkdirs/usr/ports/editors/poke/work  XDG_CONFIG_HOME=/wrkdirs/usr/ports/editors/poke/work  HOME=/wrkdirs/usr/ports/editors/poke/work TMPDIR="/tmp" PATH=/wrkdirs/usr/ports/editors/poke/work/.bin:/sbin:/bin:/usr/sbin:/usr/bin:/usr/local/sbin:/usr/local/bin:/root/bin NO_PIE=yes MK_DEBUG_FILES=no MK_KERNEL_SYMBOLS=no SHELL=/bin/sh NO_LINT=YES PREFIX=/usr/local  LOCALBASE=/usr/local  CC="cc" CFLAGS="-O2 -pipe  -fstack-protector-strong -fno-strict-aliasing "  CPP="cpp" CPPFLAGS="-I/usr/local/include"  LDFLAGS=" -L/usr/local/lib -fstack-protector-strong " LIBS=""  CXX="c++" CXXFLAGS="-O2 -pipe -fstack-protector-strong -fno-strict-aliasing  "  MANPREFIX="/usr/local" BSD_INSTALL_PROGRAM="install  -s -m 555"  BSD_INSTALL_LIB="install  -s -m 0644"  BSD_INSTALL_SCRIPT="install  -m 555"  BSD_INSTALL_DATA="install  -m 0644"  BSD_INSTALL_MAN="install  -m 444"
--End MAKE_ENV--

--PLIST_SUB--
PORTEXAMPLES="" EXAMPLES="" NO_EXAMPLES="_at_comment " NLS="" NO_NLS="_at_comment " OSREL=12.2 PREFIX=%D LOCALBASE=/usr/local  RESETPREFIX=/usr/local LIB32DIR=lib DOCSDIR="share/doc/poke"  EXAMPLESDIR="share/examples/poke"  DATADIR="share/poke"  WWWDIR="www/poke"  ETCDIR="etc/poke"
--End PLIST_SUB--

--SUB_LIST--
EXAMPLES="" NO_EXAMPLES="_at_comment " NLS="" NO_NLS="_at_comment " PREFIX=/usr/local LOCALBASE=/usr/local  DATADIR=/usr/local/share/poke DOCSDIR=/usr/local/share/doc/poke EXAMPLESDIR=/usr/local/share/examples/poke  WWWDIR=/usr/local/www/poke ETCDIR=/usr/local/etc/poke
--End SUB_LIST--

---Begin make.conf---
USE_PACKAGE_DEPENDS=yes
BATCH=yes
WRKDIRPREFIX=/wrkdirs
PORTSDIR=/usr/ports
PACKAGES=/packages
DISTDIR=/distfiles
PACKAGE_BUILDING=yes
PACKAGE_BUILDING_FLAVORS=yes
#### /usr/local/etc/poudriere.d/make.conf ####
# XXX: We really need this but cannot use it while 'make checksum' does not
# try the next mirror on checksum failure.  It currently retries the same
# failed mirror and then fails rather then trying another.  It *does*
# try the next if the size is mismatched though.
#MASTER_SITE_FREEBSD=yes
# Build ALLOW_MAKE_JOBS_PACKAGES with 2 jobs
MAKE_JOBS_NUMBER=2
#### /usr/ports/Mk/Scripts/ports_env.sh ####
_CCVERSION_921dbbb2=cc (GCC) 4.2.1 20070831 patched [FreeBSD] Copyright (C) 2007 Free Software Foundation, Inc. This is free software; see the source for copying conditions. There is NO warranty; not even for MERCHANTABILITY or FITNESS FOR A PARTICULAR PURPOSE.
_ALTCCVERSION_921dbbb2=none
_CXXINTERNAL_acaad9ca=Using built-in specs. Target: powerpc64-undermydesk-freebsd Configured with: FreeBSD/powerpc64 system compiler Thread model: posix gcc version 4.2.1 20070831 patched [FreeBSD] "/usr/bin/ld" "--eh-frame-hdr" "-Qy" "-melf64ppc_fbsd" "--enable-new-dtags" "-dynamic-linker" "/libexec/ld-elf.so.1" "/usr/lib/crt1.o" "/usr/lib/crti.o" "/usr/lib/crtbegin.o" "-L/usr/lib" "-L/usr/lib" "/dev/null" "-lstdc++" "-lm" "-lgcc_s" "-lgcc" "-lc" "-lgcc_s" "-lgcc" "/usr/lib/crtsavres.o" "/usr/lib/crtend.o" "/usr/lib/crtn.o"
CC_OUTPUT_921dbbb2_58173849=yes
CC_OUTPUT_921dbbb2_9bdba57c=yes
CC_OUTPUT_921dbbb2_6a4fe7f5=cc1: error: unrecognized command line option "-std=c11"
CC_OUTPUT_921dbbb2_6bcac02b=yes
CC_OUTPUT_921dbbb2_67d20829=yes
CC_OUTPUT_921dbbb2_bfa62e83=cc1: error: unrecognized command line option "-std=gnu11"
CC_OUTPUT_921dbbb2_f0b4d593=yes
CC_OUTPUT_921dbbb2_308abb44=cc1plus: error: unrecognized command line option "-std=c++0x"
CC_OUTPUT_921dbbb2_f00456e5=cc1plus: error: unrecognized command line option "-std=c++11"
CC_OUTPUT_921dbbb2_65ad290d=cc1plus: error: unrecognized command line option "-std=c++14"
CC_OUTPUT_921dbbb2_f2776b26=cc1plus: error: unrecognized command line option "-std=c++17"
CC_OUTPUT_921dbbb2_b2657cc3=yes
CC_OUTPUT_921dbbb2_380987f7=cc1plus: error: unrecognized command line option "-std=gnu++11"
CC_OUTPUT_921dbbb2_160933ec=cc1plus: error: unrecognized command line option "-std=gnu++14"
CC_OUTPUT_921dbbb2_fb62803b=cc1plus: error: unrecognized command line option "-std=gnu++17"
_OBJC_CCVERSION_921dbbb2=cc (GCC) 4.2.1 20070831 patched [FreeBSD] Copyright (C) 2007 Free Software Foundation, Inc. This is free software; see the source for copying conditions. There is NO warranty; not even for MERCHANTABILITY or FITNESS FOR A PARTICULAR PURPOSE.
_OBJC_ALTCCVERSION_921dbbb2=none
ARCH=powerpc64
PPC_ABI=ELFv1
OPSYS=FreeBSD
_OSRELEASE=12.2-RELEASE
OSREL=12.2
OSVERSION=1202000
PYTHONBASE=/usr/local
CONFIGURE_MAX_CMD_LEN=524288
HAVE_PORTS_ENV=1
#### Misc Poudriere ####
GID=0
UID=0
---End make.conf---
--Resource limits--
cpu time               (seconds, -t)  unlimited
file size           (512-blocks, -f)  unlimited
data seg size           (kbytes, -d)  33554432
stack size              (kbytes, -s)  524288
core file size      (512-blocks, -c)  unlimited
max memory size         (kbytes, -m)  unlimited
locked memory           (kbytes, -l)  unlimited
max user processes              (-u)  89999
open files                      (-n)  1024
virtual mem size        (kbytes, -v)  unlimited
swap limit              (kbytes, -w)  unlimited
socket buffer size       (bytes, -b)  unlimited
pseudo-terminals                (-p)  unlimited
kqueues                         (-k)  unlimited
umtx shared locks               (-o)  unlimited
--End resource limits--
=======================<phase: check-sanity   >============================
===>  License GPLv3 accepted by the user
===========================================================================
=======================<phase: pkg-depends    >============================
===>   poke-1.0 depends on file: /usr/local/sbin/pkg - not found
===>   Installing existing package /packages/All/pkg-1.16.3.txz
[122powerpc64-quarterly-job-12] Installing pkg-1.16.3...
[122powerpc64-quarterly-job-12] Extracting pkg-1.16.3: .......... done
===>   poke-1.0 depends on file: /usr/local/sbin/pkg - found
===>   Returning to build of poke-1.0
===========================================================================
=======================<phase: fetch-depends  >============================
===========================================================================
=======================<phase: fetch          >============================
===>  License GPLv3 accepted by the user
===> Fetching all distfiles required by poke-1.0 for building
===========================================================================
=======================<phase: checksum       >============================
===>  License GPLv3 accepted by the user
===> Fetching all distfiles required by poke-1.0 for building
=> SHA256 Checksum OK for poke-1.0.tar.gz.
===========================================================================
=======================<phase: extract-depends>============================
===========================================================================
=======================<phase: extract        >============================
===>  License GPLv3 accepted by the user
===> Fetching all distfiles required by poke-1.0 for building
===>  Extracting for poke-1.0
=> SHA256 Checksum OK for poke-1.0.tar.gz.
===========================================================================
=======================<phase: patch-depends  >============================
===========================================================================
=======================<phase: patch          >============================
===>  Patching for poke-1.0
===========================================================================
=======================<phase: build-depends  >============================
===>   poke-1.0 depends on executable: help2man - not found
===>   Installing existing package /packages/All/help2man-1.48.1.txz
[122powerpc64-quarterly-job-12] Installing help2man-1.48.1...
[122powerpc64-quarterly-job-12] `-- Installing gettext-runtime-0.21...
[122powerpc64-quarterly-job-12] |   `-- Installing indexinfo-0.3.1...
[122powerpc64-quarterly-job-12] |   `-- Extracting indexinfo-0.3.1: .... done
[122powerpc64-quarterly-job-12] `-- Extracting gettext-runtime-0.21: .......... done
[122powerpc64-quarterly-job-12] `-- Installing p5-Locale-gettext-1.07...
[122powerpc64-quarterly-job-12] |   `-- Installing perl5-5.32.1_1...
[122powerpc64-quarterly-job-12] |   `-- Extracting perl5-5.32.1_1: .......... done
[122powerpc64-quarterly-job-12] `-- Extracting p5-Locale-gettext-1.07: ........ done
[122powerpc64-quarterly-job-12] Extracting help2man-1.48.1: .......... done
===>   poke-1.0 depends on executable: help2man - found
===>   Returning to build of poke-1.0
===>   poke-1.0 depends on package: gmake>=4.3 - not found
===>   Installing existing package /packages/All/gmake-4.3_2.txz
[122powerpc64-quarterly-job-12] Installing gmake-4.3_2...
<snip>
                 from pk-val.c:21:
./poke/config.h:1906:1: warning: this is the location of the previous definition
In file included from ios.h:22,
                 from pvm.h:28,
                 from pk-val.c:21:
./poke/config.h:1916:1: warning: "_GL_ATTRIBUTE_DEPRECATED" redefined
In file included from pvm.h:25,
                 from pk-val.c:21:
./poke/config.h:1914:1:In file included from pkt.h:22,
                 from libpoke.c:25 warning: :
this is the location of the previous definition../poke/config.h:1840:1:
 In file included from ios.h:22warning: ,
                 from pvm.h:28"_GL_HAS_ATTRIBUTE" redefined,
                 from pk-val.c:21
:
In file included from libpoke.c:19../poke/config.h:1933:1::
 ../poke/config.h:1842:1:warning:  "_GL_ATTRIBUTE_EXTERNALLY_VISIBLE" redefinedwarning: 
this is the location of the previous definition
In file included from pvm.h:25In file included from pkt.h:22,
                 from pk-val.c:21:
,
                 from libpoke.c:25:
./poke/config.h:1931:1:../poke/config.h:1883:1:  warning: warning: this is the location of the previous definition
"_GL_ATTRIBUTE_ALWAYS_INLINE" redefinedIn file included from ios.h:22
,
                 from pvm.h:28In file included from libpoke.c:19,
                 from pk-val.c:21:
:
./poke/config.h:1881:1:../poke/config.h:1948:1:  warning: warning: this is the location of the previous definition"_GL_ATTRIBUTE_FORMAT" redefined

In file included from pkt.h:22In file included from pvm.h:25,
                 from libpoke.c:25,
                 from pk-val.c:21:
:
./poke/config.h:1946:1:../poke/config.h:1908:1:  warning: this is the location of the previous definitionwarning: 
"_GL_ATTRIBUTE_CONST" redefinedIn file included from ios.h:22
,
                 from pvm.h:28In file included from libpoke.c:19,
                 from pk-val.c:21:
:
./poke/config.h:1961:1:../poke/config.h:1906:1:  warning: warning: "_GL_ATTRIBUTE_MAY_ALIAS" redefinedthis is the location of the previous definition

In file included from pvm.h:25In file included from pkt.h:22,
                 from pk-val.c:21:
,
                 from libpoke.c:25../poke/config.h:1959:1: :
warning: ../poke/config.h:1916:1:this is the location of the previous definition 
warning: In file included from ios.h:22"_GL_ATTRIBUTE_DEPRECATED" redefined
,
                 from pvm.h:28In file included from libpoke.c:19,
                 from pk-val.c:21:
:
./poke/config.h:1969:1:../poke/config.h:1914:1: warning:  "_GL_ATTRIBUTE_MAYBE_UNUSED" redefinedwarning: 
this is the location of the previous definitionIn file included from pvm.h:25
,
                 from pk-val.c:21In file included from pkt.h:22:
,
                 from libpoke.c:25../poke/config.h:1967:1::
 ../poke/config.h:1933:1: warning: warning: "_GL_ATTRIBUTE_EXTERNALLY_VISIBLE" redefinedthis is the location of the previous definition

In file included from libpoke.c:19In file included from ios.h:22:
,
                 from pvm.h:28../poke/config.h:1931:1:,
                 from pk-val.c:21 :
warning: ../poke/config.h:1978:1:this is the location of the previous definition 
warning: In file included from pkt.h:22"_GL_ATTRIBUTE_MALLOC" redefined
,
                 from libpoke.c:25In file included from pvm.h:25:
,
                 from pk-val.c:21:
./poke/config.h:1948:1:../poke/config.h:1976:1:  warning: warning: "_GL_ATTRIBUTE_FORMAT" redefinedthis is the location of the previous definition

In file included from ios.h:22In file included from libpoke.c:19,
                 from pvm.h:28,
                 from pk-val.c:21:
:
./poke/config.h:1986:1:../poke/config.h:1946:1:  warning: warning: this is the location of the previous definition
"_GL_ATTRIBUTE_NODISCARD" redefinedIn file included from pkt.h:22,
                 from libpoke.c:25:

./poke/config.h:1961:1:In file included from pvm.h:25 warning: ,
                 from pk-val.c:21"_GL_ATTRIBUTE_MAY_ALIAS" redefined:

./poke/config.h:1984:1:In file included from libpoke.c:19 warning: :
this is the location of the previous definition../poke/config.h:1959:1: 
warning: In file included from ios.h:22this is the location of the previous definition,
                 from pvm.h:28
,
                 from pk-val.c:21In file included from pkt.h:22:
,
                 from libpoke.c:25:
./poke/config.h:1992:1:../poke/config.h:1969:1:  warning: warning: "_GL_ATTRIBUTE_NOINLINE" redefined
"_GL_ATTRIBUTE_MAYBE_UNUSED" redefinedIn file included from pvm.h:25
In file included from libpoke.c:19,
                 from pk-val.c:21:
:
./poke/config.h:1967:1:../poke/config.h:1990:1:  warning: warning: this is the location of the previous definitionthis is the location of the previous definition

In file included from ios.h:22In file included from pkt.h:22,
                 from pvm.h:28,
                 from libpoke.c:25,
                 from pk-val.c:21:
:
./poke/config.h:1978:1:../poke/config.h:1998:1:  warning: warning: "_GL_ATTRIBUTE_NONNULL" redefined
In file included from pvm.h:25"_GL_ATTRIBUTE_MALLOC" redefined,
                 from pk-val.c:21
:
In file included from libpoke.c:19../poke/config.h:1996:1::
 ../poke/config.h:1976:1:warning:  this is the location of the previous definitionwarning: this is the location of the previous definition

In file included from pkt.h:22In file included from ios.h:22,
                 from libpoke.c:25:
,
                 from pvm.h:28../poke/config.h:1986:1: ,
                 from pk-val.c:21warning: :
"_GL_ATTRIBUTE_NODISCARD" redefined../poke/config.h:2012:1: 
warning: In file included from libpoke.c:19:
"_GL_ATTRIBUTE_NOTHROW" redefined
./poke/config.h:1984:1:In file included from pvm.h:25 warning: this is the location of the previous definition
,
                 from pk-val.c:21In file included from pkt.h:22:
,
                 from libpoke.c:25../poke/config.h:2010:1::
 ../poke/config.h:1992:1:warning:  this is the location of the previous definitionwarning: 
"_GL_ATTRIBUTE_NOINLINE" redefined
In file included from ios.h:22In file included from libpoke.c:19,
                 from pvm.h:28:
,
                 from pk-val.c:21../poke/config.h:1990:1::
 ../poke/config.h:2018:1:warning:  this is the location of the previous definition
warning: In file included from pkt.h:22"_GL_ATTRIBUTE_PACKED" redefined,
                 from libpoke.c:25
:
In file included from pvm.h:25../poke/config.h:1998:1:,
                 from pk-val.c:21 :
warning: ../poke/config.h:2016:1:"_GL_ATTRIBUTE_NONNULL" redefined 
warning: In file included from libpoke.c:19this is the location of the previous definition:

./poke/config.h:1996:1:In file included from ios.h:22 ,
                 from pvm.h:28,
                 from pk-val.c:21:
warning: ../poke/config.h:2024:1:this is the location of the previous definition warning: 
"_GL_ATTRIBUTE_PURE" redefined
In file included from pkt.h:22In file included from pvm.h:25,
                 from libpoke.c:25,
                 from pk-val.c:21:
:
./poke/config.h:2012:1:../poke/config.h:2022:1:  warning: warning: "_GL_ATTRIBUTE_NOTHROW" redefined
this is the location of the previous definitionIn file included from libpoke.c:19
:
In file included from ios.h:22../poke/config.h:2010:1: ,
                 from pvm.h:28warning: this is the location of the previous definition
,
                 from pk-val.c:21In file included from pkt.h:22:
,
                 from libpoke.c:25../poke/config.h:2036:1::
 ../poke/config.h:2018:1:warning:  warning: "_GL_ATTRIBUTE_SENTINEL" redefined"_GL_ATTRIBUTE_PACKED" redefined

In file included from libpoke.c:19In file included from pvm.h:25:
,
                 from pk-val.c:21../poke/config.h:2016:1: warning: this is the location of the previous definition:

./poke/config.h:2034:1:In file included from pkt.h:22 warning: ,
                 from libpoke.c:25this is the location of the previous definition:

./poke/config.h:2024:1: warning: "_GL_ATTRIBUTE_PURE" redefined
In file included from libpoke.c:19:
./poke/config.h:2022:1: warning: this is the location of the previous definition
In file included from pkt.h:22,
                 from libpoke.c:25:
./poke/config.h:2036:1: warning: "_GL_ATTRIBUTE_SENTINEL" redefined
In file included from libpoke.c:19:
./poke/config.h:2034:1: warning: this is the location of the previous definition
In file included from pk-val.c:22:
pvm-val.h:503: error: redefinition of typedef 'pvm_program'
pvm.h:61: error: previous declaration of 'pvm_program' was here
In file included from libpoke.c:26:
pkl.h:63: error: redefinition of typedef 'pkl_compiler'
pvm.h:676: error: previous declaration of 'pkl_compiler' was here
In file included from libpoke.c:28:
pkl-env.h:58: error: redefinition of typedef 'pkl_env'
pkl.h:143: error: previous declaration of 'pkl_env' was here
In file included from libpoke.c:30:
pvm-val.h:503: error: redefinition of typedef 'pvm_program'
pvm.h:61: error: previous declaration of 'pvm_program' was here
gmake[3]: *** [Makefile:2278: libpoke_la-pk-val.lo] Error 1
gmake[3]: *** Waiting for unfinished jobs....
gmake[3]: *** [Makefile:2271: libpoke_la-libpoke.lo] Error 1
gmake[3]: Leaving directory '/wrkdirs/usr/ports/editors/poke/work/poke-1.0/libpoke'
gmake[2]: *** [Makefile:2106: all] Error 2
gmake[2]: Leaving directory '/wrkdirs/usr/ports/editors/poke/work/poke-1.0/libpoke'
gmake[1]: *** [Makefile:2034: all-recursive] Error 1
gmake[1]: Leaving directory '/wrkdirs/usr/ports/editors/poke/work/poke-1.0'
===> Compilation failed unexpectedly.
Try to set MAKE_JOBS_UNSAFE=yes and rebuild before reporting the failure to
the maintainer.
*** Error code 1

Stop.
make: stopped in /usr/ports/editors/poke
Received on Tue Jun 29 2021 - 04:45:38 UTC

Original text of this message