[package - 122powerpc64-quarterly][finance/quickfix] Failed for quickfix-1.15.1 in build

From: <pkg-fallout_at_FreeBSD.org>
Date: Tue, 29 Jun 2021 04:31:22 GMT
You are receiving this mail as a port that you maintain
is failing to build on the FreeBSD package build server.
Please investigate the failure and submit a PR to fix
build.

Maintainer:     m.tsatsenko_at_gmail.com
Log URL:        http://foul1.nyi.freebsd.org/data/122powerpc64-quarterly/ae162bd98935/logs/quickfix-1.15.1.log
Build URL:      http://foul1.nyi.freebsd.org/build.html?mastername=122powerpc64-quarterly&build=ae162bd98935
Log:

=>> Building finance/quickfix
build started at Tue Jun 29 04:27:58 UTC 2021
port directory: /usr/ports/finance/quickfix
package name: quickfix-1.15.1
building for: FreeBSD 122powerpc64-quarterly-job-13 12.2-RELEASE FreeBSD 12.2-RELEASE powerpc
maintained by: m.tsatsenko_at_gmail.com
Makefile ident: 
Poudriere version: 3.2.8-8-gaf08dbda
Host OSVERSION: 1400008
Jail OSVERSION: 1202000
Job Id: 13

---Begin Environment---
SHELL=/bin/csh
OSVERSION=1202000
UNAME_v=FreeBSD 12.2-RELEASE
UNAME_r=12.2-RELEASE
BLOCKSIZE=K
MAIL=/var/mail/root
STATUS=1
HOME=/root
PATH=/sbin:/bin:/usr/sbin:/usr/bin:/usr/local/sbin:/usr/local/bin:/root/bin
LOCALBASE=/usr/local
USER=root
LIBEXECPREFIX=/usr/local/libexec/poudriere
POUDRIERE_VERSION=3.2.8-8-gaf08dbda
MASTERMNT=/usr/local/poudriere/data/.m/122powerpc64-quarterly/ref
POUDRIERE_BUILD_TYPE=bulk
PACKAGE_BUILDING=yes
SAVED_TERM=
PWD=/usr/local/poudriere/data/.m/122powerpc64-quarterly/ref/.p/pool
P_PORTS_FEATURES=FLAVORS SELECTED_OPTIONS
MASTERNAME=122powerpc64-quarterly
SCRIPTPREFIX=/usr/local/share/poudriere
OLDPWD=/usr/local/poudriere/data/.m/122powerpc64-quarterly/ref/.p
SCRIPTPATH=/usr/local/share/poudriere/bulk.sh
POUDRIEREPATH=/usr/local/bin/poudriere
---End Environment---

---Begin Poudriere Port Flags/Env---
PORT_FLAGS=
PKGENV=
FLAVOR=
DEPENDS_ARGS=
MAKE_ARGS=
---End Poudriere Port Flags/Env---

---Begin OPTIONS List---
===> The following configuration options are available for quickfix-1.15.1:
     JAVA=off: Java platform support
     MYSQL=on: MySQL database support
     PGSQL=off: PostgreSQL database support
     PYTHON=off: Python bindings or support
     RUBY=off: Ruby bindings or support
===> Use 'make config' to modify these settings
---End OPTIONS List---

--MAINTAINER--
m.tsatsenko_at_gmail.com
--End MAINTAINER--

--CONFIGURE_ARGS--
--without-python2 --without-java --with-mysql --without-postgresql --without-python3 --without-ruby
--End CONFIGURE_ARGS--

--CONFIGURE_ENV--
CXX=g++10 CC=gcc10 LIBS=-L/usr/local/lib/ MAKE=gmake XDG_DATA_HOME=/wrkdirs/usr/ports/finance/quickfix/work  XDG_CONFIG_HOME=/wrkdirs/usr/ports/finance/quickfix/work  HOME=/wrkdirs/usr/ports/finance/quickfix/work TMPDIR="/tmp" PATH=/wrkdirs/usr/ports/finance/quickfix/work/.bin:/sbin:/bin:/usr/sbin:/usr/bin:/usr/local/sbin:/usr/local/bin:/root/bin SHELL=/bin/sh CONFIG_SHELL=/bin/sh CMAKE_PREFIX_PATH="/usr/local" LANG=en_US.UTF-8 LC_ALL=en_US.UTF-8
--End CONFIGURE_ENV--

--MAKE_ENV--
OPENSSLBASE=/usr OPENSSLDIR=/etc/ssl OPENSSLINC=/usr/include OPENSSLLIB=/usr/lib XDG_DATA_HOME=/wrkdirs/usr/ports/finance/quickfix/work  XDG_CONFIG_HOME=/wrkdirs/usr/ports/finance/quickfix/work  HOME=/wrkdirs/usr/ports/finance/quickfix/work TMPDIR="/tmp" PATH=/wrkdirs/usr/ports/finance/quickfix/work/.bin:/sbin:/bin:/usr/sbin:/usr/bin:/usr/local/sbin:/usr/local/bin:/root/bin NO_PIE=yes MK_DEBUG_FILES=no MK_KERNEL_SYMBOLS=no SHELL=/bin/sh NO_LINT=YES ADDR2LINE="/usr/local/bin/addr2line" AR="/usr/local/bin/ar" AS="/usr/local/bin/as" CPPFILT="/usr/local/bin/c++filt" GPROF="/usr/local/bin/gprof" LD="/usr/local/bin/ld" NM="/usr/local/bin/nm" OBJCOPY="/usr/local/bin/objcopy" OBJDUMP="/usr/local/bin/objdump" RANLIB="/usr/local/bin/ranlib" READELF="/usr/local/bin/readelf" SIZE="/usr/local/bin/size" STRINGS="/usr/local/bin/strings" LANG=en_US.UTF-8 LC_ALL=en_US.UTF-8 PREFIX=/usr/local  LOCALBASE=/usr/local  CC="gcc10" CFLAGS="-O2 -pipe  -DLIBICONV_PLUG -fstack-protector-strong -Wl,-rpath=/usr/
 local/lib/gcc10 -isystem /usr/local/include -fno-strict-aliasing "  CPP="cpp10" CPPFLAGS="-DLIBICONV_PLUG -isystem /usr/local/include"  LDFLAGS="  -fstack-protector-strong -Wl,-rpath=/usr/local/lib/gcc10 -L/usr/local/lib/gcc10 " LIBS="-L/usr/local/lib"  CXX="g++10" CXXFLAGS="-O2 -pipe  -DLIBICONV_PLUG -fstack-protector-strong -Wl,-rpath=/usr/local/lib/gcc10  -DENABLE_BOOST_ATOMIC_COUNT -DLIBICONV_PLUG -Wl,-rpath=/usr/local/lib/gcc10 -isystem /usr/local/include "  MANPREFIX="/usr/local" BSD_INSTALL_PROGRAM="install  -s -m 555"  BSD_INSTALL_LIB="install  -s -m 0644"  BSD_INSTALL_SCRIPT="install  -m 555"  BSD_INSTALL_DATA="install  -m 0644"  BSD_INSTALL_MAN="install  -m 444"
--End MAKE_ENV--

--PLIST_SUB--
JAVA="_at_comment " NO_JAVA="" MYSQL="" NO_MYSQL="_at_comment " PGSQL="_at_comment " NO_PGSQL="" PYTHON="_at_comment " NO_PYTHON="" RUBY="_at_comment " NO_RUBY="" GTK2_VERSION="2.10.0"  GTK3_VERSION="3.0.0" OSREL=12.2 PREFIX=%D LOCALBASE=/usr/local  RESETPREFIX=/usr/local LIB32DIR=lib DOCSDIR="share/doc/quickfix"  EXAMPLESDIR="share/examples/quickfix"  DATADIR="share/quickfix"  WWWDIR="www/quickfix"  ETCDIR="etc/quickfix"
--End PLIST_SUB--

--SUB_LIST--
JAVA="_at_comment " NO_JAVA="" MYSQL="" NO_MYSQL="_at_comment " PGSQL="_at_comment " NO_PGSQL="" PYTHON="_at_comment " NO_PYTHON="" RUBY="_at_comment " NO_RUBY="" PREFIX=/usr/local LOCALBASE=/usr/local  DATADIR=/usr/local/share/quickfix DOCSDIR=/usr/local/share/doc/quickfix EXAMPLESDIR=/usr/local/share/examples/quickfix  WWWDIR=/usr/local/www/quickfix ETCDIR=/usr/local/etc/quickfix
--End SUB_LIST--

---Begin make.conf---
USE_PACKAGE_DEPENDS=yes
BATCH=yes
WRKDIRPREFIX=/wrkdirs
PORTSDIR=/usr/ports
PACKAGES=/packages
DISTDIR=/distfiles
PACKAGE_BUILDING=yes
PACKAGE_BUILDING_FLAVORS=yes
#### /usr/local/etc/poudriere.d/make.conf ####
# XXX: We really need this but cannot use it while 'make checksum' does not
# try the next mirror on checksum failure.  It currently retries the same
# failed mirror and then fails rather then trying another.  It *does*
# try the next if the size is mismatched though.
#MASTER_SITE_FREEBSD=yes
# Build ALLOW_MAKE_JOBS_PACKAGES with 2 jobs
MAKE_JOBS_NUMBER=2
#### /usr/ports/Mk/Scripts/ports_env.sh ####
_CCVERSION_921dbbb2=cc (GCC) 4.2.1 20070831 patched [FreeBSD] Copyright (C) 2007 Free Software Foundation, Inc. This is free software; see the source for copying conditions. There is NO warranty; not even for MERCHANTABILITY or FITNESS FOR A PARTICULAR PURPOSE.
_ALTCCVERSION_921dbbb2=none
_CXXINTERNAL_acaad9ca=Using built-in specs. Target: powerpc64-undermydesk-freebsd Configured with: FreeBSD/powerpc64 system compiler Thread model: posix gcc version 4.2.1 20070831 patched [FreeBSD] "/usr/bin/ld" "--eh-frame-hdr" "-Qy" "-melf64ppc_fbsd" "--enable-new-dtags" "-dynamic-linker" "/libexec/ld-elf.so.1" "/usr/lib/crt1.o" "/usr/lib/crti.o" "/usr/lib/crtbegin.o" "-L/usr/lib" "-L/usr/lib" "/dev/null" "-lstdc++" "-lm" "-lgcc_s" "-lgcc" "-lc" "-lgcc_s" "-lgcc" "/usr/lib/crtsavres.o" "/usr/lib/crtend.o" "/usr/lib/crtn.o"
CC_OUTPUT_921dbbb2_58173849=yes
CC_OUTPUT_921dbbb2_9bdba57c=yes
CC_OUTPUT_921dbbb2_6a4fe7f5=cc1: error: unrecognized command line option "-std=c11"
CC_OUTPUT_921dbbb2_6bcac02b=yes
CC_OUTPUT_921dbbb2_67d20829=yes
CC_OUTPUT_921dbbb2_bfa62e83=cc1: error: unrecognized command line option "-std=gnu11"
CC_OUTPUT_921dbbb2_f0b4d593=yes
CC_OUTPUT_921dbbb2_308abb44=cc1plus: error: unrecognized command line option "-std=c++0x"
CC_OUTPUT_921dbbb2_f00456e5=cc1plus: error: unrecognized command line option "-std=c++11"
CC_OUTPUT_921dbbb2_65ad290d=cc1plus: error: unrecognized command line option "-std=c++14"
CC_OUTPUT_921dbbb2_f2776b26=cc1plus: error: unrecognized command line option "-std=c++17"
CC_OUTPUT_921dbbb2_b2657cc3=yes
CC_OUTPUT_921dbbb2_380987f7=cc1plus: error: unrecognized command line option "-std=gnu++11"
CC_OUTPUT_921dbbb2_160933ec=cc1plus: error: unrecognized command line option "-std=gnu++14"
CC_OUTPUT_921dbbb2_fb62803b=cc1plus: error: unrecognized command line option "-std=gnu++17"
_OBJC_CCVERSION_921dbbb2=cc (GCC) 4.2.1 20070831 patched [FreeBSD] Copyright (C) 2007 Free Software Foundation, Inc. This is free software; see the source for copying conditions. There is NO warranty; not even for MERCHANTABILITY or FITNESS FOR A PARTICULAR PURPOSE.
_OBJC_ALTCCVERSION_921dbbb2=none
ARCH=powerpc64
PPC_ABI=ELFv1
OPSYS=FreeBSD
_OSRELEASE=12.2-RELEASE
OSREL=12.2
OSVERSION=1202000
PYTHONBASE=/usr/local
CONFIGURE_MAX_CMD_LEN=524288
HAVE_PORTS_ENV=1
#### Misc Poudriere ####
GID=0
UID=0
---End make.conf---
--Resource limits--
cpu time               (seconds, -t)  unlimited
file size           (512-blocks, -f)  unlimited
data seg size           (kbytes, -d)  33554432
stack size              (kbytes, -s)  524288
core file size      (512-blocks, -c)  unlimited
max memory size         (kbytes, -m)  unlimited
locked memory           (kbytes, -l)  unlimited
max user processes              (-u)  89999
open files                      (-n)  1024
virtual mem size        (kbytes, -v)  unlimited
swap limit              (kbytes, -w)  unlimited
socket buffer size       (bytes, -b)  unlimited
pseudo-terminals                (-p)  unlimited
kqueues                         (-k)  unlimited
umtx shared locks               (-o)  unlimited
--End resource limits--
=======================<phase: check-sanity   >============================
===>  License GPLv3+ accepted by the user
===========================================================================
=======================<phase: pkg-depends    >============================
===>   quickfix-1.15.1 depends on file: /usr/local/sbin/pkg - not found
===>   Installing existing package /packages/All/pkg-1.16.3.txz
[122powerpc64-quarterly-job-13] Installing pkg-1.16.3...
[122powerpc64-quarterly-job-13] Extracting pkg-1.16.3: .......... done
===>   quickfix-1.15.1 depends on file: /usr/local/sbin/pkg - found
===>   Returning to build of quickfix-1.15.1
===========================================================================
=======================<phase: fetch-depends  >============================
===========================================================================
=======================<phase: fetch          >============================
===>  License GPLv3+ accepted by the user
===> Fetching all distfiles required by quickfix-1.15.1 for building
===========================================================================
=======================<phase: checksum       >============================
===>  License GPLv3+ accepted by the user
===> Fetching all distfiles required by quickfix-1.15.1 for building
=> SHA256 Checksum OK for quickfix-quickfix-v1.15.1_GH0.tar.gz.
===========================================================================
=======================<phase: extract-depends>============================
===========================================================================
=======================<phase: extract        >============================
===>  License GPLv3+ accepted by the user
===> Fetching all distfiles required by quickfix-1.15.1 for building
===>  Extracting for quickfix-1.15.1
=> SHA256 Checksum OK for quickfix-quickfix-v1.15.1_GH0.tar.gz.
===========================================================================
=======================<phase: patch-depends  >============================
===========================================================================
=======================<phase: patch          >============================
===>  Patching for quickfix-1.15.1
===>  Applying FreeBSD patches for quickfix-1.15.1 from /usr/ports/finance/quickfix/files
===========================================================================
=======================<phase: build-depends  >============================
===>   quickfix-1.15.1 depends on executable: bash - not found
===>   Installing existing package /packages/All/bash-5.1.4_1.txz
[122powerpc64-quarterly-job-13] Installing bash-5.1.4_1...
[122powerpc64-quarterly-job-13] `-- Installing gettext-runtime-0.21...
[122powerpc64-quarterly-job-13] |   `-- Installing indexinfo-0.3.1...
[122powerpc64-quarterly-job-13] |   `-- Extracting indexinfo-0.3.1: .... done
[122powerpc64-quarterly-job-13] `-- Extracting gettext-runtime-0.21: .......... done
[122powerpc64-quarterly-job-13] `-- Installing readline-8.1.0...
[122powerpc64-quarterly-job-13] `-- Extracting readline-8.1.0: .......... done
[122powerpc64-quarterly-job-13] Extracting bash-5.1.4_1: .......... done
===>   quickfix-1.15.1 depends on executable: bash - found
===>   Returning to build of quickfix-1.15.1
===>   quickfix-1.15.1 depends on package: gmake>=4.3 - not found
<snip>
checking whether g++10 accepts -g... yes
checking whether gmake supports the include directive... yes (GNU style)
checking dependency style of g++10... gcc3
checking for gcc... gcc10
checking whether we are using the GNU C compiler... yes
checking whether gcc10 accepts -g... yes
checking for gcc10 option to accept ISO C89... none needed
checking whether gcc10 understands -c and -o together... yes
checking dependency style of gcc10... gcc3
checking how to run the C preprocessor... cpp10
checking build system type... powerpc64-unknown-freebsd12.2
checking host system type... powerpc64-unknown-freebsd12.2
checking how to print strings... printf
checking for a sed that does not truncate output... /usr/bin/sed
checking for grep that handles long lines and -e... /usr/bin/grep
checking for egrep... /usr/bin/grep -E
checking for fgrep... /usr/bin/grep -F
checking for ld used by gcc10... /usr/local/bin/ld
checking if the linker (/usr/local/bin/ld) is GNU ld... yes
checking for BSD- or MS-compatible name lister (nm)... /usr/local/bin/nm -B
checking the name lister (/usr/local/bin/nm -B) interface... BSD nm
checking whether ln -s works... yes
checking the maximum length of command line arguments... 393216
checking how to convert powerpc64-unknown-freebsd12.2 file names to powerpc64-unknown-freebsd12.2 format... func_convert_file_noop
checking how to convert powerpc64-unknown-freebsd12.2 file names to toolchain format... func_convert_file_noop
checking for /usr/local/bin/ld option to reload object files... -r
checking for objdump... objdump
checking how to recognize dependent libraries... pass_all
checking for dlltool... dlltool
checking how to associate runtime and link libraries... printf %s\n
checking for ar... ar
checking for archiver _at_FILE support... no
checking for strip... strip
checking for ranlib... ranlib
checking command to parse /usr/local/bin/nm -B output from gcc10 object... ok
checking for sysroot... no
checking for a working dd... /bin/dd
checking how to truncate binary pipes... /bin/dd bs=4096 count=1
checking for mt... mt
checking if mt is a manifest tool... no
checking for ANSI C header files... yes
checking for sys/types.h... yes
checking for sys/stat.h... yes
checking for stdlib.h... yes
checking for string.h... yes
checking for memory.h... yes
checking for strings.h... yes
checking for inttypes.h... yes
checking for stdint.h... yes
checking for unistd.h... yes
checking for dlfcn.h... yes
checking for objdir... .libs
checking if gcc10 supports -fno-rtti -fno-exceptions... no
checking for gcc10 option to produce PIC... -fPIC -DPIC
checking if gcc10 PIC flag -fPIC -DPIC works... yes
checking if gcc10 static flag -static works... yes
checking if gcc10 supports -c -o file.o... yes
checking if gcc10 supports -c -o file.o... (cached) yes
checking whether the gcc10 linker (/usr/local/bin/ld) supports shared libraries... yes
checking whether -lc should be explicitly linked in... no
checking dynamic linker characteristics... freebsd12.2 ld.so
checking how to hardcode library paths into programs... immediate
checking whether stripping libraries is possible... yes
checking if libtool supports shared libraries... yes
checking whether to build shared libraries... yes
checking whether to build static libraries... no
checking how to run the C++ preprocessor... g++10 -E
checking for ld used by g++10... /usr/local/bin/ld
checking if the linker (/usr/local/bin/ld) is GNU ld... yes
checking whether the g++10 linker (/usr/local/bin/ld) supports shared libraries... yes
checking for g++10 option to produce PIC... -fPIC -DPIC
checking if g++10 PIC flag -fPIC -DPIC works... yes
checking if g++10 static flag -static works... yes
checking if g++10 supports -c -o file.o... yes
checking if g++10 supports -c -o file.o... (cached) yes
checking whether the g++10 linker (/usr/local/bin/ld) supports shared libraries... yes
checking dynamic linker characteristics... freebsd12.2 ld.so
checking how to hardcode library paths into programs... immediate
checking for flex... flex
checking lex output file root... lex.yy
checking lex library... -lfl
checking whether yytext is a pointer... yes
checking for SSL support (openssl)... configure: openssl disabled
./configure: ruby: not found
./configure: build_no_unit_test: not found
checking for shutdown in -lc... yes
checking for inet_addr in -lc... yes
checking for nanosleep in -lc... yes
checking for ftime in -lcompat... yes
checking for clock_gettime... yes
checking for clock_get_time... no
checking which threading environment to use... -pthread
checking stdio.h usability... yes
checking stdio.h presence... yes
checking for stdio.h... yes
checking for STREAMS ioctl... no
checking for socklen_t... yes
checking for ftime... no
checking for set_terminate in the global namespace... no
checking for set_terminate in the std namespace... yes
checking for std::tr1::shared_ptr... yes
checking for std::shared_ptr... yes
checking for boost::shared_ptr... yes
checking for typeinfo in the global namespace... no
checking for typeinfo in the std namespace... yes
checking for gethostbyname_r with input result... yes
checking for cplus_demangle in -liberty... no
checking if select modifies timeval parameter... no
checking that generated files are newer than configure... done
configure: creating ./config.status
config.status: creating quickfix.pc
config.status: creating Makefile
config.status: creating src/Makefile
config.status: creating src/C++/Makefile
config.status: creating src/C++/test/Makefile
config.status: creating src/python2/Makefile
config.status: creating src/python3/Makefile
config.status: creating src/ruby/Makefile
config.status: creating bin/Makefile
config.status: creating bin/cfg/Makefile
config.status: creating spec/Makefile
config.status: creating test/Makefile
config.status: creating test/atrun/Makefile
config.status: creating test/cfg/Makefile
config.status: creating test/definitions/Makefile
config.status: creating test/definitions/server/Makefile
config.status: creating test/definitions/server/future/Makefile
config.status: creating examples/Makefile
config.status: creating examples/executor/Makefile
config.status: creating examples/executor/C++/Makefile
config.status: creating examples/ordermatch/Makefile
config.status: creating examples/ordermatch/test/Makefile
config.status: creating examples/tradeclient/Makefile
config.status: creating examples/tradeclientgui/Makefile
config.status: creating examples/tradeclientgui/banzai/Makefile
config.status: creating examples/tradeclientgui/banzai/test/Makefile
config.status: creating examples/tradeclientgui/banzai/src/Makefile
config.status: creating examples/tradeclientgui/banzai/src/quickfix/Makefile
config.status: creating examples/tradeclientgui/banzai/src/quickfix/banzai/Makefile
config.status: creating examples/tradeclientgui/banzai/src/quickfix/banzai/ui/Makefile
config.status: creating doc/Makefile
config.status: creating doc/html/Makefile
config.status: creating config.h
config.status: executing depfiles commands
config.status: executing libtool commands
===========================================================================
=======================<phase: build          >============================
===>  Building for quickfix-1.15.1
gmake -C /wrkdirs/usr/ports/finance/quickfix/work/quickfix-1.15.1/UnitTest++ TestUnitTest++
gmake[1]: Entering directory '/wrkdirs/usr/ports/finance/quickfix/work/quickfix-1.15.1/UnitTest++'
src/AssertException.cpp
src/Test.cpp
src/Checks.cpp
src/TestRunner.cpp
src/TestResults.cpp
src/TestReporter.cpp
src/TestReporterStdout.cpp
src/ReportAssert.cpp
src/TestList.cpp
src/TimeConstraint.cpp
src/TestDetails.cpp
src/MemoryOutStream.cpp
src/DeferredTestReporter.cpp
src/DeferredTestResult.cpp
src/XmlTestReporter.cpp
src/CurrentTest.cpp
src/Posix/SignalTranslator.cpp
src/Posix/TimeHelpers.cpp
Creating libUnitTest++.a library...
src/tests/Main.cpp
src/tests/TestAssertHandler.cpp
src/tests/TestChecks.cpp
src/tests/TestUnitTest++.cpp
src/tests/TestTest.cpp
src/tests/TestTestResults.cpp
src/tests/TestTestRunner.cpp
src/tests/TestCheckMacros.cpp
src/tests/TestTestList.cpp
src/tests/TestTestMacros.cpp
src/tests/TestTestMacros.cpp: In destructor '{anonymous}::FixtureDtorThrows::~FixtureDtorThrows()':
src/tests/TestTestMacros.cpp:134:25: warning: in C++11 this 'throw' will call 'terminate' because destructors default to 'noexcept' [-Wc++11-compat]
  134 |  ~FixtureDtorThrows() { throw "exception"; }
      |                         ^~~~~~~~~~~~~~~~~
At global scope:
cc1plus: note: unrecognized command-line option '-Wno-unused-private-field' may have been intended to silence earlier diagnostics
src/tests/TestTimeConstraint.cpp
src/tests/TestTimeConstraintMacro.cpp
src/tests/TestMemoryOutStream.cpp
src/tests/TestDeferredTestReporter.cpp
src/tests/TestXmlTestReporter.cpp
src/tests/TestCurrentTest.cpp
Linking TestUnitTest++...
Running unit tests...
ld-elf.so.1: /usr/lib/libstdc++.so.6: version GLIBCXX_3.4.20 required by /wrkdirs/usr/ports/finance/quickfix/work/quickfix-1.15.1/UnitTest++/TestUnitTest++ not found
gmake[1]: *** [Makefile:82: TestUnitTest++] Error 1
gmake[1]: Leaving directory '/wrkdirs/usr/ports/finance/quickfix/work/quickfix-1.15.1/UnitTest++'
*** Error code 2

Stop.
make: stopped in /usr/ports/finance/quickfix
Received on Tue Jun 29 2021 - 04:31:22 UTC

Original text of this message