[package - main-i386-default][databases/tarantool] Failed for tarantool-2.8.1 in build

From: <pkg-fallout_at_FreeBSD.org>
Date: Tue, 29 Jun 2021 03:24:34 GMT
You are receiving this mail as a port that you maintain
is failing to build on the FreeBSD package build server.
Please investigate the failure and submit a PR to fix
build.

Maintainer:     sunpoet_at_FreeBSD.org
Log URL:        http://beefy17.nyi.freebsd.org/data/main-i386-default/p1ac2d7ea8e41_sf94360971e/logs/tarantool-2.8.1.log
Build URL:      http://beefy17.nyi.freebsd.org/build.html?mastername=main-i386-default&build=p1ac2d7ea8e41_sf94360971e
Log:

=>> Building databases/tarantool
build started at Tue Jun 29 03:19:19 UTC 2021
port directory: /usr/ports/databases/tarantool
package name: tarantool-2.8.1
building for: FreeBSD main-i386-default-job-04 14.0-CURRENT FreeBSD 14.0-CURRENT 1400024 i386
maintained by: sunpoet_at_FreeBSD.org
Makefile ident: 
Poudriere version: 3.2.8-8-gaf08dbda
Host OSVERSION: 1400008
Jail OSVERSION: 1400024
Job Id: 04




!!! Jail is newer than host. (Jail: 1400024, Host: 1400008) !!!
!!! This is not supported. !!!
!!! Host kernel must be same or newer than jail. !!!
!!! Expect build failures. !!!



---Begin Environment---
SHELL=/bin/csh
UNAME_p=i386
UNAME_m=i386
OSVERSION=1400024
UNAME_v=FreeBSD 14.0-CURRENT 1400024
UNAME_r=14.0-CURRENT
BLOCKSIZE=K
MAIL=/var/mail/root
MM_CHARSET=UTF-8
LANG=C.UTF-8
STATUS=1
HOME=/root
PATH=/sbin:/bin:/usr/sbin:/usr/bin:/usr/local/sbin:/usr/local/bin:/root/bin
LOCALBASE=/usr/local
USER=root
LIBEXECPREFIX=/usr/local/libexec/poudriere
POUDRIERE_VERSION=3.2.8-8-gaf08dbda
MASTERMNT=/usr/local/poudriere/data/.m/main-i386-default/ref
POUDRIERE_BUILD_TYPE=bulk
PACKAGE_BUILDING=yes
SAVED_TERM=
PWD=/usr/local/poudriere/data/.m/main-i386-default/ref/.p/pool
P_PORTS_FEATURES=FLAVORS SELECTED_OPTIONS
MASTERNAME=main-i386-default
SCRIPTPREFIX=/usr/local/share/poudriere
OLDPWD=/usr/local/poudriere/data/.m/main-i386-default/ref/.p
SCRIPTPATH=/usr/local/share/poudriere/bulk.sh
POUDRIEREPATH=/usr/local/bin/poudriere
---End Environment---

---Begin Poudriere Port Flags/Env---
PORT_FLAGS=
PKGENV=
FLAVOR=
DEPENDS_ARGS=
MAKE_ARGS=
---End Poudriere Port Flags/Env---

---Begin OPTIONS List---
===> The following configuration options are available for tarantool-2.8.1:
     DEBUG=off: Build with debugging support
===> Use 'make config' to modify these settings
---End OPTIONS List---

--MAINTAINER--
sunpoet_at_FreeBSD.org
--End MAINTAINER--

--CONFIGURE_ARGS--

--End CONFIGURE_ARGS--

--CONFIGURE_ENV--
MAKE=gmake ac_cv_path_PERL=/usr/local/bin/perl ac_cv_path_PERL_PATH=/usr/local/bin/perl  PERL_USE_UNSAFE_INC=1 XDG_DATA_HOME=/wrkdirs/usr/ports/databases/tarantool/work  XDG_CONFIG_HOME=/wrkdirs/usr/ports/databases/tarantool/work  HOME=/wrkdirs/usr/ports/databases/tarantool/work TMPDIR="/tmp" PATH=/wrkdirs/usr/ports/databases/tarantool/work/.bin:/sbin:/bin:/usr/sbin:/usr/bin:/usr/local/sbin:/usr/local/bin:/root/bin SHELL=/bin/sh CONFIG_SHELL=/bin/sh
--End CONFIGURE_ENV--

--MAKE_ENV--
PERL_USE_UNSAFE_INC=1 OPENSSLBASE=/usr OPENSSLDIR=/etc/ssl OPENSSLINC=/usr/include OPENSSLLIB=/usr/lib XDG_DATA_HOME=/wrkdirs/usr/ports/databases/tarantool/work  XDG_CONFIG_HOME=/wrkdirs/usr/ports/databases/tarantool/work  HOME=/wrkdirs/usr/ports/databases/tarantool/work TMPDIR="/tmp" PATH=/wrkdirs/usr/ports/databases/tarantool/work/.bin:/sbin:/bin:/usr/sbin:/usr/bin:/usr/local/sbin:/usr/local/bin:/root/bin NO_PIE=yes MK_DEBUG_FILES=no MK_KERNEL_SYMBOLS=no SHELL=/bin/sh NO_LINT=YES PREFIX=/usr/local  LOCALBASE=/usr/local  CC="cc" CFLAGS="-O2 -pipe  -DLIBICONV_PLUG -fstack-protector-strong -fno-strict-aliasing "  CPP="cpp" CPPFLAGS="-DLIBICONV_PLUG -I/usr/local/include"  LDFLAGS=" -L/usr/local/lib  -fstack-protector-strong " LIBS=""  CXX="c++" CXXFLAGS="-O2 -pipe -DLIBICONV_PLUG -fstack-protector-strong -fno-strict-aliasing  -DLIBICONV_PLUG "  MANPREFIX="/usr/local" BSD_INSTALL_PROGRAM="install  -s -m 555"  BSD_INSTALL_LIB="install  -s -m 0644"  BSD_INSTALL_SCRIPT="install  -m 555"  B
 SD_INSTALL_DATA="install  -m 0644"  BSD_INSTALL_MAN="install  -m 444"
--End MAKE_ENV--

--PLIST_SUB--
TT_DATADIR=/var/db/tarantool  TT_LOGDIR=/var/log/tarantool CMAKE_BUILD_TYPE="release" OSREL=14.0 PREFIX=%D LOCALBASE=/usr/local  RESETPREFIX=/usr/local LIB32DIR=lib PERL_VERSION=5.32.1  PERL_VER=5.32  PERL5_MAN1=lib/perl5/site_perl/man/man1  PERL5_MAN3=lib/perl5/site_perl/man/man3  SITE_PERL=lib/perl5/site_perl  SITE_ARCH=lib/perl5/site_perl/mach/5.32 DOCSDIR="share/doc/tarantool"  EXAMPLESDIR="share/examples/tarantool"  DATADIR="share/tarantool"  WWWDIR="www/tarantool"  ETCDIR="etc/tarantool"
--End PLIST_SUB--

--SUB_LIST--
PREFIX=/usr/local LOCALBASE=/usr/local  DATADIR=/usr/local/share/tarantool DOCSDIR=/usr/local/share/doc/tarantool EXAMPLESDIR=/usr/local/share/examples/tarantool  WWWDIR=/usr/local/www/tarantool ETCDIR=/usr/local/etc/tarantool
--End SUB_LIST--

---Begin make.conf---
USE_PACKAGE_DEPENDS=yes
BATCH=yes
WRKDIRPREFIX=/wrkdirs
PORTSDIR=/usr/ports
PACKAGES=/packages
DISTDIR=/distfiles
PACKAGE_BUILDING=yes
PACKAGE_BUILDING_FLAVORS=yes
MACHINE=i386
MACHINE_ARCH=i386
ARCH=${MACHINE_ARCH}
#### /usr/local/etc/poudriere.d/make.conf ####
# XXX: We really need this but cannot use it while 'make checksum' does not
# try the next mirror on checksum failure.  It currently retries the same
# failed mirror and then fails rather then trying another.  It *does*
# try the next if the size is mismatched though.
#MASTER_SITE_FREEBSD=yes
# Build ALLOW_MAKE_JOBS_PACKAGES with 2 jobs
MAKE_JOBS_NUMBER=2
#### /usr/ports/Mk/Scripts/ports_env.sh ####
_CCVERSION_921dbbb2=FreeBSD clang version 12.0.1 (git_at_github.com:llvm/llvm-project.git llvmorg-12.0.1-rc2-0-ge7dac564cd0e) Target: i386-unknown-freebsd14.0 Thread model: posix InstalledDir: /usr/bin
_ALTCCVERSION_921dbbb2=none
_CXXINTERNAL_acaad9ca=FreeBSD clang version 12.0.1 (git_at_github.com:llvm/llvm-project.git llvmorg-12.0.1-rc2-0-ge7dac564cd0e) Target: i386-unknown-freebsd14.0 Thread model: posix InstalledDir: /usr/bin "/usr/bin/ld" "--eh-frame-hdr" "-dynamic-linker" "/libexec/ld-elf.so.1" "--hash-style=both" "--enable-new-dtags" "-m" "elf_i386_fbsd" "-o" "a.out" "/usr/lib/crt1.o" "/usr/lib/crti.o" "/usr/lib/crtbegin.o" "-L/usr/lib" "/dev/null" "-lc++" "-lm" "-lgcc" "--as-needed" "-lgcc_s" "--no-as-needed" "-lc" "-lgcc" "--as-needed" "-lgcc_s" "--no-as-needed" "/usr/lib/crtend.o" "/usr/lib/crtn.o"
CC_OUTPUT_921dbbb2_58173849=yes
CC_OUTPUT_921dbbb2_9bdba57c=yes
CC_OUTPUT_921dbbb2_6a4fe7f5=yes
CC_OUTPUT_921dbbb2_6bcac02b=yes
CC_OUTPUT_921dbbb2_67d20829=yes
CC_OUTPUT_921dbbb2_bfa62e83=yes
CC_OUTPUT_921dbbb2_f0b4d593=yes
CC_OUTPUT_921dbbb2_308abb44=yes
CC_OUTPUT_921dbbb2_f00456e5=yes
CC_OUTPUT_921dbbb2_65ad290d=yes
CC_OUTPUT_921dbbb2_f2776b26=yes
CC_OUTPUT_921dbbb2_b2657cc3=yes
CC_OUTPUT_921dbbb2_380987f7=yes
CC_OUTPUT_921dbbb2_160933ec=yes
CC_OUTPUT_921dbbb2_fb62803b=yes
_OBJC_CCVERSION_921dbbb2=FreeBSD clang version 12.0.1 (git_at_github.com:llvm/llvm-project.git llvmorg-12.0.1-rc2-0-ge7dac564cd0e) Target: i386-unknown-freebsd14.0 Thread model: posix InstalledDir: /usr/bin
_OBJC_ALTCCVERSION_921dbbb2=none
ARCH=i386
OPSYS=FreeBSD
_OSRELEASE=14.0-CURRENT
OSREL=14.0
OSVERSION=1400024
PYTHONBASE=/usr/local
CONFIGURE_MAX_CMD_LEN=524288
HAVE_PORTS_ENV=1
#### Misc Poudriere ####
GID=0
UID=0
---End make.conf---
--Resource limits--
cpu time               (seconds, -t)  unlimited
file size           (512-blocks, -f)  unlimited
data seg size           (kbytes, -d)  524288
stack size              (kbytes, -s)  65536
core file size      (512-blocks, -c)  unlimited
max memory size         (kbytes, -m)  unlimited
locked memory           (kbytes, -l)  unlimited
max user processes              (-u)  89999
open files                      (-n)  1024
virtual mem size        (kbytes, -v)  unlimited
swap limit              (kbytes, -w)  unlimited
socket buffer size       (bytes, -b)  unlimited
pseudo-terminals                (-p)  unlimited
kqueues                         (-k)  unlimited
umtx shared locks               (-o)  unlimited
--End resource limits--
=======================<phase: check-sanity   >============================
===>  License BSD2CLAUSE accepted by the user
===========================================================================
=======================<phase: pkg-depends    >============================
===>   tarantool-2.8.1 depends on file: /usr/local/sbin/pkg - not found
===>   Installing existing package /packages/All/pkg-1.16.3.txz
[main-i386-default-job-04] Installing pkg-1.16.3...
[main-i386-default-job-04] Extracting pkg-1.16.3: .......... done
===>   tarantool-2.8.1 depends on file: /usr/local/sbin/pkg - found
===>   Returning to build of tarantool-2.8.1
===========================================================================
=======================<phase: fetch-depends  >============================
===========================================================================
=======================<phase: fetch          >============================
===>  License BSD2CLAUSE accepted by the user
===> Fetching all distfiles required by tarantool-2.8.1 for building
===========================================================================
=======================<phase: checksum       >============================
===>  License BSD2CLAUSE accepted by the user
===> Fetching all distfiles required by tarantool-2.8.1 for building
=> SHA256 Checksum OK for tarantool-tarantool-2.8.1_GH0.tar.gz.
=> SHA256 Checksum OK for luafun-luafun-e248e00_GH0.tar.gz.
=> SHA256 Checksum OK for tarantool-decNumber-5ddfde1_GH0.tar.gz.
=> SHA256 Checksum OK for tarantool-luajit-789820a_GH0.tar.gz.
=> SHA256 Checksum OK for tarantool-luarocks-954c2f5_GH0.tar.gz.
=> SHA256 Checksum OK for tarantool-serpent-879580f_GH0.tar.gz.
=> SHA256 Checksum OK for tarantool-small-279fa38_GH0.tar.gz.
=> SHA256 Checksum OK for tarantool-test-run-1263cb5_GH0.tar.gz.
===========================================================================
=======================<phase: extract-depends>============================
===========================================================================
=======================<phase: extract        >============================
===>  License BSD2CLAUSE accepted by the user
===> Fetching all distfiles required by tarantool-2.8.1 for building
===>  Extracting for tarantool-2.8.1
=> SHA256 Checksum OK for tarantool-tarantool-2.8.1_GH0.tar.gz.
=> SHA256 Checksum OK for luafun-luafun-e248e00_GH0.tar.gz.
=> SHA256 Checksum OK for tarantool-decNumber-5ddfde1_GH0.tar.gz.
<snip>
[ 81%] Built target histogram.test
gmake  -f test/unit/CMakeFiles/coio.test.dir/build.make test/unit/CMakeFiles/coio.test.dir/depend
gmake[3]: Entering directory '/wrkdirs/usr/ports/databases/tarantool/work/.build'
cd /wrkdirs/usr/ports/databases/tarantool/work/.build && /usr/local/bin/cmake -E cmake_depends "Unix Makefiles" /wrkdirs/usr/ports/databases/tarantool/work/tarantool-2.8.1 /wrkdirs/usr/ports/databases/tarantool/work/tarantool-2.8.1/test/unit /wrkdirs/usr/ports/databases/tarantool/work/.build /wrkdirs/usr/ports/databases/tarantool/work/.build/test/unit /wrkdirs/usr/ports/databases/tarantool/work/.build/test/unit/CMakeFiles/coio.test.dir/DependInfo.cmake
gmake[3]: Leaving directory '/wrkdirs/usr/ports/databases/tarantool/work/.build'
gmake  -f test/unit/CMakeFiles/coio.test.dir/build.make test/unit/CMakeFiles/coio.test.dir/build
gmake[3]: Entering directory '/wrkdirs/usr/ports/databases/tarantool/work/.build'
[ 81%] Building CXX object test/unit/CMakeFiles/coio.test.dir/coio.cc.o
cd /wrkdirs/usr/ports/databases/tarantool/work/.build/test/unit && /usr/bin/c++ -DCORO_ASM -DLUAJIT_SMART_STRINGS=1 -DNDEBUG -DNVALGRIND -DNVALGRIND=1 -D__STDC_CONSTANT_MACROS=1 -D__STDC_FORMAT_MACROS=1 -D__STDC_LIMIT_MACROS=1 -I/wrkdirs/usr/ports/databases/tarantool/work/tarantool-2.8.1/src -I/wrkdirs/usr/ports/databases/tarantool/work/.build/src -I/wrkdirs/usr/ports/databases/tarantool/work/tarantool-2.8.1/src/lib -I/wrkdirs/usr/ports/databases/tarantool/work/tarantool-2.8.1/src/lib/small -I/wrkdirs/usr/ports/databases/tarantool/work/tarantool-2.8.1/src/lib/small/third_party -I/wrkdirs/usr/ports/databases/tarantool/work/tarantool-2.8.1/src/lib/core -I/wrkdirs/usr/ports/databases/tarantool/work/tarantool-2.8.1 -I/wrkdirs/usr/ports/databases/tarantool/work/tarantool-2.8.1/third_party/luajit/src -I/wrkdirs/usr/ports/databases/tarantool/work/.build/third_party/luajit/src -I/usr/local/include -I/wrkdirs/usr/ports/databases/tarantool/work/tarantool-2.8.1/src/box -I/wrkdirs/usr/ports/data
 bases/tarantool/work/tarantool-2.8.1/third_party -O2 -pipe -DLIBICONV_PLUG -fstack-protector-strong -fno-strict-aliasing  -DLIBICONV_PLUG -fexceptions -funwind-tables -fno-common -fopenmp -std=c++11 -Wall -Wextra -Wno-strict-aliasing -Wno-char-subscripts -Wno-invalid-offsetof -Wno-gnu-alignof-expression -Wno-unused-parameter -Wno-unused -Wno-unused-result -Wno-tautological-compare -O2 -pipe -DLIBICONV_PLUG -fstack-protector-strong -fno-strict-aliasing  -DLIBICONV_PLUG -MD -MT test/unit/CMakeFiles/coio.test.dir/coio.cc.o -MF CMakeFiles/coio.test.dir/coio.cc.o.d -o CMakeFiles/coio.test.dir/coio.cc.o -c /wrkdirs/usr/ports/databases/tarantool/work/tarantool-2.8.1/test/unit/coio.cc
[ 82%] Building C object test/unit/CMakeFiles/coio.test.dir/core_test_utils.c.o
cd /wrkdirs/usr/ports/databases/tarantool/work/.build/test/unit && /usr/bin/cc -DCORO_ASM -DLUAJIT_SMART_STRINGS=1 -DNDEBUG -DNVALGRIND -DNVALGRIND=1 -D__STDC_CONSTANT_MACROS=1 -D__STDC_FORMAT_MACROS=1 -D__STDC_LIMIT_MACROS=1 -I/wrkdirs/usr/ports/databases/tarantool/work/tarantool-2.8.1/src -I/wrkdirs/usr/ports/databases/tarantool/work/.build/src -I/wrkdirs/usr/ports/databases/tarantool/work/tarantool-2.8.1/src/lib -I/wrkdirs/usr/ports/databases/tarantool/work/tarantool-2.8.1/src/lib/small -I/wrkdirs/usr/ports/databases/tarantool/work/tarantool-2.8.1/src/lib/small/third_party -I/wrkdirs/usr/ports/databases/tarantool/work/tarantool-2.8.1/src/lib/core -I/wrkdirs/usr/ports/databases/tarantool/work/tarantool-2.8.1 -I/wrkdirs/usr/ports/databases/tarantool/work/tarantool-2.8.1/third_party/luajit/src -I/wrkdirs/usr/ports/databases/tarantool/work/.build/third_party/luajit/src -I/usr/local/include -I/wrkdirs/usr/ports/databases/tarantool/work/tarantool-2.8.1/src/box -I/wrkdirs/usr/ports/datab
 ases/tarantool/work/tarantool-2.8.1/third_party -O2 -pipe  -DLIBICONV_PLUG -fstack-protector-strong -fno-strict-aliasing -fexceptions -funwind-tables -fno-common -fopenmp -std=c11 -Wall -Wextra -Wno-strict-aliasing -Wno-char-subscripts -Wno-gnu-alignof-expression -Wno-unused-parameter -Wno-unused -Wno-unused-result -Wno-tautological-compare -O2 -pipe  -DLIBICONV_PLUG -fstack-protector-strong -fno-strict-aliasing -MD -MT test/unit/CMakeFiles/coio.test.dir/core_test_utils.c.o -MF CMakeFiles/coio.test.dir/core_test_utils.c.o.d -o CMakeFiles/coio.test.dir/core_test_utils.c.o -c /wrkdirs/usr/ports/databases/tarantool/work/tarantool-2.8.1/test/unit/core_test_utils.c
[ 82%] Linking CXX executable coio.test
cd /wrkdirs/usr/ports/databases/tarantool/work/.build/test/unit && /usr/local/bin/cmake -E cmake_link_script CMakeFiles/coio.test.dir/link.txt --verbose=1
/usr/bin/c++ -O2 -pipe -DLIBICONV_PLUG -fstack-protector-strong -fno-strict-aliasing  -DLIBICONV_PLUG -fexceptions -funwind-tables -fno-common -fopenmp -std=c++11 -Wall -Wextra -Wno-strict-aliasing -Wno-char-subscripts -Wno-invalid-offsetof -Wno-gnu-alignof-expression -Wno-unused-parameter -Wno-unused -Wno-unused-result -Wno-tautological-compare -O2 -pipe -DLIBICONV_PLUG -fstack-protector-strong -fno-strict-aliasing  -DLIBICONV_PLUG  -L/usr/local/lib  -fstack-protector-strong CMakeFiles/coio.test.dir/coio.cc.o CMakeFiles/coio.test.dir/core_test_utils.c.o -o coio.test  -Wl,-rpath,/usr/local/lib ../../src/lib/core/libcore.a ../../libeio.a ../../src/lib/bit/libbit.a ../../src/lib/uri/liburi.a libunit.a -lpthread ../../src/lib/salad/libsalad.a ../../src/lib/small/libsmall.a ../../libdecNumber.a ../../libev.a -lm ../../libcoro.a /usr/local/lib/libmsgpuck.so /usr/local/lib/libicui18n.so /usr/local/lib/libicuuc.so /usr/local/lib/libicudata.so 
gmake[3]: Leaving directory '/wrkdirs/usr/ports/databases/tarantool/work/.build'
[ 82%] Built target coio.test
gmake  -f test/unit/CMakeFiles/cbus.test.dir/build.make test/unit/CMakeFiles/cbus.test.dir/depend
gmake[3]: Entering directory '/wrkdirs/usr/ports/databases/tarantool/work/.build'
cd /wrkdirs/usr/ports/databases/tarantool/work/.build && /usr/local/bin/cmake -E cmake_depends "Unix Makefiles" /wrkdirs/usr/ports/databases/tarantool/work/tarantool-2.8.1 /wrkdirs/usr/ports/databases/tarantool/work/tarantool-2.8.1/test/unit /wrkdirs/usr/ports/databases/tarantool/work/.build /wrkdirs/usr/ports/databases/tarantool/work/.build/test/unit /wrkdirs/usr/ports/databases/tarantool/work/.build/test/unit/CMakeFiles/cbus.test.dir/DependInfo.cmake
gmake[3]: Leaving directory '/wrkdirs/usr/ports/databases/tarantool/work/.build'
gmake  -f test/unit/CMakeFiles/cbus.test.dir/build.make test/unit/CMakeFiles/cbus.test.dir/build
gmake[3]: Entering directory '/wrkdirs/usr/ports/databases/tarantool/work/.build'
[ 83%] Building C object test/unit/CMakeFiles/cbus.test.dir/cbus.c.o
cd /wrkdirs/usr/ports/databases/tarantool/work/.build/test/unit && /usr/bin/cc -DCORO_ASM -DLUAJIT_SMART_STRINGS=1 -DNDEBUG -DNVALGRIND -DNVALGRIND=1 -D__STDC_CONSTANT_MACROS=1 -D__STDC_FORMAT_MACROS=1 -D__STDC_LIMIT_MACROS=1 -I/wrkdirs/usr/ports/databases/tarantool/work/tarantool-2.8.1/src -I/wrkdirs/usr/ports/databases/tarantool/work/.build/src -I/wrkdirs/usr/ports/databases/tarantool/work/tarantool-2.8.1/src/lib -I/wrkdirs/usr/ports/databases/tarantool/work/tarantool-2.8.1/src/lib/small -I/wrkdirs/usr/ports/databases/tarantool/work/tarantool-2.8.1/src/lib/small/third_party -I/wrkdirs/usr/ports/databases/tarantool/work/tarantool-2.8.1/src/lib/core -I/wrkdirs/usr/ports/databases/tarantool/work/tarantool-2.8.1 -I/wrkdirs/usr/ports/databases/tarantool/work/tarantool-2.8.1/third_party/luajit/src -I/wrkdirs/usr/ports/databases/tarantool/work/.build/third_party/luajit/src -I/usr/local/include -I/wrkdirs/usr/ports/databases/tarantool/work/tarantool-2.8.1/src/box -I/wrkdirs/usr/ports/datab
 ases/tarantool/work/tarantool-2.8.1/third_party -O2 -pipe  -DLIBICONV_PLUG -fstack-protector-strong -fno-strict-aliasing -fexceptions -funwind-tables -fno-common -fopenmp -std=c11 -Wall -Wextra -Wno-strict-aliasing -Wno-char-subscripts -Wno-gnu-alignof-expression -Wno-unused-parameter -Wno-unused -Wno-unused-result -Wno-tautological-compare -O2 -pipe  -DLIBICONV_PLUG -fstack-protector-strong -fno-strict-aliasing -MD -MT test/unit/CMakeFiles/cbus.test.dir/cbus.c.o -MF CMakeFiles/cbus.test.dir/cbus.c.o.d -o CMakeFiles/cbus.test.dir/cbus.c.o -c /wrkdirs/usr/ports/databases/tarantool/work/tarantool-2.8.1/test/unit/cbus.c
[ 83%] Building C object test/unit/CMakeFiles/cbus.test.dir/core_test_utils.c.o
cd /wrkdirs/usr/ports/databases/tarantool/work/.build/test/unit && /usr/bin/cc -DCORO_ASM -DLUAJIT_SMART_STRINGS=1 -DNDEBUG -DNVALGRIND -DNVALGRIND=1 -D__STDC_CONSTANT_MACROS=1 -D__STDC_FORMAT_MACROS=1 -D__STDC_LIMIT_MACROS=1 -I/wrkdirs/usr/ports/databases/tarantool/work/tarantool-2.8.1/src -I/wrkdirs/usr/ports/databases/tarantool/work/.build/src -I/wrkdirs/usr/ports/databases/tarantool/work/tarantool-2.8.1/src/lib -I/wrkdirs/usr/ports/databases/tarantool/work/tarantool-2.8.1/src/lib/small -I/wrkdirs/usr/ports/databases/tarantool/work/tarantool-2.8.1/src/lib/small/third_party -I/wrkdirs/usr/ports/databases/tarantool/work/tarantool-2.8.1/src/lib/core -I/wrkdirs/usr/ports/databases/tarantool/work/tarantool-2.8.1 -I/wrkdirs/usr/ports/databases/tarantool/work/tarantool-2.8.1/third_party/luajit/src -I/wrkdirs/usr/ports/databases/tarantool/work/.build/third_party/luajit/src -I/usr/local/include -I/wrkdirs/usr/ports/databases/tarantool/work/tarantool-2.8.1/src/box -I/wrkdirs/usr/ports/datab
 ases/tarantool/work/tarantool-2.8.1/third_party -O2 -pipe  -DLIBICONV_PLUG -fstack-protector-strong -fno-strict-aliasing -fexceptions -funwind-tables -fno-common -fopenmp -std=c11 -Wall -Wextra -Wno-strict-aliasing -Wno-char-subscripts -Wno-gnu-alignof-expression -Wno-unused-parameter -Wno-unused -Wno-unused-result -Wno-tautological-compare -O2 -pipe  -DLIBICONV_PLUG -fstack-protector-strong -fno-strict-aliasing -MD -MT test/unit/CMakeFiles/cbus.test.dir/core_test_utils.c.o -MF CMakeFiles/cbus.test.dir/core_test_utils.c.o.d -o CMakeFiles/cbus.test.dir/core_test_utils.c.o -c /wrkdirs/usr/ports/databases/tarantool/work/tarantool-2.8.1/test/unit/core_test_utils.c
[ 83%] Linking CXX executable cbus.test
cd /wrkdirs/usr/ports/databases/tarantool/work/.build/test/unit && /usr/local/bin/cmake -E cmake_link_script CMakeFiles/cbus.test.dir/link.txt --verbose=1
/usr/bin/c++ -O2 -pipe -DLIBICONV_PLUG -fstack-protector-strong -fno-strict-aliasing  -DLIBICONV_PLUG -fexceptions -funwind-tables -fno-common -fopenmp -std=c++11 -Wall -Wextra -Wno-strict-aliasing -Wno-char-subscripts -Wno-invalid-offsetof -Wno-gnu-alignof-expression -Wno-unused-parameter -Wno-unused -Wno-unused-result -Wno-tautological-compare -O2 -pipe -DLIBICONV_PLUG -fstack-protector-strong -fno-strict-aliasing  -DLIBICONV_PLUG  -L/usr/local/lib  -fstack-protector-strong CMakeFiles/cbus.test.dir/cbus.c.o CMakeFiles/cbus.test.dir/core_test_utils.c.o -o cbus.test  -Wl,-rpath,/usr/local/lib ../../src/lib/core/libcore.a libunit.a ../../src/libstat.a ../../src/lib/core/libcore.a ../../src/lib/salad/libsalad.a ../../src/lib/small/libsmall.a ../../src/lib/uri/liburi.a ../../libdecNumber.a ../../src/lib/bit/libbit.a ../../libev.a -lm ../../libeio.a -lpthread ../../libcoro.a /usr/local/lib/libmsgpuck.so /usr/local/lib/libicui18n.so /usr/local/lib/libicuuc.so /usr/local/lib/libicudata.so 
gmake[3]: Leaving directory '/wrkdirs/usr/ports/databases/tarantool/work/.build'
[ 83%] Built target cbus.test
gmake  -f test/unit/CMakeFiles/fiber_cond.test.dir/build.make test/unit/CMakeFiles/fiber_cond.test.dir/depend
gmake[3]: Entering directory '/wrkdirs/usr/ports/databases/tarantool/work/.build'
cd /wrkdirs/usr/ports/databases/tarantool/work/.build && /usr/local/bin/cmake -E cmake_depends "Unix Makefiles" /wrkdirs/usr/ports/databases/tarantool/work/tarantool-2.8.1 /wrkdirs/usr/ports/databases/tarantool/work/tarantool-2.8.1/test/unit /wrkdirs/usr/ports/databases/tarantool/work/.build /wrkdirs/usr/ports/databases/tarantool/work/.build/test/unit /wrkdirs/usr/ports/databases/tarantool/work/.build/test/unit/CMakeFiles/fiber_cond.test.dir/DependInfo.cmake
gmake[3]: Leaving directory '/wrkdirs/usr/ports/databases/tarantool/work/.build'
gmake  -f test/unit/CMakeFiles/fiber_cond.test.dir/build.make test/unit/CMakeFiles/fiber_cond.test.dir/build
gmake[3]: Entering directory '/wrkdirs/usr/ports/databases/tarantool/work/.build'
[ 83%] Building C object test/unit/CMakeFiles/fiber_cond.test.dir/fiber_cond.c.o
cd /wrkdirs/usr/ports/databases/tarantool/work/.build/test/unit && /usr/bin/cc -DCORO_ASM -DLUAJIT_SMART_STRINGS=1 -DNDEBUG -DNVALGRIND -DNVALGRIND=1 -D__STDC_CONSTANT_MACROS=1 -D__STDC_FORMAT_MACROS=1 -D__STDC_LIMIT_MACROS=1 -I/wrkdirs/usr/ports/databases/tarantool/work/tarantool-2.8.1/src -I/wrkdirs/usr/ports/databases/tarantool/work/.build/src -I/wrkdirs/usr/ports/databases/tarantool/work/tarantool-2.8.1/src/lib -I/wrkdirs/usr/ports/databases/tarantool/work/tarantool-2.8.1/src/lib/small -I/wrkdirs/usr/ports/databases/tarantool/work/tarantool-2.8.1/src/lib/small/third_party -I/wrkdirs/usr/ports/databases/tarantool/work/tarantool-2.8.1/src/lib/core -I/wrkdirs/usr/ports/databases/tarantool/work/tarantool-2.8.1 -I/wrkdirs/usr/ports/databases/tarantool/work/tarantool-2.8.1/third_party/luajit/src -I/wrkdirs/usr/ports/databases/tarantool/work/.build/third_party/luajit/src -I/usr/local/include -I/wrkdirs/usr/ports/databases/tarantool/work/tarantool-2.8.1/src/box -I/wrkdirs/usr/ports/datab
 ases/tarantool/work/tarantool-2.8.1/third_party -O2 -pipe  -DLIBICONV_PLUG -fstack-protector-strong -fno-strict-aliasing -fexceptions -funwind-tables -fno-common -fopenmp -std=c11 -Wall -Wextra -Wno-strict-aliasing -Wno-char-subscripts -Wno-gnu-alignof-expression -Wno-unused-parameter -Wno-unused -Wno-unused-result -Wno-tautological-compare -O2 -pipe  -DLIBICONV_PLUG -fstack-protector-strong -fno-strict-aliasing -MD -MT test/unit/CMakeFiles/fiber_cond.test.dir/fiber_cond.c.o -MF CMakeFiles/fiber_cond.test.dir/fiber_cond.c.o.d -o CMakeFiles/fiber_cond.test.dir/fiber_cond.c.o -c /wrkdirs/usr/ports/databases/tarantool/work/tarantool-2.8.1/test/unit/fiber_cond.c
[ 83%] Building C object test/unit/CMakeFiles/fiber_cond.test.dir/unit.c.o
cd /wrkdirs/usr/ports/databases/tarantool/work/.build/test/unit && /usr/bin/cc -DCORO_ASM -DLUAJIT_SMART_STRINGS=1 -DNDEBUG -DNVALGRIND -DNVALGRIND=1 -D__STDC_CONSTANT_MACROS=1 -D__STDC_FORMAT_MACROS=1 -D__STDC_LIMIT_MACROS=1 -I/wrkdirs/usr/ports/databases/tarantool/work/tarantool-2.8.1/src -I/wrkdirs/usr/ports/databases/tarantool/work/.build/src -I/wrkdirs/usr/ports/databases/tarantool/work/tarantool-2.8.1/src/lib -I/wrkdirs/usr/ports/databases/tarantool/work/tarantool-2.8.1/src/lib/small -I/wrkdirs/usr/ports/databases/tarantool/work/tarantool-2.8.1/src/lib/small/third_party -I/wrkdirs/usr/ports/databases/tarantool/work/tarantool-2.8.1/src/lib/core -I/wrkdirs/usr/ports/databases/tarantool/work/tarantool-2.8.1 -I/wrkdirs/usr/ports/databases/tarantool/work/tarantool-2.8.1/third_party/luajit/src -I/wrkdirs/usr/ports/databases/tarantool/work/.build/third_party/luajit/src -I/usr/local/include -I/wrkdirs/usr/ports/databases/tarantool/work/tarantool-2.8.1/src/box -I/wrkdirs/usr/ports/datab
 ases/tarantool/work/tarantool-2.8.1/third_party -O2 -pipe  -DLIBICONV_PLUG -fstack-protector-strong -fno-strict-aliasing -fexceptions -funwind-tables -fno-common -fopenmp -std=c11 -Wall -Wextra -Wno-strict-aliasing -Wno-char-subscripts -Wno-gnu-alignof-expression -Wno-unused-parameter -Wno-unused -Wno-unused-result -Wno-tautological-compare -O2 -pipe  -DLIBICONV_PLUG -fstack-protector-strong -fno-strict-aliasing -MD -MT test/unit/CMakeFiles/fiber_cond.test.dir/unit.c.o -MF CMakeFiles/fiber_cond.test.dir/unit.c.o.d -o CMakeFiles/fiber_cond.test.dir/unit.c.o -c /wrkdirs/usr/ports/databases/tarantool/work/tarantool-2.8.1/test/unit/unit.c
[ 83%] Building C object test/unit/CMakeFiles/fiber_cond.test.dir/core_test_utils.c.o
cd /wrkdirs/usr/ports/databases/tarantool/work/.build/test/unit && /usr/bin/cc -DCORO_ASM -DLUAJIT_SMART_STRINGS=1 -DNDEBUG -DNVALGRIND -DNVALGRIND=1 -D__STDC_CONSTANT_MACROS=1 -D__STDC_FORMAT_MACROS=1 -D__STDC_LIMIT_MACROS=1 -I/wrkdirs/usr/ports/databases/tarantool/work/tarantool-2.8.1/src -I/wrkdirs/usr/ports/databases/tarantool/work/.build/src -I/wrkdirs/usr/ports/databases/tarantool/work/tarantool-2.8.1/src/lib -I/wrkdirs/usr/ports/databases/tarantool/work/tarantool-2.8.1/src/lib/small -I/wrkdirs/usr/ports/databases/tarantool/work/tarantool-2.8.1/src/lib/small/third_party -I/wrkdirs/usr/ports/databases/tarantool/work/tarantool-2.8.1/src/lib/core -I/wrkdirs/usr/ports/databases/tarantool/work/tarantool-2.8.1 -I/wrkdirs/usr/ports/databases/tarantool/work/tarantool-2.8.1/third_party/luajit/src -I/wrkdirs/usr/ports/databases/tarantool/work/.build/third_party/luajit/src -I/usr/local/include -I/wrkdirs/usr/ports/databases/tarantool/work/tarantool-2.8.1/src/box -I/wrkdirs/usr/ports/datab
 ases/tarantool/work/tarantool-2.8.1/third_party -O2 -pipe  -DLIBICONV_PLUG -fstack-protector-strong -fno-strict-aliasing -fexceptions -funwind-tables -fno-common -fopenmp -std=c11 -Wall -Wextra -Wno-strict-aliasing -Wno-char-subscripts -Wno-gnu-alignof-expression -Wno-unused-parameter -Wno-unused -Wno-unused-result -Wno-tautological-compare -O2 -pipe  -DLIBICONV_PLUG -fstack-protector-strong -fno-strict-aliasing -MD -MT test/unit/CMakeFiles/fiber_cond.test.dir/core_test_utils.c.o -MF CMakeFiles/fiber_cond.test.dir/core_test_utils.c.o.d -o CMakeFiles/fiber_cond.test.dir/core_test_utils.c.o -c /wrkdirs/usr/ports/databases/tarantool/work/tarantool-2.8.1/test/unit/core_test_utils.c
[ 83%] Linking CXX executable fiber_cond.test
cd /wrkdirs/usr/ports/databases/tarantool/work/.build/test/unit && /usr/local/bin/cmake -E cmake_link_script CMakeFiles/fiber_cond.test.dir/link.txt --verbose=1
/usr/bin/c++ -O2 -pipe -DLIBICONV_PLUG -fstack-protector-strong -fno-strict-aliasing  -DLIBICONV_PLUG -fexceptions -funwind-tables -fno-common -fopenmp -std=c++11 -Wall -Wextra -Wno-strict-aliasing -Wno-char-subscripts -Wno-invalid-offsetof -Wno-gnu-alignof-expression -Wno-unused-parameter -Wno-unused -Wno-unused-result -Wno-tautological-compare -O2 -pipe -DLIBICONV_PLUG -fstack-protector-strong -fno-strict-aliasing  -DLIBICONV_PLUG  -L/usr/local/lib  -fstack-protector-strong CMakeFiles/fiber_cond.test.dir/fiber_cond.c.o CMakeFiles/fiber_cond.test.dir/unit.c.o CMakeFiles/fiber_cond.test.dir/core_test_utils.c.o -o fiber_cond.test  -Wl,-rpath,/usr/local/lib ../../src/lib/core/libcore.a ../../src/lib/salad/libsalad.a ../../src/lib/small/libsmall.a ../../src/lib/uri/liburi.a ../../libdecNumber.a ../../src/lib/bit/libbit.a ../../libev.a -lm ../../libeio.a -lpthread ../../libcoro.a /usr/local/lib/libmsgpuck.so /usr/local/lib/libicui18n.so /usr/local/lib/libicuuc.so /usr/local/lib/libicudat
 a.so 
gmake[3]: Leaving directory '/wrkdirs/usr/ports/databases/tarantool/work/.build'
[ 83%] Built target fiber_cond.test
gmake  -f test/unit/CMakeFiles/coll.test.dir/build.make test/unit/CMakeFiles/coll.test.dir/depend
gmake[3]: Entering directory '/wrkdirs/usr/ports/databases/tarantool/work/.build'
cd /wrkdirs/usr/ports/databases/tarantool/work/.build && /usr/local/bin/cmake -E cmake_depends "Unix Makefiles" /wrkdirs/usr/ports/databases/tarantool/work/tarantool-2.8.1 /wrkdirs/usr/ports/databases/tarantool/work/tarantool-2.8.1/test/unit /wrkdirs/usr/ports/databases/tarantool/work/.build /wrkdirs/usr/ports/databases/tarantool/work/.build/test/unit /wrkdirs/usr/ports/databases/tarantool/work/.build/test/unit/CMakeFiles/coll.test.dir/DependInfo.cmake
gmake[3]: Leaving directory '/wrkdirs/usr/ports/databases/tarantool/work/.build'
gmake  -f test/unit/CMakeFiles/coll.test.dir/build.make test/unit/CMakeFiles/coll.test.dir/build
gmake[3]: Entering directory '/wrkdirs/usr/ports/databases/tarantool/work/.build'
[ 83%] Building CXX object test/unit/CMakeFiles/coll.test.dir/coll.cpp.o
cd /wrkdirs/usr/ports/databases/tarantool/work/.build/test/unit && /usr/bin/c++ -DCORO_ASM -DLUAJIT_SMART_STRINGS=1 -DNDEBUG -DNVALGRIND -DNVALGRIND=1 -D__STDC_CONSTANT_MACROS=1 -D__STDC_FORMAT_MACROS=1 -D__STDC_LIMIT_MACROS=1 -I/wrkdirs/usr/ports/databases/tarantool/work/tarantool-2.8.1/src -I/wrkdirs/usr/ports/databases/tarantool/work/.build/src -I/wrkdirs/usr/ports/databases/tarantool/work/tarantool-2.8.1/src/lib -I/wrkdirs/usr/ports/databases/tarantool/work/tarantool-2.8.1/src/lib/small -I/wrkdirs/usr/ports/databases/tarantool/work/tarantool-2.8.1/src/lib/small/third_party -I/wrkdirs/usr/ports/databases/tarantool/work/tarantool-2.8.1/src/lib/core -I/wrkdirs/usr/ports/databases/tarantool/work/tarantool-2.8.1 -I/wrkdirs/usr/ports/databases/tarantool/work/tarantool-2.8.1/third_party/luajit/src -I/wrkdirs/usr/ports/databases/tarantool/work/.build/third_party/luajit/src -I/usr/local/include -I/wrkdirs/usr/ports/databases/tarantool/work/tarantool-2.8.1/src/box -I/wrkdirs/usr/ports/data
 bases/tarantool/work/tarantool-2.8.1/third_party -O2 -pipe -DLIBICONV_PLUG -fstack-protector-strong -fno-strict-aliasing  -DLIBICONV_PLUG -fexceptions -funwind-tables -fno-common -fopenmp -std=c++11 -Wall -Wextra -Wno-strict-aliasing -Wno-char-subscripts -Wno-invalid-offsetof -Wno-gnu-alignof-expression -Wno-unused-parameter -Wno-unused -Wno-unused-result -Wno-tautological-compare -O2 -pipe -DLIBICONV_PLUG -fstack-protector-strong -fno-strict-aliasing  -DLIBICONV_PLUG -MD -MT test/unit/CMakeFiles/coll.test.dir/coll.cpp.o -MF CMakeFiles/coll.test.dir/coll.cpp.o.d -o CMakeFiles/coll.test.dir/coll.cpp.o -c /wrkdirs/usr/ports/databases/tarantool/work/tarantool-2.8.1/test/unit/coll.cpp
[ 83%] Building C object test/unit/CMakeFiles/coll.test.dir/core_test_utils.c.o
cd /wrkdirs/usr/ports/databases/tarantool/work/.build/test/unit && /usr/bin/cc -DCORO_ASM -DLUAJIT_SMART_STRINGS=1 -DNDEBUG -DNVALGRIND -DNVALGRIND=1 -D__STDC_CONSTANT_MACROS=1 -D__STDC_FORMAT_MACROS=1 -D__STDC_LIMIT_MACROS=1 -I/wrkdirs/usr/ports/databases/tarantool/work/tarantool-2.8.1/src -I/wrkdirs/usr/ports/databases/tarantool/work/.build/src -I/wrkdirs/usr/ports/databases/tarantool/work/tarantool-2.8.1/src/lib -I/wrkdirs/usr/ports/databases/tarantool/work/tarantool-2.8.1/src/lib/small -I/wrkdirs/usr/ports/databases/tarantool/work/tarantool-2.8.1/src/lib/small/third_party -I/wrkdirs/usr/ports/databases/tarantool/work/tarantool-2.8.1/src/lib/core -I/wrkdirs/usr/ports/databases/tarantool/work/tarantool-2.8.1 -I/wrkdirs/usr/ports/databases/tarantool/work/tarantool-2.8.1/third_party/luajit/src -I/wrkdirs/usr/ports/databases/tarantool/work/.build/third_party/luajit/src -I/usr/local/include -I/wrkdirs/usr/ports/databases/tarantool/work/tarantool-2.8.1/src/box -I/wrkdirs/usr/ports/datab
 ases/tarantool/work/tarantool-2.8.1/third_party -O2 -pipe  -DLIBICONV_PLUG -fstack-protector-strong -fno-strict-aliasing -fexceptions -funwind-tables -fno-common -fopenmp -std=c11 -Wall -Wextra -Wno-strict-aliasing -Wno-char-subscripts -Wno-gnu-alignof-expression -Wno-unused-parameter -Wno-unused -Wno-unused-result -Wno-tautological-compare -O2 -pipe  -DLIBICONV_PLUG -fstack-protector-strong -fno-strict-aliasing -MD -MT test/unit/CMakeFiles/coll.test.dir/core_test_utils.c.o -MF CMakeFiles/coll.test.dir/core_test_utils.c.o.d -o CMakeFiles/coll.test.dir/core_test_utils.c.o -c /wrkdirs/usr/ports/databases/tarantool/work/tarantool-2.8.1/test/unit/core_test_utils.c
[ 83%] Linking CXX executable coll.test
cd /wrkdirs/usr/ports/databases/tarantool/work/.build/test/unit && /usr/local/bin/cmake -E cmake_link_script CMakeFiles/coll.test.dir/link.txt --verbose=1
/usr/bin/c++ -O2 -pipe -DLIBICONV_PLUG -fstack-protector-strong -fno-strict-aliasing  -DLIBICONV_PLUG -fexceptions -funwind-tables -fno-common -fopenmp -std=c++11 -Wall -Wextra -Wno-strict-aliasing -Wno-char-subscripts -Wno-invalid-offsetof -Wno-gnu-alignof-expression -Wno-unused-parameter -Wno-unused -Wno-unused-result -Wno-tautological-compare -O2 -pipe -DLIBICONV_PLUG -fstack-protector-strong -fno-strict-aliasing  -DLIBICONV_PLUG  -L/usr/local/lib  -fstack-protector-strong CMakeFiles/coll.test.dir/coll.cpp.o CMakeFiles/coll.test.dir/core_test_utils.c.o -o coll.test  -Wl,-rpath,/usr/local/lib ../../src/lib/coll/libcoll.a libunit.a ../../libmisc.a -ldl ../../src/lib/core/libcore.a ../../src/lib/salad/libsalad.a ../../src/lib/small/libsmall.a ../../src/lib/uri/liburi.a ../../libdecNumber.a ../../src/lib/bit/libbit.a ../../libev.a -lm ../../libeio.a ../../libcoro.a /usr/local/lib/libmsgpuck.so /usr/local/lib/libicui18n.so /usr/local/lib/libicuuc.so /usr/local/lib/libicudata.so -lomp -
 lpthread 
gmake[3]: Leaving directory '/wrkdirs/usr/ports/databases/tarantool/work/.build'
[ 83%] Built target coll.test
gmake  -f test/unit/CMakeFiles/ratelimit.test.dir/build.make test/unit/CMakeFiles/ratelimit.test.dir/depend
gmake[3]: Entering directory '/wrkdirs/usr/ports/databases/tarantool/work/.build'
cd /wrkdirs/usr/ports/databases/tarantool/work/.build && /usr/local/bin/cmake -E cmake_depends "Unix Makefiles" /wrkdirs/usr/ports/databases/tarantool/work/tarantool-2.8.1 /wrkdirs/usr/ports/databases/tarantool/work/tarantool-2.8.1/test/unit /wrkdirs/usr/ports/databases/tarantool/work/.build /wrkdirs/usr/ports/databases/tarantool/work/.build/test/unit /wrkdirs/usr/ports/databases/tarantool/work/.build/test/unit/CMakeFiles/ratelimit.test.dir/DependInfo.cmake
gmake[3]: Leaving directory '/wrkdirs/usr/ports/databases/tarantool/work/.build'
gmake  -f test/unit/CMakeFiles/ratelimit.test.dir/build.make test/unit/CMakeFiles/ratelimit.test.dir/build
gmake[3]: Entering directory '/wrkdirs/usr/ports/databases/tarantool/work/.build'
[ 83%] Building C object test/unit/CMakeFiles/ratelimit.test.dir/ratelimit.c.o
cd /wrkdirs/usr/ports/databases/tarantool/work/.build/test/unit && /usr/bin/cc -DCORO_ASM -DLUAJIT_SMART_STRINGS=1 -DNDEBUG -DNVALGRIND -DNVALGRIND=1 -D__STDC_CONSTANT_MACROS=1 -D__STDC_FORMAT_MACROS=1 -D__STDC_LIMIT_MACROS=1 -I/wrkdirs/usr/ports/databases/tarantool/work/tarantool-2.8.1/src -I/wrkdirs/usr/ports/databases/tarantool/work/.build/src -I/wrkdirs/usr/ports/databases/tarantool/work/tarantool-2.8.1/src/lib -I/wrkdirs/usr/ports/databases/tarantool/work/tarantool-2.8.1/src/lib/small -I/wrkdirs/usr/ports/databases/tarantool/work/tarantool-2.8.1/src/lib/small/third_party -I/wrkdirs/usr/ports/databases/tarantool/work/tarantool-2.8.1/src/lib/core -I/wrkdirs/usr/ports/databases/tarantool/work/tarantool-2.8.1 -I/wrkdirs/usr/ports/databases/tarantool/work/tarantool-2.8.1/third_party/luajit/src -I/wrkdirs/usr/ports/databases/tarantool/work/.build/third_party/luajit/src -I/usr/local/include -I/wrkdirs/usr/ports/databases/tarantool/work/tarantool-2.8.1/src/box -I/wrkdirs/usr/ports/datab
 ases/tarantool/work/tarantool-2.8.1/third_party -O2 -pipe  -DLIBICONV_PLUG -fstack-protector-strong -fno-strict-aliasing -fexceptions -funwind-tables -fno-common -fopenmp -std=c11 -Wall -Wextra -Wno-strict-aliasing -Wno-char-subscripts -Wno-gnu-alignof-expression -Wno-unused-parameter -Wno-unused -Wno-unused-result -Wno-tautological-compare -O2 -pipe  -DLIBICONV_PLUG -fstack-protector-strong -fno-strict-aliasing -MD -MT test/unit/CMakeFiles/ratelimit.test.dir/ratelimit.c.o -MF CMakeFiles/ratelimit.test.dir/ratelimit.c.o.d -o CMakeFiles/ratelimit.test.dir/ratelimit.c.o -c /wrkdirs/usr/ports/databases/tarantool/work/tarantool-2.8.1/test/unit/ratelimit.c
[ 83%] Linking C executable ratelimit.test
cd /wrkdirs/usr/ports/databases/tarantool/work/.build/test/unit && /usr/local/bin/cmake -E cmake_link_script CMakeFiles/ratelimit.test.dir/link.txt --verbose=1
/usr/bin/cc -O2 -pipe  -DLIBICONV_PLUG -fstack-protector-strong -fno-strict-aliasing -fexceptions -funwind-tables -fno-common -fopenmp -std=c11 -Wall -Wextra -Wno-strict-aliasing -Wno-char-subscripts -Wno-gnu-alignof-expression -Wno-unused-parameter -Wno-unused -Wno-unused-result -Wno-tautological-compare -O2 -pipe  -DLIBICONV_PLUG -fstack-protector-strong -fno-strict-aliasing  -L/usr/local/lib  -fstack-protector-strong CMakeFiles/ratelimit.test.dir/ratelimit.c.o -o ratelimit.test  libunit.a 
gmake[3]: Leaving directory '/wrkdirs/usr/ports/databases/tarantool/work/.build'
[ 83%] Built target ratelimit.test
gmake  -f test/unit/CMakeFiles/guard.test.dir/build.make test/unit/CMakeFiles/guard.test.dir/depend
gmake[3]: Entering directory '/wrkdirs/usr/ports/databases/tarantool/work/.build'
cd /wrkdirs/usr/ports/databases/tarantool/work/.build && /usr/local/bin/cmake -E cmake_depends "Unix Makefiles" /wrkdirs/usr/ports/databases/tarantool/work/tarantool-2.8.1 /wrkdirs/usr/ports/databases/tarantool/work/tarantool-2.8.1/test/unit /wrkdirs/usr/ports/databases/tarantool/work/.build /wrkdirs/usr/ports/databases/tarantool/work/.build/test/unit /wrkdirs/usr/ports/databases/tarantool/work/.build/test/unit/CMakeFiles/guard.test.dir/DependInfo.cmake
gmake[3]: Leaving directory '/wrkdirs/usr/ports/databases/tarantool/work/.build'
gmake  -f test/unit/CMakeFiles/guard.test.dir/build.make test/unit/CMakeFiles/guard.test.dir/build
gmake[3]: Entering directory '/wrkdirs/usr/ports/databases/tarantool/work/.build'
[ 83%] Building CXX object test/unit/CMakeFiles/guard.test.dir/guard.cc.o
cd /wrkdirs/usr/ports/databases/tarantool/work/.build/test/unit && /usr/bin/c++ -DCORO_ASM -DLUAJIT_SMART_STRINGS=1 -DNDEBUG -DNVALGRIND -DNVALGRIND=1 -D__STDC_CONSTANT_MACROS=1 -D__STDC_FORMAT_MACROS=1 -D__STDC_LIMIT_MACROS=1 -I/wrkdirs/usr/ports/databases/tarantool/work/tarantool-2.8.1/src -I/wrkdirs/usr/ports/databases/tarantool/work/.build/src -I/wrkdirs/usr/ports/databases/tarantool/work/tarantool-2.8.1/src/lib -I/wrkdirs/usr/ports/databases/tarantool/work/tarantool-2.8.1/src/lib/small -I/wrkdirs/usr/ports/databases/tarantool/work/tarantool-2.8.1/src/lib/small/third_party -I/wrkdirs/usr/ports/databases/tarantool/work/tarantool-2.8.1/src/lib/core -I/wrkdirs/usr/ports/databases/tarantool/work/tarantool-2.8.1 -I/wrkdirs/usr/ports/databases/tarantool/work/tarantool-2.8.1/third_party/luajit/src -I/wrkdirs/usr/ports/databases/tarantool/work/.build/third_party/luajit/src -I/usr/local/include -I/wrkdirs/usr/ports/databases/tarantool/work/tarantool-2.8.1/src/box -I/wrkdirs/usr/ports/data
 bases/tarantool/work/tarantool-2.8.1/third_party -O2 -pipe -DLIBICONV_PLUG -fstack-protector-strong -fno-strict-aliasing  -DLIBICONV_PLUG -fexceptions -funwind-tables -fno-common -fopenmp -std=c++11 -Wall -Wextra -Wno-strict-aliasing -Wno-char-subscripts -Wno-invalid-offsetof -Wno-gnu-alignof-expression -Wno-unused-parameter -Wno-unused -Wno-unused-result -Wno-tautological-compare -O2 -pipe -DLIBICONV_PLUG -fstack-protector-strong -fno-strict-aliasing  -DLIBICONV_PLUG -MD -MT test/unit/CMakeFiles/guard.test.dir/guard.cc.o -MF CMakeFiles/guard.test.dir/guard.cc.o.d -o CMakeFiles/guard.test.dir/guard.cc.o -c /wrkdirs/usr/ports/databases/tarantool/work/tarantool-2.8.1/test/unit/guard.cc
[ 83%] Building C object test/unit/CMakeFiles/guard.test.dir/core_test_utils.c.o
cd /wrkdirs/usr/ports/databases/tarantool/work/.build/test/unit && /usr/bin/cc -DCORO_ASM -DLUAJIT_SMART_STRINGS=1 -DNDEBUG -DNVALGRIND -DNVALGRIND=1 -D__STDC_CONSTANT_MACROS=1 -D__STDC_FORMAT_MACROS=1 -D__STDC_LIMIT_MACROS=1 -I/wrkdirs/usr/ports/databases/tarantool/work/tarantool-2.8.1/src -I/wrkdirs/usr/ports/databases/tarantool/work/.build/src -I/wrkdirs/usr/ports/databases/tarantool/work/tarantool-2.8.1/src/lib -I/wrkdirs/usr/ports/databases/tarantool/work/tarantool-2.8.1/src/lib/small -I/wrkdirs/usr/ports/databases/tarantool/work/tarantool-2.8.1/src/lib/small/third_party -I/wrkdirs/usr/ports/databases/tarantool/work/tarantool-2.8.1/src/lib/core -I/wrkdirs/usr/ports/databases/tarantool/work/tarantool-2.8.1 -I/wrkdirs/usr/ports/databases/tarantool/work/tarantool-2.8.1/third_party/luajit/src -I/wrkdirs/usr/ports/databases/tarantool/work/.build/third_party/luajit/src -I/usr/local/include -I/wrkdirs/usr/ports/databases/tarantool/work/tarantool-2.8.1/src/box -I/wrkdirs/usr/ports/datab
 ases/tarantool/work/tarantool-2.8.1/third_party -O2 -pipe  -DLIBICONV_PLUG -fstack-protector-strong -fno-strict-aliasing -fexceptions -funwind-tables -fno-common -fopenmp -std=c11 -Wall -Wextra -Wno-strict-aliasing -Wno-char-subscripts -Wno-gnu-alignof-expression -Wno-unused-parameter -Wno-unused -Wno-unused-result -Wno-tautological-compare -O2 -pipe  -DLIBICONV_PLUG -fstack-protector-strong -fno-strict-aliasing -MD -MT test/unit/CMakeFiles/guard.test.dir/core_test_utils.c.o -MF CMakeFiles/guard.test.dir/core_test_utils.c.o.d -o CMakeFiles/guard.test.dir/core_test_utils.c.o -c /wrkdirs/usr/ports/databases/tarantool/work/tarantool-2.8.1/test/unit/core_test_utils.c
[ 83%] Linking CXX executable guard.test
cd /wrkdirs/usr/ports/databases/tarantool/work/.build/test/unit && /usr/local/bin/cmake -E cmake_link_script CMakeFiles/guard.test.dir/link.txt --verbose=1
/usr/bin/c++ -O2 -pipe -DLIBICONV_PLUG -fstack-protector-strong -fno-strict-aliasing  -DLIBICONV_PLUG -fexceptions -funwind-tables -fno-common -fopenmp -std=c++11 -Wall -Wextra -Wno-strict-aliasing -Wno-char-subscripts -Wno-invalid-offsetof -Wno-gnu-alignof-expression -Wno-unused-parameter -Wno-unused -Wno-unused-result -Wno-tautological-compare -O2 -pipe -DLIBICONV_PLUG -fstack-protector-strong -fno-strict-aliasing  -DLIBICONV_PLUG  -L/usr/local/lib  -fstack-protector-strong CMakeFiles/guard.test.dir/guard.cc.o CMakeFiles/guard.test.dir/core_test_utils.c.o -o guard.test  -Wl,-rpath,/usr/local/lib ../../src/lib/core/libcore.a libunit.a ../../src/lib/salad/libsalad.a ../../src/lib/small/libsmall.a ../../src/lib/uri/liburi.a ../../libdecNumber.a ../../src/lib/bit/libbit.a ../../libev.a -lm ../../libeio.a -lpthread ../../libcoro.a /usr/local/lib/libmsgpuck.so /usr/local/lib/libicui18n.so /usr/local/lib/libicuuc.so /usr/local/lib/libicudata.so 
gmake[3]: Leaving directory '/wrkdirs/usr/ports/databases/tarantool/work/.build'
[ 83%] Built target guard.test
gmake  -f test/unit/CMakeFiles/luaT_tuple_new.test.dir/build.make test/unit/CMakeFiles/luaT_tuple_new.test.dir/depend
gmake[3]: Entering directory '/wrkdirs/usr/ports/databases/tarantool/work/.build'
cd /wrkdirs/usr/ports/databases/tarantool/work/.build && /usr/local/bin/cmake -E cmake_depends "Unix Makefiles" /wrkdirs/usr/ports/databases/tarantool/work/tarantool-2.8.1 /wrkdirs/usr/ports/databases/tarantool/work/tarantool-2.8.1/test/unit /wrkdirs/usr/ports/databases/tarantool/work/.build /wrkdirs/usr/ports/databases/tarantool/work/.build/test/unit /wrkdirs/usr/ports/databases/tarantool/work/.build/test/unit/CMakeFiles/luaT_tuple_new.test.dir/DependInfo.cmake
gmake[3]: Leaving directory '/wrkdirs/usr/ports/databases/tarantool/work/.build'
gmake  -f test/unit/CMakeFiles/luaT_tuple_new.test.dir/build.make test/unit/CMakeFiles/luaT_tuple_new.test.dir/build
gmake[3]: Entering directory '/wrkdirs/usr/ports/databases/tarantool/work/.build'
[ 83%] Building C object test/unit/CMakeFiles/luaT_tuple_new.test.dir/luaT_tuple_new.c.o
cd /wrkdirs/usr/ports/databases/tarantool/work/.build/test/unit && /usr/bin/cc -DCORO_ASM -DLUAJIT_SMART_STRINGS=1 -DNDEBUG -DNVALGRIND -DNVALGRIND=1 -D__STDC_CONSTANT_MACROS=1 -D__STDC_FORMAT_MACROS=1 -D__STDC_LIMIT_MACROS=1 -I/wrkdirs/usr/ports/databases/tarantool/work/tarantool-2.8.1/src -I/wrkdirs/usr/ports/databases/tarantool/work/.build/src -I/wrkdirs/usr/ports/databases/tarantool/work/tarantool-2.8.1/src/lib -I/wrkdirs/usr/ports/databases/tarantool/work/tarantool-2.8.1/src/lib/small -I/wrkdirs/usr/ports/databases/tarantool/work/tarantool-2.8.1/src/lib/small/third_party -I/wrkdirs/usr/ports/databases/tarantool/work/tarantool-2.8.1/src/lib/core -I/wrkdirs/usr/ports/databases/tarantool/work/tarantool-2.8.1 -I/wrkdirs/usr/ports/databases/tarantool/work/tarantool-2.8.1/third_party/luajit/src -I/wrkdirs/usr/ports/databases/tarantool/work/.build/third_party/luajit/src -I/usr/local/include -I/wrkdirs/usr/ports/databases/tarantool/work/tarantool-2.8.1/src/box -I/wrkdirs/usr/ports/datab
 ases/tarantool/work/tarantool-2.8.1/third_party -O2 -pipe  -DLIBICONV_PLUG -fstack-protector-strong -fno-strict-aliasing -fexceptions -funwind-tables -fno-common -fopenmp -std=c11 -Wall -Wextra -Wno-strict-aliasing -Wno-char-subscripts -Wno-gnu-alignof-expression -Wno-unused-parameter -Wno-unused -Wno-unused-result -Wno-tautological-compare -O2 -pipe  -DLIBICONV_PLUG -fstack-protector-strong -fno-strict-aliasing -MD -MT test/unit/CMakeFiles/luaT_tuple_new.test.dir/luaT_tuple_new.c.o -MF CMakeFiles/luaT_tuple_new.test.dir/luaT_tuple_new.c.o.d -o CMakeFiles/luaT_tuple_new.test.dir/luaT_tuple_new.c.o -c /wrkdirs/usr/ports/databases/tarantool/work/tarantool-2.8.1/test/unit/luaT_tuple_new.c
[ 83%] Linking CXX executable luaT_tuple_new.test
cd /wrkdirs/usr/ports/databases/tarantool/work/.build/test/unit && /usr/local/bin/cmake -E cmake_link_script CMakeFiles/luaT_tuple_new.test.dir/link.txt --verbose=1
/usr/bin/c++ -O2 -pipe -DLIBICONV_PLUG -fstack-protector-strong -fno-strict-aliasing  -DLIBICONV_PLUG -fexceptions -funwind-tables -fno-common -fopenmp -std=c++11 -Wall -Wextra -Wno-strict-aliasing -Wno-char-subscripts -Wno-invalid-offsetof -Wno-gnu-alignof-expression -Wno-unused-parameter -Wno-unused -Wno-unused-result -Wno-tautological-compare -O2 -pipe -DLIBICONV_PLUG -fstack-protector-strong -fno-strict-aliasing  -DLIBICONV_PLUG  -L/usr/local/lib  -fstack-protector-strong CMakeFiles/luaT_tuple_new.test.dir/luaT_tuple_new.c.o -o luaT_tuple_new.test  -Wl,-rpath,/usr/local/lib libunit.a ../../src/box/libbox.a ../../src/libserver.a ../../src/lib/core/libcore.a ../../libmisc.a /usr/local/lib/libcurl.so -lssl -lcrypto /usr/local/lib/libyaml.so /usr/local/lib/libreadline.so -lcurses -lform /usr/local/lib/libicui18n.so /usr/local/lib/libicuuc.so /usr/local/lib/libicudata.so ../../third_party/luajit/src/libluajit.a ../../src/box/libtuple.a ../../src/lib/json/libjson.a ../../src/box/libxro
 w.a ../../src/libserver.a ../../src/lib/coll/libcoll.a ../../src/lib/http_parser/libhttp_parser.a ../../src/box/libxlog.a ../../src/box/libbox_error.a ../../src/libstat.a ../../src/lib/mpstream/libmpstream.a /usr/local/lib/libzstd.so ../../src/libcrc32.a ../../src/libcpu_feature.a ../../src/libscramble.a ../../src/lib/raft/libraft.a ../../src/lib/vclock/libvclock.a ../../src/lib/bitset/libbitset.a ../../src/lib/csv/libcsv.a ../../src/lib/swim/libswim.a ../../libmisc.a -lomp ../../src/lib/uuid/libuuid.a ../../src/lib/crypto/libcrypto.a ../../src/lib/swim/libswim_udp.a ../../src/lib/swim/libswim_ev.a ../../src/lib/core/libcore.a /usr/local/lib/libicui18n.so /usr/local/lib/libicuuc.so /usr/local/lib/libicudata.so ../../src/lib/bit/libbit.a ../../src/lib/uri/liburi.a ../../src/lib/salad/libsalad.a ../../src/lib/small/libsmall.a ../../libdecNumber.a ../../libev.a -lm ../../libeio.a -lpthread ../../libcoro.a ../../src/libshutdown.a /usr/local/lib/libmsgpuck.so -lc -lssl -lcrypto /usr/loca
 l/lib/libintl.so 
gmake[3]: Leaving directory '/wrkdirs/usr/ports/databases/tarantool/work/.build'
[ 83%] Built target luaT_tuple_new.test
gmake  -f test/unit/CMakeFiles/bps_tree.test.dir/build.make test/unit/CMakeFiles/bps_tree.test.dir/depend
gmake[3]: Entering directory '/wrkdirs/usr/ports/databases/tarantool/work/.build'
cd /wrkdirs/usr/ports/databases/tarantool/work/.build && /usr/local/bin/cmake -E cmake_depends "Unix Makefiles" /wrkdirs/usr/ports/databases/tarantool/work/tarantool-2.8.1 /wrkdirs/usr/ports/databases/tarantool/work/tarantool-2.8.1/test/unit /wrkdirs/usr/ports/databases/tarantool/work/.build /wrkdirs/usr/ports/databases/tarantool/work/.build/test/unit /wrkdirs/usr/ports/databases/tarantool/work/.build/test/unit/CMakeFiles/bps_tree.test.dir/DependInfo.cmake
gmake[3]: Leaving directory '/wrkdirs/usr/ports/databases/tarantool/work/.build'
gmake  -f test/unit/CMakeFiles/bps_tree.test.dir/build.make test/unit/CMakeFiles/bps_tree.test.dir/build
gmake[3]: Entering directory '/wrkdirs/usr/ports/databases/tarantool/work/.build'
[ 83%] Building CXX object test/unit/CMakeFiles/bps_tree.test.dir/bps_tree.cc.o
cd /wrkdirs/usr/ports/databases/tarantool/work/.build/test/unit && /usr/bin/c++ -DCORO_ASM -DLUAJIT_SMART_STRINGS=1 -DNDEBUG -DNVALGRIND -DNVALGRIND=1 -D__STDC_CONSTANT_MACROS=1 -D__STDC_FORMAT_MACROS=1 -D__STDC_LIMIT_MACROS=1 -I/wrkdirs/usr/ports/databases/tarantool/work/tarantool-2.8.1/src -I/wrkdirs/usr/ports/databases/tarantool/work/.build/src -I/wrkdirs/usr/ports/databases/tarantool/work/tarantool-2.8.1/src/lib -I/wrkdirs/usr/ports/databases/tarantool/work/tarantool-2.8.1/src/lib/small -I/wrkdirs/usr/ports/databases/tarantool/work/tarantool-2.8.1/src/lib/small/third_party -I/wrkdirs/usr/ports/databases/tarantool/work/tarantool-2.8.1/src/lib/core -I/wrkdirs/usr/ports/databases/tarantool/work/tarantool-2.8.1 -I/wrkdirs/usr/ports/databases/tarantool/work/tarantool-2.8.1/third_party/luajit/src -I/wrkdirs/usr/ports/databases/tarantool/work/.build/third_party/luajit/src -I/usr/local/include -I/wrkdirs/usr/ports/databases/tarantool/work/tarantool-2.8.1/src/box -I/wrkdirs/usr/ports/data
 bases/tarantool/work/tarantool-2.8.1/third_party -O2 -pipe -DLIBICONV_PLUG -fstack-protector-strong -fno-strict-aliasing  -DLIBICONV_PLUG -fexceptions -funwind-tables -fno-common -fopenmp -std=c++11 -Wall -Wextra -Wno-strict-aliasing -Wno-char-subscripts -Wno-invalid-offsetof -Wno-gnu-alignof-expression -Wno-unused-parameter -Wno-unused -Wno-unused-result -Wno-tautological-compare -O2 -pipe -DLIBICONV_PLUG -fstack-protector-strong -fno-strict-aliasing  -DLIBICONV_PLUG -MD -MT test/unit/CMakeFiles/bps_tree.test.dir/bps_tree.cc.o -MF CMakeFiles/bps_tree.test.dir/bps_tree.cc.o.d -o CMakeFiles/bps_tree.test.dir/bps_tree.cc.o -c /wrkdirs/usr/ports/databases/tarantool/work/tarantool-2.8.1/test/unit/bps_tree.cc
[ 83%] Linking CXX executable bps_tree.test
cd /wrkdirs/usr/ports/databases/tarantool/work/.build/test/unit && /usr/local/bin/cmake -E cmake_link_script CMakeFiles/bps_tree.test.dir/link.txt --verbose=1
/usr/bin/c++ -O2 -pipe -DLIBICONV_PLUG -fstack-protector-strong -fno-strict-aliasing  -DLIBICONV_PLUG -fexceptions -funwind-tables -fno-common -fopenmp -std=c++11 -Wall -Wextra -Wno-strict-aliasing -Wno-char-subscripts -Wno-invalid-offsetof -Wno-gnu-alignof-expression -Wno-unused-parameter -Wno-unused -Wno-unused-result -Wno-tautological-compare -O2 -pipe -DLIBICONV_PLUG -fstack-protector-strong -fno-strict-aliasing  -DLIBICONV_PLUG  -L/usr/local/lib  -fstack-protector-strong CMakeFiles/bps_tree.test.dir/bps_tree.cc.o -o bps_tree.test  ../../src/lib/small/libsmall.a ../../libmisc.a -lm -lomp -lpthread 
gmake[3]: Leaving directory '/wrkdirs/usr/ports/databases/tarantool/work/.build'
[ 83%] Built target bps_tree.test
gmake  -f test/unit/CMakeFiles/fiber_stack.test.dir/build.make test/unit/CMakeFiles/fiber_stack.test.dir/depend
gmake[3]: Entering directory '/wrkdirs/usr/ports/databases/tarantool/work/.build'
cd /wrkdirs/usr/ports/databases/tarantool/work/.build && /usr/local/bin/cmake -E cmake_depends "Unix Makefiles" /wrkdirs/usr/ports/databases/tarantool/work/tarantool-2.8.1 /wrkdirs/usr/ports/databases/tarantool/work/tarantool-2.8.1/test/unit /wrkdirs/usr/ports/databases/tarantool/work/.build /wrkdirs/usr/ports/databases/tarantool/work/.build/test/unit /wrkdirs/usr/ports/databases/tarantool/work/.build/test/unit/CMakeFiles/fiber_stack.test.dir/DependInfo.cmake
gmake[3]: Leaving directory '/wrkdirs/usr/ports/databases/tarantool/work/.build'
gmake  -f test/unit/CMakeFiles/fiber_stack.test.dir/build.make test/unit/CMakeFiles/fiber_stack.test.dir/build
gmake[3]: Entering directory '/wrkdirs/usr/ports/databases/tarantool/work/.build'
[ 83%] Building C object test/unit/CMakeFiles/fiber_stack.test.dir/fiber_stack.c.o
cd /wrkdirs/usr/ports/databases/tarantool/work/.build/test/unit && /usr/bin/cc -DCORO_ASM -DLUAJIT_SMART_STRINGS=1 -DNDEBUG -DNVALGRIND -DNVALGRIND=1 -D__STDC_CONSTANT_MACROS=1 -D__STDC_FORMAT_MACROS=1 -D__STDC_LIMIT_MACROS=1 -I/wrkdirs/usr/ports/databases/tarantool/work/tarantool-2.8.1/src -I/wrkdirs/usr/ports/databases/tarantool/work/.build/src -I/wrkdirs/usr/ports/databases/tarantool/work/tarantool-2.8.1/src/lib -I/wrkdirs/usr/ports/databases/tarantool/work/tarantool-2.8.1/src/lib/small -I/wrkdirs/usr/ports/databases/tarantool/work/tarantool-2.8.1/src/lib/small/third_party -I/wrkdirs/usr/ports/databases/tarantool/work/tarantool-2.8.1/src/lib/core -I/wrkdirs/usr/ports/databases/tarantool/work/tarantool-2.8.1 -I/wrkdirs/usr/ports/databases/tarantool/work/tarantool-2.8.1/third_party/luajit/src -I/wrkdirs/usr/ports/databases/tarantool/work/.build/third_party/luajit/src -I/usr/local/include -I/wrkdirs/usr/ports/databases/tarantool/work/tarantool-2.8.1/src/box -I/wrkdirs/usr/ports/datab
 ases/tarantool/work/tarantool-2.8.1/third_party -O2 -pipe  -DLIBICONV_PLUG -fstack-protector-strong -fno-strict-aliasing -fexceptions -funwind-tables -fno-common -fopenmp -std=c11 -Wall -Wextra -Wno-strict-aliasing -Wno-char-subscripts -Wno-gnu-alignof-expression -Wno-unused-parameter -Wno-unused -Wno-unused-result -Wno-tautological-compare -O2 -pipe  -DLIBICONV_PLUG -fstack-protector-strong -fno-strict-aliasing -MD -MT test/unit/CMakeFiles/fiber_stack.test.dir/fiber_stack.c.o -MF CMakeFiles/fiber_stack.test.dir/fiber_stack.c.o.d -o CMakeFiles/fiber_stack.test.dir/fiber_stack.c.o -c /wrkdirs/usr/ports/databases/tarantool/work/tarantool-2.8.1/test/unit/fiber_stack.c
[ 83%] Building C object test/unit/CMakeFiles/fiber_stack.test.dir/core_test_utils.c.o
cd /wrkdirs/usr/ports/databases/tarantool/work/.build/test/unit && /usr/bin/cc -DCORO_ASM -DLUAJIT_SMART_STRINGS=1 -DNDEBUG -DNVALGRIND -DNVALGRIND=1 -D__STDC_CONSTANT_MACROS=1 -D__STDC_FORMAT_MACROS=1 -D__STDC_LIMIT_MACROS=1 -I/wrkdirs/usr/ports/databases/tarantool/work/tarantool-2.8.1/src -I/wrkdirs/usr/ports/databases/tarantool/work/.build/src -I/wrkdirs/usr/ports/databases/tarantool/work/tarantool-2.8.1/src/lib -I/wrkdirs/usr/ports/databases/tarantool/work/tarantool-2.8.1/src/lib/small -I/wrkdirs/usr/ports/databases/tarantool/work/tarantool-2.8.1/src/lib/small/third_party -I/wrkdirs/usr/ports/databases/tarantool/work/tarantool-2.8.1/src/lib/core -I/wrkdirs/usr/ports/databases/tarantool/work/tarantool-2.8.1 -I/wrkdirs/usr/ports/databases/tarantool/work/tarantool-2.8.1/third_party/luajit/src -I/wrkdirs/usr/ports/databases/tarantool/work/.build/third_party/luajit/src -I/usr/local/include -I/wrkdirs/usr/ports/databases/tarantool/work/tarantool-2.8.1/src/box -I/wrkdirs/usr/ports/datab
 ases/tarantool/work/tarantool-2.8.1/third_party -O2 -pipe  -DLIBICONV_PLUG -fstack-protector-strong -fno-strict-aliasing -fexceptions -funwind-tables -fno-common -fopenmp -std=c11 -Wall -Wextra -Wno-strict-aliasing -Wno-char-subscripts -Wno-gnu-alignof-expression -Wno-unused-parameter -Wno-unused -Wno-unused-result -Wno-tautological-compare -O2 -pipe  -DLIBICONV_PLUG -fstack-protector-strong -fno-strict-aliasing -MD -MT test/unit/CMakeFiles/fiber_stack.test.dir/core_test_utils.c.o -MF CMakeFiles/fiber_stack.test.dir/core_test_utils.c.o.d -o CMakeFiles/fiber_stack.test.dir/core_test_utils.c.o -c /wrkdirs/usr/ports/databases/tarantool/work/tarantool-2.8.1/test/unit/core_test_utils.c
[ 83%] Linking CXX executable fiber_stack.test
cd /wrkdirs/usr/ports/databases/tarantool/work/.build/test/unit && /usr/local/bin/cmake -E cmake_link_script CMakeFiles/fiber_stack.test.dir/link.txt --verbose=1
/usr/bin/c++ -O2 -pipe -DLIBICONV_PLUG -fstack-protector-strong -fno-strict-aliasing  -DLIBICONV_PLUG -fexceptions -funwind-tables -fno-common -fopenmp -std=c++11 -Wall -Wextra -Wno-strict-aliasing -Wno-char-subscripts -Wno-invalid-offsetof -Wno-gnu-alignof-expression -Wno-unused-parameter -Wno-unused -Wno-unused-result -Wno-tautological-compare -O2 -pipe -DLIBICONV_PLUG -fstack-protector-strong -fno-strict-aliasing  -DLIBICONV_PLUG  -L/usr/local/lib  -fstack-protector-strong CMakeFiles/fiber_stack.test.dir/fiber_stack.c.o CMakeFiles/fiber_stack.test.dir/core_test_utils.c.o -o fiber_stack.test  -Wl,-rpath,/usr/local/lib ../../src/lib/core/libcore.a libunit.a ../../src/lib/salad/libsalad.a ../../src/lib/small/libsmall.a ../../src/lib/uri/liburi.a ../../libdecNumber.a ../../src/lib/bit/libbit.a ../../libev.a -lm ../../libeio.a -lpthread ../../libcoro.a /usr/local/lib/libmsgpuck.so /usr/local/lib/libicui18n.so /usr/local/lib/libicuuc.so /usr/local/lib/libicudata.so 
gmake[3]: Leaving directory '/wrkdirs/usr/ports/databases/tarantool/work/.build'
[ 83%] Built target fiber_stack.test
gmake  -f test/unit/CMakeFiles/fiber.test.dir/build.make test/unit/CMakeFiles/fiber.test.dir/depend
gmake[3]: Entering directory '/wrkdirs/usr/ports/databases/tarantool/work/.build'
cd /wrkdirs/usr/ports/databases/tarantool/work/.build && /usr/local/bin/cmake -E cmake_depends "Unix Makefiles" /wrkdirs/usr/ports/databases/tarantool/work/tarantool-2.8.1 /wrkdirs/usr/ports/databases/tarantool/work/tarantool-2.8.1/test/unit /wrkdirs/usr/ports/databases/tarantool/work/.build /wrkdirs/usr/ports/databases/tarantool/work/.build/test/unit /wrkdirs/usr/ports/databases/tarantool/work/.build/test/unit/CMakeFiles/fiber.test.dir/DependInfo.cmake
gmake[3]: Leaving directory '/wrkdirs/usr/ports/databases/tarantool/work/.build'
gmake  -f test/unit/CMakeFiles/fiber.test.dir/build.make test/unit/CMakeFiles/fiber.test.dir/build
gmake[3]: Entering directory '/wrkdirs/usr/ports/databases/tarantool/work/.build'
[ 83%] Building CXX object test/unit/CMakeFiles/fiber.test.dir/fiber.cc.o
cd /wrkdirs/usr/ports/databases/tarantool/work/.build/test/unit && /usr/bin/c++ -DCORO_ASM -DLUAJIT_SMART_STRINGS=1 -DNDEBUG -DNVALGRIND -DNVALGRIND=1 -D__STDC_CONSTANT_MACROS=1 -D__STDC_FORMAT_MACROS=1 -D__STDC_LIMIT_MACROS=1 -I/wrkdirs/usr/ports/databases/tarantool/work/tarantool-2.8.1/src -I/wrkdirs/usr/ports/databases/tarantool/work/.build/src -I/wrkdirs/usr/ports/databases/tarantool/work/tarantool-2.8.1/src/lib -I/wrkdirs/usr/ports/databases/tarantool/work/tarantool-2.8.1/src/lib/small -I/wrkdirs/usr/ports/databases/tarantool/work/tarantool-2.8.1/src/lib/small/third_party -I/wrkdirs/usr/ports/databases/tarantool/work/tarantool-2.8.1/src/lib/core -I/wrkdirs/usr/ports/databases/tarantool/work/tarantool-2.8.1 -I/wrkdirs/usr/ports/databases/tarantool/work/tarantool-2.8.1/third_party/luajit/src -I/wrkdirs/usr/ports/databases/tarantool/work/.build/third_party/luajit/src -I/usr/local/include -I/wrkdirs/usr/ports/databases/tarantool/work/tarantool-2.8.1/src/box -I/wrkdirs/usr/ports/data
 bases/tarantool/work/tarantool-2.8.1/third_party -O2 -pipe -DLIBICONV_PLUG -fstack-protector-strong -fno-strict-aliasing  -DLIBICONV_PLUG -fexceptions -funwind-tables -fno-common -fopenmp -std=c++11 -Wall -Wextra -Wno-strict-aliasing -Wno-char-subscripts -Wno-invalid-offsetof -Wno-gnu-alignof-expression -Wno-unused-parameter -Wno-unused -Wno-unused-result -Wno-tautological-compare -O2 -pipe -DLIBICONV_PLUG -fstack-protector-strong -fno-strict-aliasing  -DLIBICONV_PLUG -MD -MT test/unit/CMakeFiles/fiber.test.dir/fiber.cc.o -MF CMakeFiles/fiber.test.dir/fiber.cc.o.d -o CMakeFiles/fiber.test.dir/fiber.cc.o -c /wrkdirs/usr/ports/databases/tarantool/work/tarantool-2.8.1/test/unit/fiber.cc
[ 83%] Building C object test/unit/CMakeFiles/fiber.test.dir/core_test_utils.c.o
cd /wrkdirs/usr/ports/databases/tarantool/work/.build/test/unit && /usr/bin/cc -DCORO_ASM -DLUAJIT_SMART_STRINGS=1 -DNDEBUG -DNVALGRIND -DNVALGRIND=1 -D__STDC_CONSTANT_MACROS=1 -D__STDC_FORMAT_MACROS=1 -D__STDC_LIMIT_MACROS=1 -I/wrkdirs/usr/ports/databases/tarantool/work/tarantool-2.8.1/src -I/wrkdirs/usr/ports/databases/tarantool/work/.build/src -I/wrkdirs/usr/ports/databases/tarantool/work/tarantool-2.8.1/src/lib -I/wrkdirs/usr/ports/databases/tarantool/work/tarantool-2.8.1/src/lib/small -I/wrkdirs/usr/ports/databases/tarantool/work/tarantool-2.8.1/src/lib/small/third_party -I/wrkdirs/usr/ports/databases/tarantool/work/tarantool-2.8.1/src/lib/core -I/wrkdirs/usr/ports/databases/tarantool/work/tarantool-2.8.1 -I/wrkdirs/usr/ports/databases/tarantool/work/tarantool-2.8.1/third_party/luajit/src -I/wrkdirs/usr/ports/databases/tarantool/work/.build/third_party/luajit/src -I/usr/local/include -I/wrkdirs/usr/ports/databases/tarantool/work/tarantool-2.8.1/src/box -I/wrkdirs/usr/ports/datab
 ases/tarantool/work/tarantool-2.8.1/third_party -O2 -pipe  -DLIBICONV_PLUG -fstack-protector-strong -fno-strict-aliasing -fexceptions -funwind-tables -fno-common -fopenmp -std=c11 -Wall -Wextra -Wno-strict-aliasing -Wno-char-subscripts -Wno-gnu-alignof-expression -Wno-unused-parameter -Wno-unused -Wno-unused-result -Wno-tautological-compare -O2 -pipe  -DLIBICONV_PLUG -fstack-protector-strong -fno-strict-aliasing -MD -MT test/unit/CMakeFiles/fiber.test.dir/core_test_utils.c.o -MF CMakeFiles/fiber.test.dir/core_test_utils.c.o.d -o CMakeFiles/fiber.test.dir/core_test_utils.c.o -c /wrkdirs/usr/ports/databases/tarantool/work/tarantool-2.8.1/test/unit/core_test_utils.c
[ 83%] Linking CXX executable fiber.test
cd /wrkdirs/usr/ports/databases/tarantool/work/.build/test/unit && /usr/local/bin/cmake -E cmake_link_script CMakeFiles/fiber.test.dir/link.txt --verbose=1
/usr/bin/c++ -O2 -pipe -DLIBICONV_PLUG -fstack-protector-strong -fno-strict-aliasing  -DLIBICONV_PLUG -fexceptions -funwind-tables -fno-common -fopenmp -std=c++11 -Wall -Wextra -Wno-strict-aliasing -Wno-char-subscripts -Wno-invalid-offsetof -Wno-gnu-alignof-expression -Wno-unused-parameter -Wno-unused -Wno-unused-result -Wno-tautological-compare -O2 -pipe -DLIBICONV_PLUG -fstack-protector-strong -fno-strict-aliasing  -DLIBICONV_PLUG  -L/usr/local/lib  -fstack-protector-strong CMakeFiles/fiber.test.dir/fiber.cc.o CMakeFiles/fiber.test.dir/core_test_utils.c.o -o fiber.test  -Wl,-rpath,/usr/local/lib ../../src/lib/core/libcore.a libunit.a ../../src/lib/salad/libsalad.a ../../src/lib/small/libsmall.a ../../src/lib/uri/liburi.a ../../libdecNumber.a ../../src/lib/bit/libbit.a ../../libev.a -lm ../../libeio.a -lpthread ../../libcoro.a /usr/local/lib/libmsgpuck.so /usr/local/lib/libicui18n.so /usr/local/lib/libicuuc.so /usr/local/lib/libicudata.so 
gmake[3]: Leaving directory '/wrkdirs/usr/ports/databases/tarantool/work/.build'
[ 83%] Built target fiber.test
gmake  -f test/unit/CMakeFiles/vclock.test.dir/build.make test/unit/CMakeFiles/vclock.test.dir/depend
gmake[3]: Entering directory '/wrkdirs/usr/ports/databases/tarantool/work/.build'
cd /wrkdirs/usr/ports/databases/tarantool/work/.build && /usr/local/bin/cmake -E cmake_depends "Unix Makefiles" /wrkdirs/usr/ports/databases/tarantool/work/tarantool-2.8.1 /wrkdirs/usr/ports/databases/tarantool/work/tarantool-2.8.1/test/unit /wrkdirs/usr/ports/databases/tarantool/work/.build /wrkdirs/usr/ports/databases/tarantool/work/.build/test/unit /wrkdirs/usr/ports/databases/tarantool/work/.build/test/unit/CMakeFiles/vclock.test.dir/DependInfo.cmake
gmake[3]: Leaving directory '/wrkdirs/usr/ports/databases/tarantool/work/.build'
gmake  -f test/unit/CMakeFiles/vclock.test.dir/build.make test/unit/CMakeFiles/vclock.test.dir/build
gmake[3]: Entering directory '/wrkdirs/usr/ports/databases/tarantool/work/.build'
[ 85%] Building CXX object test/unit/CMakeFiles/vclock.test.dir/vclock.cc.o
cd /wrkdirs/usr/ports/databases/tarantool/work/.build/test/unit && /usr/bin/c++ -DCORO_ASM -DLUAJIT_SMART_STRINGS=1 -DNDEBUG -DNVALGRIND -DNVALGRIND=1 -D__STDC_CONSTANT_MACROS=1 -D__STDC_FORMAT_MACROS=1 -D__STDC_LIMIT_MACROS=1 -I/wrkdirs/usr/ports/databases/tarantool/work/tarantool-2.8.1/src -I/wrkdirs/usr/ports/databases/tarantool/work/.build/src -I/wrkdirs/usr/ports/databases/tarantool/work/tarantool-2.8.1/src/lib -I/wrkdirs/usr/ports/databases/tarantool/work/tarantool-2.8.1/src/lib/small -I/wrkdirs/usr/ports/databases/tarantool/work/tarantool-2.8.1/src/lib/small/third_party -I/wrkdirs/usr/ports/databases/tarantool/work/tarantool-2.8.1/src/lib/core -I/wrkdirs/usr/ports/databases/tarantool/work/tarantool-2.8.1 -I/wrkdirs/usr/ports/databases/tarantool/work/tarantool-2.8.1/third_party/luajit/src -I/wrkdirs/usr/ports/databases/tarantool/work/.build/third_party/luajit/src -I/usr/local/include -I/wrkdirs/usr/ports/databases/tarantool/work/tarantool-2.8.1/src/box -I/wrkdirs/usr/ports/data
 bases/tarantool/work/tarantool-2.8.1/third_party -O2 -pipe -DLIBICONV_PLUG -fstack-protector-strong -fno-strict-aliasing  -DLIBICONV_PLUG -fexceptions -funwind-tables -fno-common -fopenmp -std=c++11 -Wall -Wextra -Wno-strict-aliasing -Wno-char-subscripts -Wno-invalid-offsetof -Wno-gnu-alignof-expression -Wno-unused-parameter -Wno-unused -Wno-unused-result -Wno-tautological-compare -O2 -pipe -DLIBICONV_PLUG -fstack-protector-strong -fno-strict-aliasing  -DLIBICONV_PLUG -MD -MT test/unit/CMakeFiles/vclock.test.dir/vclock.cc.o -MF CMakeFiles/vclock.test.dir/vclock.cc.o.d -o CMakeFiles/vclock.test.dir/vclock.cc.o -c /wrkdirs/usr/ports/databases/tarantool/work/tarantool-2.8.1/test/unit/vclock.cc
[ 85%] Linking CXX executable vclock.test
cd /wrkdirs/usr/ports/databases/tarantool/work/.build/test/unit && /usr/local/bin/cmake -E cmake_link_script CMakeFiles/vclock.test.dir/link.txt --verbose=1
/usr/bin/c++ -O2 -pipe -DLIBICONV_PLUG -fstack-protector-strong -fno-strict-aliasing  -DLIBICONV_PLUG -fexceptions -funwind-tables -fno-common -fopenmp -std=c++11 -Wall -Wextra -Wno-strict-aliasing -Wno-char-subscripts -Wno-invalid-offsetof -Wno-gnu-alignof-expression -Wno-unused-parameter -Wno-unused -Wno-unused-result -Wno-tautological-compare -O2 -pipe -DLIBICONV_PLUG -fstack-protector-strong -fno-strict-aliasing  -DLIBICONV_PLUG  -L/usr/local/lib  -fstack-protector-strong CMakeFiles/vclock.test.dir/vclock.cc.o -o vclock.test  -Wl,-rpath,/usr/local/lib ../../src/lib/vclock/libvclock.a libunit.a ../../src/lib/core/libcore.a ../../src/lib/salad/libsalad.a ../../src/lib/small/libsmall.a ../../src/lib/uri/liburi.a ../../libdecNumber.a ../../libev.a -lm ../../libeio.a -lpthread ../../libcoro.a /usr/local/lib/libmsgpuck.so /usr/local/lib/libicui18n.so /usr/local/lib/libicuuc.so /usr/local/lib/libicudata.so ../../src/lib/bit/libbit.a 
gmake[3]: Leaving directory '/wrkdirs/usr/ports/databases/tarantool/work/.build'
[ 85%] Built target vclock.test
gmake  -f test/unit/CMakeFiles/xrow.test.dir/build.make test/unit/CMakeFiles/xrow.test.dir/depend
gmake[3]: Entering directory '/wrkdirs/usr/ports/databases/tarantool/work/.build'
cd /wrkdirs/usr/ports/databases/tarantool/work/.build && /usr/local/bin/cmake -E cmake_depends "Unix Makefiles" /wrkdirs/usr/ports/databases/tarantool/work/tarantool-2.8.1 /wrkdirs/usr/ports/databases/tarantool/work/tarantool-2.8.1/test/unit /wrkdirs/usr/ports/databases/tarantool/work/.build /wrkdirs/usr/ports/databases/tarantool/work/.build/test/unit /wrkdirs/usr/ports/databases/tarantool/work/.build/test/unit/CMakeFiles/xrow.test.dir/DependInfo.cmake
gmake[3]: Leaving directory '/wrkdirs/usr/ports/databases/tarantool/work/.build'
gmake  -f test/unit/CMakeFiles/xrow.test.dir/build.make test/unit/CMakeFiles/xrow.test.dir/build
gmake[3]: Entering directory '/wrkdirs/usr/ports/databases/tarantool/work/.build'
[ 85%] Building CXX object test/unit/CMakeFiles/xrow.test.dir/xrow.cc.o
cd /wrkdirs/usr/ports/databases/tarantool/work/.build/test/unit && /usr/bin/c++ -DCORO_ASM -DLUAJIT_SMART_STRINGS=1 -DNDEBUG -DNVALGRIND -DNVALGRIND=1 -D__STDC_CONSTANT_MACROS=1 -D__STDC_FORMAT_MACROS=1 -D__STDC_LIMIT_MACROS=1 -I/wrkdirs/usr/ports/databases/tarantool/work/tarantool-2.8.1/src -I/wrkdirs/usr/ports/databases/tarantool/work/.build/src -I/wrkdirs/usr/ports/databases/tarantool/work/tarantool-2.8.1/src/lib -I/wrkdirs/usr/ports/databases/tarantool/work/tarantool-2.8.1/src/lib/small -I/wrkdirs/usr/ports/databases/tarantool/work/tarantool-2.8.1/src/lib/small/third_party -I/wrkdirs/usr/ports/databases/tarantool/work/tarantool-2.8.1/src/lib/core -I/wrkdirs/usr/ports/databases/tarantool/work/tarantool-2.8.1 -I/wrkdirs/usr/ports/databases/tarantool/work/tarantool-2.8.1/third_party/luajit/src -I/wrkdirs/usr/ports/databases/tarantool/work/.build/third_party/luajit/src -I/usr/local/include -I/wrkdirs/usr/ports/databases/tarantool/work/tarantool-2.8.1/src/box -I/wrkdirs/usr/ports/data
 bases/tarantool/work/tarantool-2.8.1/third_party -O2 -pipe -DLIBICONV_PLUG -fstack-protector-strong -fno-strict-aliasing  -DLIBICONV_PLUG -fexceptions -funwind-tables -fno-common -fopenmp -std=c++11 -Wall -Wextra -Wno-strict-aliasing -Wno-char-subscripts -Wno-invalid-offsetof -Wno-gnu-alignof-expression -Wno-unused-parameter -Wno-unused -Wno-unused-result -Wno-tautological-compare -O2 -pipe -DLIBICONV_PLUG -fstack-protector-strong -fno-strict-aliasing  -DLIBICONV_PLUG -MD -MT test/unit/CMakeFiles/xrow.test.dir/xrow.cc.o -MF CMakeFiles/xrow.test.dir/xrow.cc.o.d -o CMakeFiles/xrow.test.dir/xrow.cc.o -c /wrkdirs/usr/ports/databases/tarantool/work/tarantool-2.8.1/test/unit/xrow.cc
[ 85%] Building C object test/unit/CMakeFiles/xrow.test.dir/core_test_utils.c.o
cd /wrkdirs/usr/ports/databases/tarantool/work/.build/test/unit && /usr/bin/cc -DCORO_ASM -DLUAJIT_SMART_STRINGS=1 -DNDEBUG -DNVALGRIND -DNVALGRIND=1 -D__STDC_CONSTANT_MACROS=1 -D__STDC_FORMAT_MACROS=1 -D__STDC_LIMIT_MACROS=1 -I/wrkdirs/usr/ports/databases/tarantool/work/tarantool-2.8.1/src -I/wrkdirs/usr/ports/databases/tarantool/work/.build/src -I/wrkdirs/usr/ports/databases/tarantool/work/tarantool-2.8.1/src/lib -I/wrkdirs/usr/ports/databases/tarantool/work/tarantool-2.8.1/src/lib/small -I/wrkdirs/usr/ports/databases/tarantool/work/tarantool-2.8.1/src/lib/small/third_party -I/wrkdirs/usr/ports/databases/tarantool/work/tarantool-2.8.1/src/lib/core -I/wrkdirs/usr/ports/databases/tarantool/work/tarantool-2.8.1 -I/wrkdirs/usr/ports/databases/tarantool/work/tarantool-2.8.1/third_party/luajit/src -I/wrkdirs/usr/ports/databases/tarantool/work/.build/third_party/luajit/src -I/usr/local/include -I/wrkdirs/usr/ports/databases/tarantool/work/tarantool-2.8.1/src/box -I/wrkdirs/usr/ports/datab
 ases/tarantool/work/tarantool-2.8.1/third_party -O2 -pipe  -DLIBICONV_PLUG -fstack-protector-strong -fno-strict-aliasing -fexceptions -funwind-tables -fno-common -fopenmp -std=c11 -Wall -Wextra -Wno-strict-aliasing -Wno-char-subscripts -Wno-gnu-alignof-expression -Wno-unused-parameter -Wno-unused -Wno-unused-result -Wno-tautological-compare -O2 -pipe  -DLIBICONV_PLUG -fstack-protector-strong -fno-strict-aliasing -MD -MT test/unit/CMakeFiles/xrow.test.dir/core_test_utils.c.o -MF CMakeFiles/xrow.test.dir/core_test_utils.c.o.d -o CMakeFiles/xrow.test.dir/core_test_utils.c.o -c /wrkdirs/usr/ports/databases/tarantool/work/tarantool-2.8.1/test/unit/core_test_utils.c
[ 86%] Linking CXX executable xrow.test
cd /wrkdirs/usr/ports/databases/tarantool/work/.build/test/unit && /usr/local/bin/cmake -E cmake_link_script CMakeFiles/xrow.test.dir/link.txt --verbose=1
/usr/bin/c++ -O2 -pipe -DLIBICONV_PLUG -fstack-protector-strong -fno-strict-aliasing  -DLIBICONV_PLUG -fexceptions -funwind-tables -fno-common -fopenmp -std=c++11 -Wall -Wextra -Wno-strict-aliasing -Wno-char-subscripts -Wno-invalid-offsetof -Wno-gnu-alignof-expression -Wno-unused-parameter -Wno-unused -Wno-unused-result -Wno-tautological-compare -O2 -pipe -DLIBICONV_PLUG -fstack-protector-strong -fno-strict-aliasing  -DLIBICONV_PLUG  -L/usr/local/lib  -fstack-protector-strong CMakeFiles/xrow.test.dir/xrow.cc.o CMakeFiles/xrow.test.dir/core_test_utils.c.o -o xrow.test  -Wl,-rpath,/usr/local/lib ../../src/box/libxrow.a libunit.a ../../src/libserver.a ../../src/lib/coll/libcoll.a ../../src/lib/http_parser/libhttp_parser.a ../../src/lib/swim/libswim.a ../../src/lib/swim/libswim_udp.a ../../src/lib/swim/libswim_ev.a ../../src/lib/crypto/libcrypto.a -lssl -lcrypto ../../src/libcrc32.a ../../src/libcpu_feature.a ../../src/box/libbox_error.a ../../src/lib/vclock/libvclock.a ../../src/lib/mps
 tream/libmpstream.a ../../src/lib/uuid/libuuid.a ../../src/libstat.a ../../src/libscramble.a ../../src/lib/core/libcore.a ../../src/lib/small/libsmall.a ../../src/lib/bit/libbit.a ../../src/lib/uri/liburi.a ../../src/lib/salad/libsalad.a ../../libdecNumber.a ../../libev.a -lm ../../libeio.a ../../libcoro.a /usr/local/lib/libicui18n.so /usr/local/lib/libicuuc.so /usr/local/lib/libicudata.so ../../libmisc.a -lomp -lpthread /usr/local/lib/libmsgpuck.so 
gmake[3]: Leaving directory '/wrkdirs/usr/ports/databases/tarantool/work/.build'
[ 86%] Built target xrow.test
gmake  -f test/unit/CMakeFiles/bloom.test.dir/build.make test/unit/CMakeFiles/bloom.test.dir/depend
gmake[3]: Entering directory '/wrkdirs/usr/ports/databases/tarantool/work/.build'
cd /wrkdirs/usr/ports/databases/tarantool/work/.build && /usr/local/bin/cmake -E cmake_depends "Unix Makefiles" /wrkdirs/usr/ports/databases/tarantool/work/tarantool-2.8.1 /wrkdirs/usr/ports/databases/tarantool/work/tarantool-2.8.1/test/unit /wrkdirs/usr/ports/databases/tarantool/work/.build /wrkdirs/usr/ports/databases/tarantool/work/.build/test/unit /wrkdirs/usr/ports/databases/tarantool/work/.build/test/unit/CMakeFiles/bloom.test.dir/DependInfo.cmake
gmake[3]: Leaving directory '/wrkdirs/usr/ports/databases/tarantool/work/.build'
gmake  -f test/unit/CMakeFiles/bloom.test.dir/build.make test/unit/CMakeFiles/bloom.test.dir/build
gmake[3]: Entering directory '/wrkdirs/usr/ports/databases/tarantool/work/.build'
[ 86%] Building CXX object test/unit/CMakeFiles/bloom.test.dir/bloom.cc.o
cd /wrkdirs/usr/ports/databases/tarantool/work/.build/test/unit && /usr/bin/c++ -DCORO_ASM -DLUAJIT_SMART_STRINGS=1 -DNDEBUG -DNVALGRIND -DNVALGRIND=1 -D__STDC_CONSTANT_MACROS=1 -D__STDC_FORMAT_MACROS=1 -D__STDC_LIMIT_MACROS=1 -I/wrkdirs/usr/ports/databases/tarantool/work/tarantool-2.8.1/src -I/wrkdirs/usr/ports/databases/tarantool/work/.build/src -I/wrkdirs/usr/ports/databases/tarantool/work/tarantool-2.8.1/src/lib -I/wrkdirs/usr/ports/databases/tarantool/work/tarantool-2.8.1/src/lib/small -I/wrkdirs/usr/ports/databases/tarantool/work/tarantool-2.8.1/src/lib/small/third_party -I/wrkdirs/usr/ports/databases/tarantool/work/tarantool-2.8.1/src/lib/core -I/wrkdirs/usr/ports/databases/tarantool/work/tarantool-2.8.1 -I/wrkdirs/usr/ports/databases/tarantool/work/tarantool-2.8.1/third_party/luajit/src -I/wrkdirs/usr/ports/databases/tarantool/work/.build/third_party/luajit/src -I/usr/local/include -I/wrkdirs/usr/ports/databases/tarantool/work/tarantool-2.8.1/src/box -I/wrkdirs/usr/ports/data
 bases/tarantool/work/tarantool-2.8.1/third_party -O2 -pipe -DLIBICONV_PLUG -fstack-protector-strong -fno-strict-aliasing  -DLIBICONV_PLUG -fexceptions -funwind-tables -fno-common -fopenmp -std=c++11 -Wall -Wextra -Wno-strict-aliasing -Wno-char-subscripts -Wno-invalid-offsetof -Wno-gnu-alignof-expression -Wno-unused-parameter -Wno-unused -Wno-unused-result -Wno-tautological-compare -O2 -pipe -DLIBICONV_PLUG -fstack-protector-strong -fno-strict-aliasing  -DLIBICONV_PLUG -MD -MT test/unit/CMakeFiles/bloom.test.dir/bloom.cc.o -MF CMakeFiles/bloom.test.dir/bloom.cc.o.d -o CMakeFiles/bloom.test.dir/bloom.cc.o -c /wrkdirs/usr/ports/databases/tarantool/work/tarantool-2.8.1/test/unit/bloom.cc
In file included from /wrkdirs/usr/ports/databases/tarantool/work/tarantool-2.8.1/test/unit/bloom.cc:2:
In file included from /usr/include/c++/v1/unordered_set:390:
In file included from /usr/include/c++/v1/__hash_table:15:
/usr/include/c++/v1/memory:2635:26: error: unexpected type name '_CompressedPair': expected expression
    struct _ALIGNAS_TYPE(_CompressedPair) _Storage {
                         ^
1 error generated.
gmake[3]: *** [test/unit/CMakeFiles/bloom.test.dir/build.make:79: test/unit/CMakeFiles/bloom.test.dir/bloom.cc.o] Error 1
gmake[3]: Leaving directory '/wrkdirs/usr/ports/databases/tarantool/work/.build'
gmake[2]: *** [CMakeFiles/Makefile2:6088: test/unit/CMakeFiles/bloom.test.dir/all] Error 2
gmake[2]: Leaving directory '/wrkdirs/usr/ports/databases/tarantool/work/.build'
gmake[1]: *** [Makefile:159: all] Error 2
gmake[1]: Leaving directory '/wrkdirs/usr/ports/databases/tarantool/work/.build'
*** Error code 1

Stop.
make: stopped in /usr/ports/databases/tarantool
Received on Tue Jun 29 2021 - 03:24:34 UTC

Original text of this message