[package - 122powerpc64-quarterly][devel/libzrtpcpp] Failed for libzrtpcpp-2.3.4_8 in build

From: <pkg-fallout_at_FreeBSD.org>
Date: Sun, 27 Jun 2021 03:41:53 GMT
You are receiving this mail as a port that you maintain
is failing to build on the FreeBSD package build server.
Please investigate the failure and submit a PR to fix
build.

Maintainer:     acm_at_FreeBSD.org
Log URL:        http://foul1.nyi.freebsd.org/data/122powerpc64-quarterly/3a6240c21278/logs/libzrtpcpp-2.3.4_8.log
Build URL:      http://foul1.nyi.freebsd.org/build.html?mastername=122powerpc64-quarterly&build=3a6240c21278
Log:

=>> Building devel/libzrtpcpp
build started at Sun Jun 27 03:40:58 UTC 2021
port directory: /usr/ports/devel/libzrtpcpp
package name: libzrtpcpp-2.3.4_8
building for: FreeBSD 122powerpc64-quarterly-job-06 12.2-RELEASE FreeBSD 12.2-RELEASE powerpc
maintained by: acm_at_FreeBSD.org
Makefile ident: 
Poudriere version: 3.2.8-8-gaf08dbda
Host OSVERSION: 1400008
Jail OSVERSION: 1202000
Job Id: 06

---Begin Environment---
SHELL=/bin/csh
OSVERSION=1202000
UNAME_v=FreeBSD 12.2-RELEASE
UNAME_r=12.2-RELEASE
BLOCKSIZE=K
MAIL=/var/mail/root
STATUS=1
HOME=/root
PATH=/sbin:/bin:/usr/sbin:/usr/bin:/usr/local/sbin:/usr/local/bin:/root/bin
LOCALBASE=/usr/local
USER=root
LIBEXECPREFIX=/usr/local/libexec/poudriere
POUDRIERE_VERSION=3.2.8-8-gaf08dbda
MASTERMNT=/usr/local/poudriere/data/.m/122powerpc64-quarterly/ref
POUDRIERE_BUILD_TYPE=bulk
PACKAGE_BUILDING=yes
SAVED_TERM=
PWD=/usr/local/poudriere/data/.m/122powerpc64-quarterly/ref/.p/pool
P_PORTS_FEATURES=FLAVORS SELECTED_OPTIONS
MASTERNAME=122powerpc64-quarterly
SCRIPTPREFIX=/usr/local/share/poudriere
OLDPWD=/usr/local/poudriere/data/.m/122powerpc64-quarterly/ref/.p
SCRIPTPATH=/usr/local/share/poudriere/bulk.sh
POUDRIEREPATH=/usr/local/bin/poudriere
---End Environment---

---Begin Poudriere Port Flags/Env---
PORT_FLAGS=
PKGENV=
FLAVOR=
DEPENDS_ARGS=
MAKE_ARGS=
---End Poudriere Port Flags/Env---

---Begin OPTIONS List---
---End OPTIONS List---

--MAINTAINER--
acm_at_FreeBSD.org
--End MAINTAINER--

--CONFIGURE_ARGS--

--End CONFIGURE_ARGS--

--CONFIGURE_ENV--
PKG_CONFIG=pkgconf XDG_DATA_HOME=/wrkdirs/usr/ports/devel/libzrtpcpp/work  XDG_CONFIG_HOME=/wrkdirs/usr/ports/devel/libzrtpcpp/work  HOME=/wrkdirs/usr/ports/devel/libzrtpcpp/work TMPDIR="/tmp" PATH=/wrkdirs/usr/ports/devel/libzrtpcpp/work/.bin:/sbin:/bin:/usr/sbin:/usr/bin:/usr/local/sbin:/usr/local/bin:/root/bin SHELL=/bin/sh CONFIG_SHELL=/bin/sh
--End CONFIGURE_ENV--

--MAKE_ENV--
OPENSSLBASE=/usr OPENSSLDIR=/etc/ssl OPENSSLINC=/usr/include OPENSSLLIB=/usr/lib XDG_DATA_HOME=/wrkdirs/usr/ports/devel/libzrtpcpp/work  XDG_CONFIG_HOME=/wrkdirs/usr/ports/devel/libzrtpcpp/work  HOME=/wrkdirs/usr/ports/devel/libzrtpcpp/work TMPDIR="/tmp" PATH=/wrkdirs/usr/ports/devel/libzrtpcpp/work/.bin:/sbin:/bin:/usr/sbin:/usr/bin:/usr/local/sbin:/usr/local/bin:/root/bin NO_PIE=yes MK_DEBUG_FILES=no MK_KERNEL_SYMBOLS=no SHELL=/bin/sh NO_LINT=YES PREFIX=/usr/local  LOCALBASE=/usr/local  CC="cc" CFLAGS="-O2 -pipe  -fstack-protector-strong -fno-strict-aliasing "  CPP="cpp" CPPFLAGS=""  LDFLAGS=" -L/usr/local/lib -L/usr/lib  -fstack-protector-strong " LIBS=""  CXX="c++" CXXFLAGS="-O2 -pipe -fstack-protector-strong -fno-strict-aliasing  -I/usr/local/include -I/usr/include "  MANPREFIX="/usr/local" BSD_INSTALL_PROGRAM="install  -s -m 555"  BSD_INSTALL_LIB="install  -s -m 0644"  BSD_INSTALL_SCRIPT="install  -m 555"  BSD_INSTALL_DATA="install  -m 0644"  BSD_INSTALL_MAN="install  -m 444"
--End MAKE_ENV--

--PLIST_SUB--
CMAKE_BUILD_TYPE="release" OSREL=12.2 PREFIX=%D LOCALBASE=/usr/local  RESETPREFIX=/usr/local LIB32DIR=lib DOCSDIR="share/doc/libzrtpcpp"  EXAMPLESDIR="share/examples/libzrtpcpp"  DATADIR="share/libzrtpcpp"  WWWDIR="www/libzrtpcpp"  ETCDIR="etc/libzrtpcpp"
--End PLIST_SUB--

--SUB_LIST--
PREFIX=/usr/local LOCALBASE=/usr/local  DATADIR=/usr/local/share/libzrtpcpp DOCSDIR=/usr/local/share/doc/libzrtpcpp EXAMPLESDIR=/usr/local/share/examples/libzrtpcpp  WWWDIR=/usr/local/www/libzrtpcpp ETCDIR=/usr/local/etc/libzrtpcpp
--End SUB_LIST--

---Begin make.conf---
USE_PACKAGE_DEPENDS=yes
BATCH=yes
WRKDIRPREFIX=/wrkdirs
PORTSDIR=/usr/ports
PACKAGES=/packages
DISTDIR=/distfiles
PACKAGE_BUILDING=yes
PACKAGE_BUILDING_FLAVORS=yes
#### /usr/local/etc/poudriere.d/make.conf ####
# XXX: We really need this but cannot use it while 'make checksum' does not
# try the next mirror on checksum failure.  It currently retries the same
# failed mirror and then fails rather then trying another.  It *does*
# try the next if the size is mismatched though.
#MASTER_SITE_FREEBSD=yes
# Build ALLOW_MAKE_JOBS_PACKAGES with 2 jobs
MAKE_JOBS_NUMBER=2
#### /usr/ports/Mk/Scripts/ports_env.sh ####
_CCVERSION_921dbbb2=cc (GCC) 4.2.1 20070831 patched [FreeBSD] Copyright (C) 2007 Free Software Foundation, Inc. This is free software; see the source for copying conditions. There is NO warranty; not even for MERCHANTABILITY or FITNESS FOR A PARTICULAR PURPOSE.
_ALTCCVERSION_921dbbb2=none
_CXXINTERNAL_acaad9ca=Using built-in specs. Target: powerpc64-undermydesk-freebsd Configured with: FreeBSD/powerpc64 system compiler Thread model: posix gcc version 4.2.1 20070831 patched [FreeBSD] "/usr/bin/ld" "--eh-frame-hdr" "-Qy" "-melf64ppc_fbsd" "--enable-new-dtags" "-dynamic-linker" "/libexec/ld-elf.so.1" "/usr/lib/crt1.o" "/usr/lib/crti.o" "/usr/lib/crtbegin.o" "-L/usr/lib" "-L/usr/lib" "/dev/null" "-lstdc++" "-lm" "-lgcc_s" "-lgcc" "-lc" "-lgcc_s" "-lgcc" "/usr/lib/crtsavres.o" "/usr/lib/crtend.o" "/usr/lib/crtn.o"
CC_OUTPUT_921dbbb2_58173849=yes
CC_OUTPUT_921dbbb2_9bdba57c=yes
CC_OUTPUT_921dbbb2_6a4fe7f5=cc1: error: unrecognized command line option "-std=c11"
CC_OUTPUT_921dbbb2_6bcac02b=yes
CC_OUTPUT_921dbbb2_67d20829=yes
CC_OUTPUT_921dbbb2_bfa62e83=cc1: error: unrecognized command line option "-std=gnu11"
CC_OUTPUT_921dbbb2_f0b4d593=yes
CC_OUTPUT_921dbbb2_308abb44=cc1plus: error: unrecognized command line option "-std=c++0x"
CC_OUTPUT_921dbbb2_f00456e5=cc1plus: error: unrecognized command line option "-std=c++11"
CC_OUTPUT_921dbbb2_65ad290d=cc1plus: error: unrecognized command line option "-std=c++14"
CC_OUTPUT_921dbbb2_f2776b26=cc1plus: error: unrecognized command line option "-std=c++17"
CC_OUTPUT_921dbbb2_b2657cc3=yes
CC_OUTPUT_921dbbb2_380987f7=cc1plus: error: unrecognized command line option "-std=gnu++11"
CC_OUTPUT_921dbbb2_160933ec=cc1plus: error: unrecognized command line option "-std=gnu++14"
CC_OUTPUT_921dbbb2_fb62803b=cc1plus: error: unrecognized command line option "-std=gnu++17"
_OBJC_CCVERSION_921dbbb2=cc (GCC) 4.2.1 20070831 patched [FreeBSD] Copyright (C) 2007 Free Software Foundation, Inc. This is free software; see the source for copying conditions. There is NO warranty; not even for MERCHANTABILITY or FITNESS FOR A PARTICULAR PURPOSE.
_OBJC_ALTCCVERSION_921dbbb2=none
ARCH=powerpc64
PPC_ABI=ELFv1
OPSYS=FreeBSD
_OSRELEASE=12.2-RELEASE
OSREL=12.2
OSVERSION=1202000
PYTHONBASE=/usr/local
CONFIGURE_MAX_CMD_LEN=524288
HAVE_PORTS_ENV=1
#### Misc Poudriere ####
GID=0
UID=0
---End make.conf---
--Resource limits--
cpu time               (seconds, -t)  unlimited
file size           (512-blocks, -f)  unlimited
data seg size           (kbytes, -d)  33554432
stack size              (kbytes, -s)  524288
core file size      (512-blocks, -c)  unlimited
max memory size         (kbytes, -m)  unlimited
locked memory           (kbytes, -l)  unlimited
max user processes              (-u)  89999
open files                      (-n)  1024
virtual mem size        (kbytes, -v)  unlimited
swap limit              (kbytes, -w)  unlimited
socket buffer size       (bytes, -b)  unlimited
pseudo-terminals                (-p)  unlimited
kqueues                         (-k)  unlimited
umtx shared locks               (-o)  unlimited
--End resource limits--
=======================<phase: check-sanity   >============================
===========================================================================
=======================<phase: pkg-depends    >============================
===>   libzrtpcpp-2.3.4_8 depends on file: /usr/local/sbin/pkg - not found
===>   Installing existing package /packages/All/pkg-1.16.3.txz
[122powerpc64-quarterly-job-06] Installing pkg-1.16.3...
[122powerpc64-quarterly-job-06] Extracting pkg-1.16.3: .......... done
===>   libzrtpcpp-2.3.4_8 depends on file: /usr/local/sbin/pkg - found
===>   Returning to build of libzrtpcpp-2.3.4_8
===========================================================================
=======================<phase: fetch-depends  >============================
===========================================================================
=======================<phase: fetch          >============================
===> Fetching all distfiles required by libzrtpcpp-2.3.4_8 for building
===========================================================================
=======================<phase: checksum       >============================
===> Fetching all distfiles required by libzrtpcpp-2.3.4_8 for building
=> SHA256 Checksum OK for libzrtpcpp-2.3.4.tar.gz.
===========================================================================
=======================<phase: extract-depends>============================
===========================================================================
=======================<phase: extract        >============================
===> Fetching all distfiles required by libzrtpcpp-2.3.4_8 for building
===>  Extracting for libzrtpcpp-2.3.4_8
=> SHA256 Checksum OK for libzrtpcpp-2.3.4.tar.gz.
===========================================================================
=======================<phase: patch-depends  >============================
===========================================================================
=======================<phase: patch          >============================
===>  Patching for libzrtpcpp-2.3.4_8
===>  Applying FreeBSD patches for libzrtpcpp-2.3.4_8 from /usr/ports/devel/libzrtpcpp/files
===========================================================================
=======================<phase: build-depends  >============================
===>   libzrtpcpp-2.3.4_8 depends on file: /usr/local/bin/cmake - not found
===>   Installing existing package /packages/All/cmake-3.19.6.txz
[122powerpc64-quarterly-job-06] Installing cmake-3.19.6...
[122powerpc64-quarterly-job-06] `-- Installing curl-7.76.0...
[122powerpc64-quarterly-job-06] |   `-- Installing ca_root_nss-3.63...
[122powerpc64-quarterly-job-06] |   `-- Extracting ca_root_nss-3.63: ........ done
[122powerpc64-quarterly-job-06] |   `-- Installing libnghttp2-1.43.0...
[122powerpc64-quarterly-job-06] |   | `-- Installing gcc10-10.2.0_1...
[122powerpc64-quarterly-job-06] |   |   `-- Installing binutils-2.33.1_4,1...
[122powerpc64-quarterly-job-06] |   |   | `-- Installing gettext-runtime-0.21...
[122powerpc64-quarterly-job-06] |   |   |   `-- Installing indexinfo-0.3.1...
[122powerpc64-quarterly-job-06] |   |   |   `-- Extracting indexinfo-0.3.1: .... done
[122powerpc64-quarterly-job-06] |   |   | `-- Extracting gettext-runtime-0.21: .......... done
[122powerpc64-quarterly-job-06] |   |   `-- Extracting binutils-2.33.1_4,1: .......... done
[122powerpc64-quarterly-job-06] |   |   `-- Installing gcc9-9.3.0_3...
[122powerpc64-quarterly-job-06] |   |   | `-- Installing gmp-6.2.1...
[122powerpc64-quarterly-job-06] |   |   | `-- Extracting gmp-6.2.1: .......... done
[122powerpc64-quarterly-job-06] |   |   | `-- Installing mpc-1.2.0...
[122powerpc64-quarterly-job-06] |   |   |   `-- Installing mpfr-4.1.0...
[122powerpc64-quarterly-job-06] |   |   |   `-- Extracting mpfr-4.1.0: .......... done
[122powerpc64-quarterly-job-06] |   |   | `-- Extracting mpc-1.2.0: ......... done
[122powerpc64-quarterly-job-06] |   |   `-- Extracting gcc9-9.3.0_3: .......... done
[122powerpc64-quarterly-job-06] |   | `-- Extracting gcc10-10.2.0_1: .......... done
[122powerpc64-quarterly-job-06] |   `-- Extracting libnghttp2-1.43.0: .......... done
<snip>
For ports leveraging USE_GCC, USES=compiler, or USES=fortran this happens
transparently.
===>   libzrtpcpp-2.3.4_8 depends on file: /usr/local/bin/cmake - found
===>   Returning to build of libzrtpcpp-2.3.4_8
===>   libzrtpcpp-2.3.4_8 depends on package: pkgconf>=1.3.0_1 - not found
===>   Installing existing package /packages/All/pkgconf-1.7.4,1.txz
[122powerpc64-quarterly-job-06] Installing pkgconf-1.7.4,1...
[122powerpc64-quarterly-job-06] Extracting pkgconf-1.7.4,1: .......... done
===>   libzrtpcpp-2.3.4_8 depends on package: pkgconf>=1.3.0_1 - found
===>   Returning to build of libzrtpcpp-2.3.4_8
===========================================================================
=======================<phase: lib-depends    >============================
===>   libzrtpcpp-2.3.4_8 depends on shared library: libccrtp.so - not found
===>   Installing existing package /packages/All/ccrtp-2.1.2.txz
[122powerpc64-quarterly-job-06] Installing ccrtp-2.1.2...
[122powerpc64-quarterly-job-06] `-- Installing libgcrypt-1.9.3...
[122powerpc64-quarterly-job-06] |   `-- Installing libgpg-error-1.42...
[122powerpc64-quarterly-job-06] |   `-- Extracting libgpg-error-1.42: .......... done
[122powerpc64-quarterly-job-06] `-- Extracting libgcrypt-1.9.3: .......... done
[122powerpc64-quarterly-job-06] `-- Installing ucommon-7.0.0_5...
[122powerpc64-quarterly-job-06] `-- Extracting ucommon-7.0.0_5: .......... done
[122powerpc64-quarterly-job-06] Extracting ccrtp-2.1.2: .......... done
=====
Message from ucommon-7.0.0_5:

--
===>   NOTICE:

The ucommon port currently does not have a maintainer. As a result, it is
more likely to have unresolved issues, not be up-to-date, or even be removed in
the future. To volunteer to maintain this port, please create an issue at:

https://bugs.freebsd.org/bugzilla

More information about port maintainership is available at:

https://www.freebsd.org/doc/en/articles/contributing/ports-contributing.html#maintain-port
===>   libzrtpcpp-2.3.4_8 depends on shared library: libccrtp.so - found (/usr/local/lib/libccrtp.so)
===>   Returning to build of libzrtpcpp-2.3.4_8
===>   libzrtpcpp-2.3.4_8 depends on shared library: libgcrypt.so - found (/usr/local/lib/libgcrypt.so)
===========================================================================
=======================<phase: configure      >============================
===>  Configuring for libzrtpcpp-2.3.4_8
===>  Performing out-of-source build
/bin/mkdir -p /wrkdirs/usr/ports/devel/libzrtpcpp/work/.build
CMake Deprecation Warning at CMakeLists.txt:11 (cmake_minimum_required):
  Compatibility with CMake < 2.8.12 will be removed from a future version of
  CMake.

  Update the VERSION argument <min> value or use a ...<max> suffix to tell
  CMake that the project does not need compatibility with older versions.


-- The C compiler identification is GNU 4.2.1
-- The CXX compiler identification is GNU 4.2.1
-- Detecting C compiler ABI info
-- Detecting C compiler ABI info - done
-- Check for working C compiler: /usr/bin/cc - skipped
-- Detecting C compile features
-- Detecting C compile features - done
-- Detecting CXX compiler ABI info
-- Detecting CXX compiler ABI info - done
-- Check for working CXX compiler: /usr/bin/c++ - skipped
-- Detecting CXX compile features
-- Detecting CXX compile features - done
-- Configuring GNU libzrtpcpp 2.3.4...
-- Found PkgConfig: pkgconf (found version "1.7.4") 
-- Looking for pthread.h
-- Looking for pthread.h - found
-- Found Threads: TRUE  
-- Checking for module 'libccrtp>=2.0.0'
--   Found libccrtp, version 2.1.2
-- Looking for include file openssl/bn.h
-- Looking for include file openssl/bn.h - found
-- Looking for include file openssl/aes.h
-- Looking for include file openssl/aes.h - found
-- Looking for include file openssl/sha.h
-- Looking for include file openssl/sha.h - found
-- Looking for include file openssl/ec.h
-- Looking for include file openssl/ec.h - found
-- Looking for EVP_CipherInit_ex in crypto
-- Looking for EVP_CipherInit_ex in crypto - found
-- Looking for include file stdlib.h
-- Looking for include file stdlib.h - found
-- Looking for include file string.h
-- Looking for include file string.h - found
CMake Deprecation Warning at src/CMakeLists.txt:1 (cmake_minimum_required):
  Compatibility with CMake < 2.8.12 will be removed from a future version of
  CMake.

  Update the VERSION argument <min> value or use a ...<max> suffix to tell
  CMake that the project does not need compatibility with older versions.


-- package dir not found
-- Configuring done
CMake Warning (dev) at src/CMakeLists.txt:81 (add_dependencies):
  Policy CMP0046 is not set: Error on non-existent dependency in
  add_dependencies.  Run "cmake --help-policy CMP0046" for policy details.
  Use the cmake_policy command to set the policy and suppress this warning.

  The dependency target "ccrtp" of target "zrtpcpp" does not exist.
This warning is for project developers.  Use -Wno-dev to suppress it.

-- Generating done
CMake Warning:
  Manually-specified variables were not used by the project:

    CMAKE_CXX_FLAGS_DEBUG
    CMAKE_C_FLAGS_DEBUG
    CMAKE_EXE_LINKER_FLAGS
    CMAKE_MODULE_LINKER_FLAGS


-- Build files have been written to: /wrkdirs/usr/ports/devel/libzrtpcpp/work/.build
===========================================================================
=======================<phase: build          >============================
===>  Building for libzrtpcpp-2.3.4_8
Scanning dependencies of target zrtpcpp
[  5%] Building CXX object src/CMakeFiles/zrtpcpp.dir/ZrtpCallbackWrapper.cpp.o
[  5%] Building CXX object src/CMakeFiles/zrtpcpp.dir/ZIDFile.cpp.o
[  8%] Building CXX object src/CMakeFiles/zrtpcpp.dir/ZIDRecord.cpp.o
[ 11%] Building CXX object src/CMakeFiles/zrtpcpp.dir/Zrtp.cpp.o
[ 13%] Building CXX object src/CMakeFiles/zrtpcpp.dir/ZrtpCrc32.cpp.o
[ 16%] Building CXX object src/CMakeFiles/zrtpcpp.dir/ZrtpPacketCommit.cpp.o
[ 19%] Building CXX object src/CMakeFiles/zrtpcpp.dir/ZrtpPacketConf2Ack.cpp.o
[ 22%] Building CXX object src/CMakeFiles/zrtpcpp.dir/ZrtpPacketConfirm.cpp.o
[ 25%] Building CXX object src/CMakeFiles/zrtpcpp.dir/ZrtpPacketDHPart.cpp.o
[ 27%] Building CXX object src/CMakeFiles/zrtpcpp.dir/ZrtpPacketGoClear.cpp.o
[ 30%] Building CXX object src/CMakeFiles/zrtpcpp.dir/ZrtpPacketClearAck.cpp.o
[ 33%] Building CXX object src/CMakeFiles/zrtpcpp.dir/ZrtpPacketHelloAck.cpp.o
[ 36%] Building CXX object src/CMakeFiles/zrtpcpp.dir/ZrtpPacketHello.cpp.o
[ 38%] Building CXX object src/CMakeFiles/zrtpcpp.dir/ZrtpPacketError.cpp.o
[ 41%] Building CXX object src/CMakeFiles/zrtpcpp.dir/ZrtpPacketErrorAck.cpp.o
[ 44%] Building CXX object src/CMakeFiles/zrtpcpp.dir/ZrtpPacketPingAck.cpp.o
[ 47%] Building CXX object src/CMakeFiles/zrtpcpp.dir/ZrtpPacketSASrelay.cpp.o
[ 50%] Building CXX object src/CMakeFiles/zrtpcpp.dir/ZrtpPacketPing.cpp.o
[ 52%] Building CXX object src/CMakeFiles/zrtpcpp.dir/ZrtpPacketRelayAck.cpp.o
[ 55%] Building CXX object src/CMakeFiles/zrtpcpp.dir/ZrtpStateClass.cpp.o
[ 58%] Building CXX object src/CMakeFiles/zrtpcpp.dir/ZrtpTextData.cpp.o
[ 61%] Building CXX object src/CMakeFiles/zrtpcpp.dir/ZrtpConfigure.cpp.o
[ 63%] Building CXX object src/CMakeFiles/zrtpcpp.dir/ZrtpCWrapper.cpp.o
[ 66%] Building CXX object src/CMakeFiles/zrtpcpp.dir/Base32.cpp.o
[ 69%] Building CXX object src/CMakeFiles/zrtpcpp.dir/ZrtpQueue.cpp.o
[ 72%] Building CXX object src/CMakeFiles/zrtpcpp.dir/libzrtpcpp/crypto/openssl/ZrtpDH.cpp.o
/wrkdirs/usr/ports/devel/libzrtpcpp/work/libzrtpcpp-2.3.4/src/libzrtpcpp/crypto/openssl/ZrtpDH.cpp: In constructor 'ZrtpDH::ZrtpDH(const char*)':
/wrkdirs/usr/ports/devel/libzrtpcpp/work/libzrtpcpp-2.3.4/src/libzrtpcpp/crypto/openssl/ZrtpDH.cpp:226: error: invalid use of incomplete type 'struct dh_st'
/usr/include/openssl/ossl_typ.h:104: error: forward declaration of 'struct dh_st'
/wrkdirs/usr/ports/devel/libzrtpcpp/work/libzrtpcpp-2.3.4/src/libzrtpcpp/crypto/openssl/ZrtpDH.cpp:227: error: invalid use of incomplete type 'struct dh_st'
/usr/include/openssl/ossl_typ.h:104: error: forward declaration of 'struct dh_st'
/wrkdirs/usr/ports/devel/libzrtpcpp/work/libzrtpcpp-2.3.4/src/libzrtpcpp/crypto/openssl/ZrtpDH.cpp:230: error: invalid use of incomplete type 'struct dh_st'
/usr/include/openssl/ossl_typ.h:104: error: forward declaration of 'struct dh_st'
/wrkdirs/usr/ports/devel/libzrtpcpp/work/libzrtpcpp-2.3.4/src/libzrtpcpp/crypto/openssl/ZrtpDH.cpp:232: error: invalid use of incomplete type 'struct dh_st'
/usr/include/openssl/ossl_typ.h:104: error: forward declaration of 'struct dh_st'
/wrkdirs/usr/ports/devel/libzrtpcpp/work/libzrtpcpp-2.3.4/src/libzrtpcpp/crypto/openssl/ZrtpDH.cpp:235: error: invalid use of incomplete type 'struct dh_st'
/usr/include/openssl/ossl_typ.h:104: error: forward declaration of 'struct dh_st'
/wrkdirs/usr/ports/devel/libzrtpcpp/work/libzrtpcpp-2.3.4/src/libzrtpcpp/crypto/openssl/ZrtpDH.cpp:237: error: invalid use of incomplete type 'struct dh_st'
/usr/include/openssl/ossl_typ.h:104: error: forward declaration of 'struct dh_st'
/wrkdirs/usr/ports/devel/libzrtpcpp/work/libzrtpcpp-2.3.4/src/libzrtpcpp/crypto/openssl/ZrtpDH.cpp: In member function 'int32_t ZrtpDH::computeSecretKey(uint8_t*, uint8_t*)':
/wrkdirs/usr/ports/devel/libzrtpcpp/work/libzrtpcpp-2.3.4/src/libzrtpcpp/crypto/openssl/ZrtpDH.cpp:272: error: invalid use of incomplete type 'struct dh_st'
/usr/include/openssl/ossl_typ.h:104: error: forward declaration of 'struct dh_st'
/wrkdirs/usr/ports/devel/libzrtpcpp/work/libzrtpcpp-2.3.4/src/libzrtpcpp/crypto/openssl/ZrtpDH.cpp:273: error: invalid use of incomplete type 'struct dh_st'
/usr/include/openssl/ossl_typ.h:104: error: forward declaration of 'struct dh_st'
/wrkdirs/usr/ports/devel/libzrtpcpp/work/libzrtpcpp-2.3.4/src/libzrtpcpp/crypto/openssl/ZrtpDH.cpp:275: error: invalid use of incomplete type 'struct dh_st'
/usr/include/openssl/ossl_typ.h:104: error: forward declaration of 'struct dh_st'
/wrkdirs/usr/ports/devel/libzrtpcpp/work/libzrtpcpp-2.3.4/src/libzrtpcpp/crypto/openssl/ZrtpDH.cpp:276: error: invalid use of incomplete type 'struct dh_st'
/usr/include/openssl/ossl_typ.h:104: error: forward declaration of 'struct dh_st'
/wrkdirs/usr/ports/devel/libzrtpcpp/work/libzrtpcpp-2.3.4/src/libzrtpcpp/crypto/openssl/ZrtpDH.cpp: In member function 'int32_t ZrtpDH::getPubKeySize() const':
/wrkdirs/usr/ports/devel/libzrtpcpp/work/libzrtpcpp-2.3.4/src/libzrtpcpp/crypto/openssl/ZrtpDH.cpp:322: error: invalid use of incomplete type 'struct dh_st'
/usr/include/openssl/ossl_typ.h:104: error: forward declaration of 'struct dh_st'
/wrkdirs/usr/ports/devel/libzrtpcpp/work/libzrtpcpp-2.3.4/src/libzrtpcpp/crypto/openssl/ZrtpDH.cpp: In member function 'int32_t ZrtpDH::getPubKeyBytes(uint8_t*) const':
/wrkdirs/usr/ports/devel/libzrtpcpp/work/libzrtpcpp-2.3.4/src/libzrtpcpp/crypto/openssl/ZrtpDH.cpp:341: error: invalid use of incomplete type 'struct dh_st'
/usr/include/openssl/ossl_typ.h:104: error: forward declaration of 'struct dh_st'
--- src/CMakeFiles/zrtpcpp.dir/libzrtpcpp/crypto/openssl/ZrtpDH.cpp.o ---
*** [src/CMakeFiles/zrtpcpp.dir/libzrtpcpp/crypto/openssl/ZrtpDH.cpp.o] Error code 1

make[3]: stopped in /wrkdirs/usr/ports/devel/libzrtpcpp/work/.build
1 error

make[3]: stopped in /wrkdirs/usr/ports/devel/libzrtpcpp/work/.build
--- src/CMakeFiles/zrtpcpp.dir/all ---
*** [src/CMakeFiles/zrtpcpp.dir/all] Error code 2

make[2]: stopped in /wrkdirs/usr/ports/devel/libzrtpcpp/work/.build
1 error

make[2]: stopped in /wrkdirs/usr/ports/devel/libzrtpcpp/work/.build
*** [all] Error code 2

make[1]: stopped in /wrkdirs/usr/ports/devel/libzrtpcpp/work/.build
1 error

make[1]: stopped in /wrkdirs/usr/ports/devel/libzrtpcpp/work/.build
===> Compilation failed unexpectedly.
Try to set MAKE_JOBS_UNSAFE=yes and rebuild before reporting the failure to
the maintainer.
*** Error code 1

Stop.
make: stopped in /usr/ports/devel/libzrtpcpp
Received on Sun Jun 27 2021 - 03:41:53 UTC

Original text of this message