[package - 122arm64-quarterly][games/openclonk] Failed for openclonk-8.1_2 in build

From: <pkg-fallout_at_FreeBSD.org>
Date: Sat, 26 Jun 2021 01:46:25 GMT
You are receiving this mail as a port that you maintain
is failing to build on the FreeBSD package build server.
Please investigate the failure and submit a PR to fix
build.

Maintainer:     kevinz5000_at_gmail.com
Log URL:        http://ampere1.nyi.freebsd.org/data/122arm64-quarterly/67383f941ca2/logs/openclonk-8.1_2.log
Build URL:      http://ampere1.nyi.freebsd.org/build.html?mastername=122arm64-quarterly&build=67383f941ca2
Log:

=>> Building games/openclonk
build started at Sat Jun 26 01:45:25 UTC 2021
port directory: /usr/ports/games/openclonk
package name: openclonk-8.1_2
building for: FreeBSD 122arm64-quarterly-job-14 12.2-RELEASE FreeBSD 12.2-RELEASE arm64
maintained by: kevinz5000_at_gmail.com
Makefile ident: 
Poudriere version: 3.2.8-8-gaf08dbda
Host OSVERSION: 1400008
Jail OSVERSION: 1202000
Job Id: 14

---Begin Environment---
SHELL=/bin/csh
OSVERSION=1202000
UNAME_v=FreeBSD 12.2-RELEASE
UNAME_r=12.2-RELEASE
BLOCKSIZE=K
MAIL=/var/mail/root
STATUS=1
HOME=/root
PATH=/sbin:/bin:/usr/sbin:/usr/bin:/usr/local/sbin:/usr/local/bin:/root/bin
LOCALBASE=/usr/local
USER=root
LIBEXECPREFIX=/usr/local/libexec/poudriere
POUDRIERE_VERSION=3.2.8-8-gaf08dbda
MASTERMNT=/usr/local/poudriere/data/.m/122arm64-quarterly/ref
POUDRIERE_BUILD_TYPE=bulk
PACKAGE_BUILDING=yes
SAVED_TERM=
PWD=/usr/local/poudriere/data/.m/122arm64-quarterly/ref/.p/pool
P_PORTS_FEATURES=FLAVORS SELECTED_OPTIONS
MASTERNAME=122arm64-quarterly
SCRIPTPREFIX=/usr/local/share/poudriere
OLDPWD=/usr/local/poudriere/data/.m/122arm64-quarterly/ref/.p
SCRIPTPATH=/usr/local/share/poudriere/bulk.sh
POUDRIEREPATH=/usr/local/bin/poudriere
---End Environment---

---Begin Poudriere Port Flags/Env---
PORT_FLAGS=
PKGENV=
FLAVOR=
DEPENDS_ARGS=
MAKE_ARGS=
---End Poudriere Port Flags/Env---

---Begin OPTIONS List---
---End OPTIONS List---

--MAINTAINER--
kevinz5000_at_gmail.com
--End MAINTAINER--

--CONFIGURE_ARGS--

--End CONFIGURE_ARGS--

--CONFIGURE_ENV--
PKG_CONFIG=pkgconf SDL2_CONFIG=/usr/local/bin/sdl2-config XDG_DATA_HOME=/wrkdirs/usr/ports/games/openclonk/work  XDG_CONFIG_HOME=/wrkdirs/usr/ports/games/openclonk/work  HOME=/wrkdirs/usr/ports/games/openclonk/work TMPDIR="/tmp" PATH=/wrkdirs/usr/ports/games/openclonk/work/.bin:/sbin:/bin:/usr/sbin:/usr/bin:/usr/local/sbin:/usr/local/bin:/root/bin SHELL=/bin/sh CONFIG_SHELL=/bin/sh LANG=en_US.UTF-8 LC_ALL=en_US.UTF-8
--End CONFIGURE_ENV--

--MAKE_ENV--
SDL2_CONFIG=/usr/local/bin/sdl2-config XDG_DATA_HOME=/wrkdirs/usr/ports/games/openclonk/work  XDG_CONFIG_HOME=/wrkdirs/usr/ports/games/openclonk/work  HOME=/wrkdirs/usr/ports/games/openclonk/work TMPDIR="/tmp" PATH=/wrkdirs/usr/ports/games/openclonk/work/.bin:/sbin:/bin:/usr/sbin:/usr/bin:/usr/local/sbin:/usr/local/bin:/root/bin NO_PIE=yes MK_DEBUG_FILES=no MK_KERNEL_SYMBOLS=no SHELL=/bin/sh NO_LINT=YES LANG=en_US.UTF-8 LC_ALL=en_US.UTF-8 PREFIX=/usr/local  LOCALBASE=/usr/local  CC="cc" CFLAGS="-O2 -pipe  -fstack-protector-strong -fno-strict-aliasing "  CPP="cpp" CPPFLAGS=""  LDFLAGS=" -fstack-protector-strong " LIBS=""  CXX="c++" CXXFLAGS="-O2 -pipe -fstack-protector-strong -fno-strict-aliasing  "  MANPREFIX="/usr/local" BSD_INSTALL_PROGRAM="install  -s -m 555"  BSD_INSTALL_LIB="install  -s -m 0644"  BSD_INSTALL_SCRIPT="install  -m 555"  BSD_INSTALL_DATA="install  -m 0644"  BSD_INSTALL_MAN="install  -m 444"
--End MAKE_ENV--

--PLIST_SUB--
CMAKE_BUILD_TYPE="release" GTK2_VERSION="2.10.0"  GTK3_VERSION="3.0.0" OSREL=12.2 PREFIX=%D LOCALBASE=/usr/local  RESETPREFIX=/usr/local LIB32DIR=lib DOCSDIR="share/doc/openclonk"  EXAMPLESDIR="share/examples/openclonk"  DATADIR="share/openclonk"  WWWDIR="www/openclonk"  ETCDIR="etc/openclonk"
--End PLIST_SUB--

--SUB_LIST--
PREFIX=/usr/local LOCALBASE=/usr/local  DATADIR=/usr/local/share/openclonk DOCSDIR=/usr/local/share/doc/openclonk EXAMPLESDIR=/usr/local/share/examples/openclonk  WWWDIR=/usr/local/www/openclonk ETCDIR=/usr/local/etc/openclonk
--End SUB_LIST--

---Begin make.conf---
USE_PACKAGE_DEPENDS=yes
BATCH=yes
WRKDIRPREFIX=/wrkdirs
PORTSDIR=/usr/ports
PACKAGES=/packages
DISTDIR=/distfiles
PACKAGE_BUILDING=yes
PACKAGE_BUILDING_FLAVORS=yes
#### /usr/local/etc/poudriere.d/make.conf ####
# XXX: We really need this but cannot use it while 'make checksum' does not
# try the next mirror on checksum failure.  It currently retries the same
# failed mirror and then fails rather then trying another.  It *does*
# try the next if the size is mismatched though.
#MASTER_SITE_FREEBSD=yes
# Build ALLOW_MAKE_JOBS_PACKAGES with 2 jobs
MAKE_JOBS_NUMBER=2
#### /usr/ports/Mk/Scripts/ports_env.sh ####
_CCVERSION_921dbbb2=FreeBSD clang version 10.0.1 (git_at_github.com:llvm/llvm-project.git llvmorg-10.0.1-0-gef32c611aa2) Target: aarch64-unknown-freebsd12.2 Thread model: posix InstalledDir: /usr/bin
_ALTCCVERSION_921dbbb2=none
_CXXINTERNAL_acaad9ca=FreeBSD clang version 10.0.1 (git_at_github.com:llvm/llvm-project.git llvmorg-10.0.1-0-gef32c611aa2) Target: aarch64-unknown-freebsd12.2 Thread model: posix InstalledDir: /usr/bin "/usr/bin/ld" "--eh-frame-hdr" "-dynamic-linker" "/libexec/ld-elf.so.1" "--enable-new-dtags" "-o" "a.out" "/usr/lib/crt1.o" "/usr/lib/crti.o" "/usr/lib/crtbegin.o" "-L/usr/lib" "/dev/null" "-lc++" "-lm" "-lgcc" "--as-needed" "-lgcc_s" "--no-as-needed" "-lc" "-lgcc" "--as-needed" "-lgcc_s" "--no-as-needed" "/usr/lib/crtend.o" "/usr/lib/crtn.o"
CC_OUTPUT_921dbbb2_58173849=yes
CC_OUTPUT_921dbbb2_9bdba57c=yes
CC_OUTPUT_921dbbb2_6a4fe7f5=yes
CC_OUTPUT_921dbbb2_6bcac02b=yes
CC_OUTPUT_921dbbb2_67d20829=yes
CC_OUTPUT_921dbbb2_bfa62e83=yes
CC_OUTPUT_921dbbb2_f0b4d593=yes
CC_OUTPUT_921dbbb2_308abb44=yes
CC_OUTPUT_921dbbb2_f00456e5=yes
CC_OUTPUT_921dbbb2_65ad290d=yes
CC_OUTPUT_921dbbb2_f2776b26=yes
CC_OUTPUT_921dbbb2_b2657cc3=yes
CC_OUTPUT_921dbbb2_380987f7=yes
CC_OUTPUT_921dbbb2_160933ec=yes
CC_OUTPUT_921dbbb2_fb62803b=yes
_OBJC_CCVERSION_921dbbb2=FreeBSD clang version 10.0.1 (git_at_github.com:llvm/llvm-project.git llvmorg-10.0.1-0-gef32c611aa2) Target: aarch64-unknown-freebsd12.2 Thread model: posix InstalledDir: /usr/bin
_OBJC_ALTCCVERSION_921dbbb2=none
ARCH=aarch64
OPSYS=FreeBSD
_OSRELEASE=12.2-RELEASE
OSREL=12.2
OSVERSION=1202000
PYTHONBASE=/usr/local
CONFIGURE_MAX_CMD_LEN=524288
HAVE_PORTS_ENV=1
#### Misc Poudriere ####
GID=0
UID=0
---End make.conf---
--Resource limits--
cpu time               (seconds, -t)  unlimited
file size           (512-blocks, -f)  unlimited
data seg size           (kbytes, -d)  1048576
stack size              (kbytes, -s)  1048576
core file size      (512-blocks, -c)  unlimited
max memory size         (kbytes, -m)  unlimited
locked memory           (kbytes, -l)  unlimited
max user processes              (-u)  89999
open files                      (-n)  1024
virtual mem size        (kbytes, -v)  unlimited
swap limit              (kbytes, -w)  unlimited
socket buffer size       (bytes, -b)  unlimited
pseudo-terminals                (-p)  unlimited
kqueues                         (-k)  unlimited
umtx shared locks               (-o)  unlimited
--End resource limits--
=======================<phase: check-sanity   >============================
===>  License ISCL CC0-1.0 accepted by the user
===========================================================================
=======================<phase: pkg-depends    >============================
===>   openclonk-8.1_2 depends on file: /usr/local/sbin/pkg - not found
===>   Installing existing package /packages/All/pkg-1.16.3.txz
[122arm64-quarterly-job-14] Installing pkg-1.16.3...
[122arm64-quarterly-job-14] Extracting pkg-1.16.3: .......... done
===>   openclonk-8.1_2 depends on file: /usr/local/sbin/pkg - found
===>   Returning to build of openclonk-8.1_2
===========================================================================
=======================<phase: fetch-depends  >============================
===========================================================================
=======================<phase: fetch          >============================
===>  License ISCL CC0-1.0 accepted by the user
===> Fetching all distfiles required by openclonk-8.1_2 for building
===========================================================================
=======================<phase: checksum       >============================
===>  License ISCL CC0-1.0 accepted by the user
===> Fetching all distfiles required by openclonk-8.1_2 for building
=> SHA256 Checksum OK for openclonk-8.1-src.tar.bz2.
===========================================================================
=======================<phase: extract-depends>============================
===========================================================================
=======================<phase: extract        >============================
===>  License ISCL CC0-1.0 accepted by the user
===> Fetching all distfiles required by openclonk-8.1_2 for building
===>  Extracting for openclonk-8.1_2
=> SHA256 Checksum OK for openclonk-8.1-src.tar.bz2.
===========================================================================
=======================<phase: patch-depends  >============================
===========================================================================
=======================<phase: patch          >============================
===>  Patching for openclonk-8.1_2
===>  Applying FreeBSD patches for openclonk-8.1_2 from /usr/ports/games/openclonk/files
===========================================================================
=======================<phase: build-depends  >============================
===>   openclonk-8.1_2 depends on file: /usr/local/bin/cmake - not found
===>   Installing existing package /packages/All/cmake-3.19.6.txz
[122arm64-quarterly-job-14] Installing cmake-3.19.6...
[122arm64-quarterly-job-14] `-- Installing curl-7.76.0...
[122arm64-quarterly-job-14] |   `-- Installing ca_root_nss-3.63...
[122arm64-quarterly-job-14] |   `-- Extracting ca_root_nss-3.63: ........ done
[122arm64-quarterly-job-14] |   `-- Installing libnghttp2-1.43.0...
[122arm64-quarterly-job-14] |   `-- Extracting libnghttp2-1.43.0: .......... done
[122arm64-quarterly-job-14] `-- Extracting curl-7.76.0: .......... done
[122arm64-quarterly-job-14] `-- Installing expat-2.4.1...
[122arm64-quarterly-job-14] `-- Extracting expat-2.4.1: .......... done
[122arm64-quarterly-job-14] `-- Installing jsoncpp-1.9.4...
[122arm64-quarterly-job-14] `-- Extracting jsoncpp-1.9.4: .......... done
[122arm64-quarterly-job-14] `-- Installing libarchive-3.5.1,1...
[122arm64-quarterly-job-14] |   `-- Installing liblz4-1.9.3,1...
[122arm64-quarterly-job-14] |   `-- Extracting liblz4-1.9.3,1: .......... done
[122arm64-quarterly-job-14] `-- Extracting libarchive-3.5.1,1: .......... done
[122arm64-quarterly-job-14] `-- Installing libuv-1.41.0...
[122arm64-quarterly-job-14] `-- Extracting libuv-1.41.0: .......... done
[122arm64-quarterly-job-14] `-- Installing rhash-1.4.1...
[122arm64-quarterly-job-14] |   `-- Installing gettext-runtime-0.21...
<snip>
-- Found GLEW: /usr/local/lib/libGLEW.so (found version "2.2.0") 
-- Performing Test GLDEBUGPROCARB_USERPARAM_IS_CONST
-- Performing Test GLDEBUGPROCARB_USERPARAM_IS_CONST - Success
CMake Warning (dev) at /usr/local/share/cmake/Modules/FindPackageHandleStandardArgs.cmake:426 (message):
  The package name passed to `find_package_handle_standard_args` (libdw) does
  not match the name of the calling package (Backward).  This can lead to
  problems in calling code that expects `find_package` result variables
  (e.g., `_FOUND`) to follow a certain pattern.
Call Stack (most recent call first):
  thirdparty/backward-cpp/BackwardConfig.cmake:55 (find_package_handle_standard_args)
  CMakeLists.txt:303 (find_package)
This warning is for project developers.  Use -Wno-dev to suppress it.

-- Could NOT find libdw (missing: LIBDW_LIBRARY LIBDW_INCLUDE_DIR) 
CMake Warning (dev) at /usr/local/share/cmake/Modules/FindPackageHandleStandardArgs.cmake:426 (message):
  The package name passed to `find_package_handle_standard_args` (libbfd)
  does not match the name of the calling package (Backward).  This can lead
  to problems in calling code that expects `find_package` result variables
  (e.g., `_FOUND`) to follow a certain pattern.
Call Stack (most recent call first):
  thirdparty/backward-cpp/BackwardConfig.cmake:66 (find_package_handle_standard_args)
  CMakeLists.txt:303 (find_package)
This warning is for project developers.  Use -Wno-dev to suppress it.

-- Could NOT find libbfd (missing: LIBBFD_LIBRARY LIBBFD_INCLUDE_DIR) 
-- BACKWARD_HAS_UNWIND=1
-- BACKWARD_HAS_BACKTRACE=0
-- BACKWARD_HAS_BACKTRACE_SYMBOL=1
-- BACKWARD_HAS_DW=0
-- BACKWARD_HAS_BFD=0
-- Could NOT find Backward (missing: BACKWARD_LIBRARIES) 
CMake Warning at CMakeLists.txt:303 (find_package):
  Found package configuration file:

    /wrkdirs/usr/ports/games/openclonk/work/openclonk-release-8.1-src/thirdparty/backward-cpp/BackwardConfig.cmake

  but it set Backward_FOUND to FALSE so package "Backward" is considered to
  be NOT FOUND.


CMake Warning (dev) at /usr/local/share/cmake/Modules/FindPackageHandleStandardArgs.cmake:426 (message):
  The package name passed to `find_package_handle_standard_args` (READLINE)
  does not match the name of the calling package (Readline).  This can lead
  to problems in calling code that expects `find_package` result variables
  (e.g., `_FOUND`) to follow a certain pattern.
Call Stack (most recent call first):
  cmake/FindReadline.cmake:42 (FIND_PACKAGE_HANDLE_STANDARD_ARGS)
  CMakeLists.txt:333 (find_package)
This warning is for project developers.  Use -Wno-dev to suppress it.

-- Found READLINE: /usr/local/lib/libreadline.so  
-- Checking for module 'openal>=1.13'
--   Found openal, version 1.21.0
-- Checking for module 'freealut>=1.1.0'
--   Found freealut, version 1.1.0
-- Checking for modules 'vorbisfile>=1.3.2;vorbis>=1.3.2;ogg>=1.2.2'
--   Found vorbisfile, version 1.3.7
--   Found vorbis, version 1.3.7
--   Found ogg, version 1.3.4
-- Using Audio toolkit: OpenAL
-- Found SDL2: /usr/local/lib/libSDL2.so  
Qt5Widgets not found. Building openclonk without editor.
-- Performing Test HAVE_CFLAG_MSSE2
-- Performing Test HAVE_CFLAG_MSSE2 - Success
-- Could NOT find GTest/GMock (missing: gtest/gtest.h gtest-all.cc gmock/gmock.h gmock-all.cc)
-- Configuring done
-- Generating done
CMake Warning:
  Manually-specified variables were not used by the project:

    CMAKE_CXX_FLAGS_DEBUG
    CMAKE_C_FLAGS_DEBUG
    CMAKE_MODULE_LINKER_FLAGS
    CMAKE_SHARED_LINKER_FLAGS


-- Build files have been written to: /wrkdirs/usr/ports/games/openclonk/work/.build
===========================================================================
=======================<phase: build          >============================
===>  Building for openclonk-8.1_2
/usr/local/bin/cmake -S/wrkdirs/usr/ports/games/openclonk/work/openclonk-release-8.1-src -B/wrkdirs/usr/ports/games/openclonk/work/.build --check-build-system CMakeFiles/Makefile.cmake 0
/usr/local/bin/cmake -E cmake_progress_start /wrkdirs/usr/ports/games/openclonk/work/.build/CMakeFiles /wrkdirs/usr/ports/games/openclonk/work/.build//CMakeFiles/progress.marks
/usr/bin/make  -f CMakeFiles/Makefile2 all
--- thirdparty/blake2/CMakeFiles/blake2.dir/all ---
--- CMakeFiles/libopenclonk.dir/all ---
/usr/bin/make  -f CMakeFiles/libopenclonk.dir/build.make CMakeFiles/libopenclonk.dir/depend
--- thirdparty/blake2/CMakeFiles/blake2.dir/all ---
/usr/bin/make  -f thirdparty/blake2/CMakeFiles/blake2.dir/build.make thirdparty/blake2/CMakeFiles/blake2.dir/depend
--- thirdparty/blake2/CMakeFiles/blake2.dir/depend ---
--- CMakeFiles/libopenclonk.dir/all ---
--- CMakeFiles/libopenclonk.dir/depend ---
--- thirdparty/blake2/CMakeFiles/blake2.dir/all ---
cd /wrkdirs/usr/ports/games/openclonk/work/.build && /usr/local/bin/cmake -E cmake_depends "Unix Makefiles" /wrkdirs/usr/ports/games/openclonk/work/openclonk-release-8.1-src /wrkdirs/usr/ports/games/openclonk/work/openclonk-release-8.1-src/thirdparty/blake2 /wrkdirs/usr/ports/games/openclonk/work/.build /wrkdirs/usr/ports/games/openclonk/work/.build/thirdparty/blake2 /wrkdirs/usr/ports/games/openclonk/work/.build/thirdparty/blake2/CMakeFiles/blake2.dir/DependInfo.cmake
--- CMakeFiles/libopenclonk.dir/all ---
cd /wrkdirs/usr/ports/games/openclonk/work/.build && /usr/local/bin/cmake -E cmake_depends "Unix Makefiles" /wrkdirs/usr/ports/games/openclonk/work/openclonk-release-8.1-src /wrkdirs/usr/ports/games/openclonk/work/openclonk-release-8.1-src /wrkdirs/usr/ports/games/openclonk/work/.build /wrkdirs/usr/ports/games/openclonk/work/.build /wrkdirs/usr/ports/games/openclonk/work/.build/CMakeFiles/libopenclonk.dir/DependInfo.cmake
--- thirdparty/blake2/CMakeFiles/blake2.dir/all ---
Scanning dependencies of target blake2
/usr/bin/make  -f thirdparty/blake2/CMakeFiles/blake2.dir/build.make thirdparty/blake2/CMakeFiles/blake2.dir/build
--- thirdparty/blake2/CMakeFiles/blake2.dir/blake2b.c.o ---
[  0%] Building C object thirdparty/blake2/CMakeFiles/blake2.dir/blake2b.c.o
cd /wrkdirs/usr/ports/games/openclonk/work/.build/thirdparty/blake2 && /usr/bin/cc -DHAVE_CONFIG_H -DHAVE_SSE2 -DOC_SYSTEM_DATA_DIR=\"/usr/local/share/openclonk\" -I/usr/local/include/freetype2 -I/usr/local/include/AL -I/wrkdirs/usr/ports/games/openclonk/work/.build -I/wrkdirs/usr/ports/games/openclonk/work/openclonk-release-8.1-src/src -I/wrkdirs/usr/ports/games/openclonk/work/openclonk-release-8.1-src/thirdparty/blake2 -isystem /usr/local/include -isystem /usr/local/include/miniupnpc -isystem /usr/local/include/readline -isystem /usr/local/include/SDL2 -isystem /wrkdirs/usr/ports/games/openclonk/work/openclonk-release-8.1-src/thirdparty -O2 -pipe  -fstack-protector-strong -fno-strict-aliasing -O2 -pipe  -fstack-protector-strong -fno-strict-aliasing -msse2 -o CMakeFiles/blake2.dir/blake2b.c.o -c /wrkdirs/usr/ports/games/openclonk/work/openclonk-release-8.1-src/thirdparty/blake2/blake2b.c
cc: warning: argument unused during compilation: '-msse2' [-Wunused-command-line-argument]
In file included from /wrkdirs/usr/ports/games/openclonk/work/openclonk-release-8.1-src/thirdparty/blake2/blake2b.c:28:
In file included from /usr/lib/clang/10.0.1/include/emmintrin.h:13:
In file included from /usr/lib/clang/10.0.1/include/xmmintrin.h:13:
/usr/lib/clang/10.0.1/include/mmintrin.h:50:12: error: invalid conversion between vector type '__m64' (vector of 1 'long long' value) and integer type 'int' of different size
    return (__m64)__builtin_ia32_vec_init_v2si(__i, 0);
           ^~~~~~~~~~~~~~~~~~~~~~~~~~~~~~~~~~~~~~~~~~~
/usr/lib/clang/10.0.1/include/mmintrin.h:129:12: error: invalid conversion between vector type '__m64' (vector of 1 'long long' value) and integer type 'int' of different size
    return (__m64)__builtin_ia32_packsswb((__v4hi)__m1, (__v4hi)__m2);
           ^~~~~~~~~~~~~~~~~~~~~~~~~~~~~~~~~~~~~~~~~~~~~~~~~~~~~~~~~~
/usr/lib/clang/10.0.1/include/mmintrin.h:159:12: error: invalid conversion between vector type '__m64' (vector of 1 'long long' value) and integer type 'int' of different size
    return (__m64)__builtin_ia32_packssdw((__v2si)__m1, (__v2si)__m2);
           ^~~~~~~~~~~~~~~~~~~~~~~~~~~~~~~~~~~~~~~~~~~~~~~~~~~~~~~~~~
/usr/lib/clang/10.0.1/include/mmintrin.h:189:12: error: invalid conversion between vector type '__m64' (vector of 1 'long long' value) and integer type 'int' of different size
    return (__m64)__builtin_ia32_packuswb((__v4hi)__m1, (__v4hi)__m2);
           ^~~~~~~~~~~~~~~~~~~~~~~~~~~~~~~~~~~~~~~~~~~~~~~~~~~~~~~~~~
/usr/lib/clang/10.0.1/include/mmintrin.h:216:12: error: invalid conversion between vector type '__m64' (vector of 1 'long long' value) and integer type 'int' of different size
    return (__m64)__builtin_ia32_punpckhbw((__v8qi)__m1, (__v8qi)__m2);
           ^~~~~~~~~~~~~~~~~~~~~~~~~~~~~~~~~~~~~~~~~~~~~~~~~~~~~~~~~~~
/usr/lib/clang/10.0.1/include/mmintrin.h:239:12: error: invalid conversion between vector type '__m64' (vector of 1 'long long' value) and integer type 'int' of different size
    return (__m64)__builtin_ia32_punpckhwd((__v4hi)__m1, (__v4hi)__m2);
           ^~~~~~~~~~~~~~~~~~~~~~~~~~~~~~~~~~~~~~~~~~~~~~~~~~~~~~~~~~~
/usr/lib/clang/10.0.1/include/mmintrin.h:260:12: error: invalid conversion between vector type '__m64' (vector of 1 'long long' value) and integer type 'int' of different size
    return (__m64)__builtin_ia32_punpckhdq((__v2si)__m1, (__v2si)__m2);
           ^~~~~~~~~~~~~~~~~~~~~~~~~~~~~~~~~~~~~~~~~~~~~~~~~~~~~~~~~~~
/usr/lib/clang/10.0.1/include/mmintrin.h:287:12: error: invalid conversion between vector type '__m64' (vector of 1 'long long' value) and integer type 'int' of different size
    return (__m64)__builtin_ia32_punpcklbw((__v8qi)__m1, (__v8qi)__m2);
           ^~~~~~~~~~~~~~~~~~~~~~~~~~~~~~~~~~~~~~~~~~~~~~~~~~~~~~~~~~~
/usr/lib/clang/10.0.1/include/mmintrin.h:310:12: error: invalid conversion between vector type '__m64' (vector of 1 'long long' value) and integer type 'int' of different size
    return (__m64)__builtin_ia32_punpcklwd((__v4hi)__m1, (__v4hi)__m2);
           ^~~~~~~~~~~~~~~~~~~~~~~~~~~~~~~~~~~~~~~~~~~~~~~~~~~~~~~~~~~
/usr/lib/clang/10.0.1/include/mmintrin.h:331:12: error: invalid conversion between vector type '__m64' (vector of 1 'long long' value) and integer type 'int' of different size
    return (__m64)__builtin_ia32_punpckldq((__v2si)__m1, (__v2si)__m2);
           ^~~~~~~~~~~~~~~~~~~~~~~~~~~~~~~~~~~~~~~~~~~~~~~~~~~~~~~~~~~
/usr/lib/clang/10.0.1/include/mmintrin.h:352:12: error: invalid conversion between vector type '__m64' (vector of 1 'long long' value) and integer type 'int' of different size
    return (__m64)__builtin_ia32_paddb((__v8qi)__m1, (__v8qi)__m2);
           ^~~~~~~~~~~~~~~~~~~~~~~~~~~~~~~~~~~~~~~~~~~~~~~~~~~~~~~
/usr/lib/clang/10.0.1/include/mmintrin.h:373:12: error: invalid conversion between vector type '__m64' (vector of 1 'long long' value) and integer type 'int' of different size
    return (__m64)__builtin_ia32_paddw((__v4hi)__m1, (__v4hi)__m2);
           ^~~~~~~~~~~~~~~~~~~~~~~~~~~~~~~~~~~~~~~~~~~~~~~~~~~~~~~
/usr/lib/clang/10.0.1/include/mmintrin.h:394:12: error: invalid conversion between vector type '__m64' (vector of 1 'long long' value) and integer type 'int' of different size
    return (__m64)__builtin_ia32_paddd((__v2si)__m1, (__v2si)__m2);
           ^~~~~~~~~~~~~~~~~~~~~~~~~~~~~~~~~~~~~~~~~~~~~~~~~~~~~~~
/usr/lib/clang/10.0.1/include/mmintrin.h:416:12: error: invalid conversion between vector type '__m64' (vector of 1 'long long' value) and integer type 'int' of different size
    return (__m64)__builtin_ia32_paddsb((__v8qi)__m1, (__v8qi)__m2);
           ^~~~~~~~~~~~~~~~~~~~~~~~~~~~~~~~~~~~~~~~~~~~~~~~~~~~~~~~
/usr/lib/clang/10.0.1/include/mmintrin.h:439:12: error: invalid conversion between vector type '__m64' (vector of 1 'long long' value) and integer type 'int' of different size
    return (__m64)__builtin_ia32_paddsw((__v4hi)__m1, (__v4hi)__m2);
           ^~~~~~~~~~~~~~~~~~~~~~~~~~~~~~~~~~~~~~~~~~~~~~~~~~~~~~~~
/usr/lib/clang/10.0.1/include/mmintrin.h:461:12: error: invalid conversion between vector type '__m64' (vector of 1 'long long' value) and integer type 'int' of different size
    return (__m64)__builtin_ia32_paddusb((__v8qi)__m1, (__v8qi)__m2);
           ^~~~~~~~~~~~~~~~~~~~~~~~~~~~~~~~~~~~~~~~~~~~~~~~~~~~~~~~~
/usr/lib/clang/10.0.1/include/mmintrin.h:483:12: error: invalid conversion between vector type '__m64' (vector of 1 'long long' value) and integer type 'int' of different size
    return (__m64)__builtin_ia32_paddusw((__v4hi)__m1, (__v4hi)__m2);
           ^~~~~~~~~~~~~~~~~~~~~~~~~~~~~~~~~~~~~~~~~~~~~~~~~~~~~~~~~
/usr/lib/clang/10.0.1/include/mmintrin.h:504:12: error: invalid conversion between vector type '__m64' (vector of 1 'long long' value) and integer type 'int' of different size
    return (__m64)__builtin_ia32_psubb((__v8qi)__m1, (__v8qi)__m2);
           ^~~~~~~~~~~~~~~~~~~~~~~~~~~~~~~~~~~~~~~~~~~~~~~~~~~~~~~
/usr/lib/clang/10.0.1/include/mmintrin.h:525:12: error: invalid conversion between vector type '__m64' (vector of 1 'long long' value) and integer type 'int' of different size
    return (__m64)__builtin_ia32_psubw((__v4hi)__m1, (__v4hi)__m2);
           ^~~~~~~~~~~~~~~~~~~~~~~~~~~~~~~~~~~~~~~~~~~~~~~~~~~~~~~
fatal error: too many errors emitted, stopping now [-ferror-limit=]
--- CMakeFiles/libopenclonk.dir/all ---
Scanning dependencies of target libopenclonk
/usr/bin/make  -f CMakeFiles/libopenclonk.dir/build.make CMakeFiles/libopenclonk.dir/build
--- CMakeFiles/libopenclonk.dir/src/c4group/C4Extra.cpp.o ---
[  1%] Building CXX object CMakeFiles/libopenclonk.dir/src/c4group/C4Extra.cpp.o
/usr/bin/c++ -DCOMPILED_AS_C4LIBRARY -DHAVE_CONFIG_H -DNDEBUG -DOC_SYSTEM_DATA_DIR=\"/usr/local/share/openclonk\" -I/usr/local/include/freetype2 -I/usr/local/include/AL -I/wrkdirs/usr/ports/games/openclonk/work/.build -I/wrkdirs/usr/ports/games/openclonk/work/openclonk-release-8.1-src/src -isystem /usr/local/include -isystem /usr/local/include/miniupnpc -isystem /usr/local/include/readline -isystem /usr/local/include/SDL2 -isystem /wrkdirs/usr/ports/games/openclonk/work/openclonk-release-8.1-src/thirdparty -O2 -pipe -fstack-protector-strong -fno-strict-aliasing -std=gnu++14 -Wall -Wextra -Wextra-tokens -Wpointer-arith -Wno-cast-align -Wno-reorder -Wno-unused-parameter -Wnon-virtual-dtor -Woverloaded-virtual -O2 -pipe -fstack-protector-strong -fno-strict-aliasing -std=gnu++14 -o CMakeFiles/libopenclonk.dir/src/c4group/C4Extra.cpp.o -c /wrkdirs/usr/ports/games/openclonk/work/openclonk-release-8.1-src/src/c4group/C4Extra.cpp
--- thirdparty/blake2/CMakeFiles/blake2.dir/all ---
20 errors generated.
*** [thirdparty/blake2/CMakeFiles/blake2.dir/blake2b.c.o] Error code 1

make[3]: stopped in /wrkdirs/usr/ports/games/openclonk/work/.build
1 error

make[3]: stopped in /wrkdirs/usr/ports/games/openclonk/work/.build
*** [thirdparty/blake2/CMakeFiles/blake2.dir/all] Error code 2

make[2]: stopped in /wrkdirs/usr/ports/games/openclonk/work/.build
--- CMakeFiles/libopenclonk.dir/all ---
*** [CMakeFiles/libopenclonk.dir/all] Error code 2

make[2]: stopped in /wrkdirs/usr/ports/games/openclonk/work/.build
2 errors

make[2]: stopped in /wrkdirs/usr/ports/games/openclonk/work/.build
*** [all] Error code 2

make[1]: stopped in /wrkdirs/usr/ports/games/openclonk/work/.build
1 error

make[1]: stopped in /wrkdirs/usr/ports/games/openclonk/work/.build
===> Compilation failed unexpectedly.
Try to set MAKE_JOBS_UNSAFE=yes and rebuild before reporting the failure to
the maintainer.
*** Error code 1

Stop.
make: stopped in /usr/ports/games/openclonk
Received on Sat Jun 26 2021 - 01:46:25 UTC

Original text of this message