[package - 122powerpc64-quarterly][net/bsdec2-image-upload] Failed for bsdec2-image-upload-1.4.1 in build

From: <pkg-fallout_at_FreeBSD.org>
Date: Thu, 24 Jun 2021 03:25:22 GMT
You are receiving this mail as a port that you maintain
is failing to build on the FreeBSD package build server.
Please investigate the failure and submit a PR to fix
build.

Maintainer:     cperciva_at_FreeBSD.org
Log URL:        http://foul1.nyi.freebsd.org/data/122powerpc64-quarterly/3e55273e25e2/logs/bsdec2-image-upload-1.4.1.log
Build URL:      http://foul1.nyi.freebsd.org/build.html?mastername=122powerpc64-quarterly&build=3e55273e25e2
Log:

=>> Building net/bsdec2-image-upload
build started at Thu Jun 24 03:25:14 UTC 2021
port directory: /usr/ports/net/bsdec2-image-upload
package name: bsdec2-image-upload-1.4.1
building for: FreeBSD 122powerpc64-quarterly-job-13 12.2-RELEASE FreeBSD 12.2-RELEASE powerpc
maintained by: cperciva_at_FreeBSD.org
Makefile ident: 
Poudriere version: 3.2.8-8-gaf08dbda
Host OSVERSION: 1400008
Jail OSVERSION: 1202000
Job Id: 13

---Begin Environment---
SHELL=/bin/csh
OSVERSION=1202000
UNAME_v=FreeBSD 12.2-RELEASE
UNAME_r=12.2-RELEASE
BLOCKSIZE=K
MAIL=/var/mail/root
STATUS=1
HOME=/root
PATH=/sbin:/bin:/usr/sbin:/usr/bin:/usr/local/sbin:/usr/local/bin:/root/bin
LOCALBASE=/usr/local
USER=root
LIBEXECPREFIX=/usr/local/libexec/poudriere
POUDRIERE_VERSION=3.2.8-8-gaf08dbda
MASTERMNT=/usr/local/poudriere/data/.m/122powerpc64-quarterly/ref
POUDRIERE_BUILD_TYPE=bulk
PACKAGE_BUILDING=yes
SAVED_TERM=
PWD=/usr/local/poudriere/data/.m/122powerpc64-quarterly/ref/.p/pool
P_PORTS_FEATURES=FLAVORS SELECTED_OPTIONS
MASTERNAME=122powerpc64-quarterly
SCRIPTPREFIX=/usr/local/share/poudriere
OLDPWD=/usr/local/poudriere/data/.m/122powerpc64-quarterly/ref/.p
SCRIPTPATH=/usr/local/share/poudriere/bulk.sh
POUDRIEREPATH=/usr/local/bin/poudriere
---End Environment---

---Begin Poudriere Port Flags/Env---
PORT_FLAGS=
PKGENV=
FLAVOR=
DEPENDS_ARGS=
MAKE_ARGS=
---End Poudriere Port Flags/Env---

---Begin OPTIONS List---
---End OPTIONS List---

--MAINTAINER--
cperciva_at_FreeBSD.org
--End MAINTAINER--

--CONFIGURE_ARGS--

--End CONFIGURE_ARGS--

--CONFIGURE_ENV--
XDG_DATA_HOME=/wrkdirs/usr/ports/net/bsdec2-image-upload/work  XDG_CONFIG_HOME=/wrkdirs/usr/ports/net/bsdec2-image-upload/work  HOME=/wrkdirs/usr/ports/net/bsdec2-image-upload/work TMPDIR="/tmp" PATH=/wrkdirs/usr/ports/net/bsdec2-image-upload/work/.bin:/sbin:/bin:/usr/sbin:/usr/bin:/usr/local/sbin:/usr/local/bin:/root/bin SHELL=/bin/sh CONFIG_SHELL=/bin/sh
--End CONFIGURE_ENV--

--MAKE_ENV--
OPENSSLBASE=/usr OPENSSLDIR=/etc/ssl OPENSSLINC=/usr/include OPENSSLLIB=/usr/lib XDG_DATA_HOME=/wrkdirs/usr/ports/net/bsdec2-image-upload/work  XDG_CONFIG_HOME=/wrkdirs/usr/ports/net/bsdec2-image-upload/work  HOME=/wrkdirs/usr/ports/net/bsdec2-image-upload/work TMPDIR="/tmp" PATH=/wrkdirs/usr/ports/net/bsdec2-image-upload/work/.bin:/sbin:/bin:/usr/sbin:/usr/bin:/usr/local/sbin:/usr/local/bin:/root/bin NO_PIE=yes MK_DEBUG_FILES=no MK_KERNEL_SYMBOLS=no SHELL=/bin/sh NO_LINT=YES PREFIX=/usr/local  LOCALBASE=/usr/local  CC="cc" CFLAGS="-O2 -pipe  -I/usr/include -fstack-protector-strong -fno-strict-aliasing "  CPP="cpp" CPPFLAGS=""  LDFLAGS=" -L/usr/lib  -fstack-protector-strong " LIBS=""  CXX="c++" CXXFLAGS="-O2 -pipe -I/usr/include -fstack-protector-strong -fno-strict-aliasing  "  MANPREFIX="/usr/local" BSD_INSTALL_PROGRAM="install  -s -m 555"  BSD_INSTALL_LIB="install  -s -m 0644"  BSD_INSTALL_SCRIPT="install  -m 555"  BSD_INSTALL_DATA="install  -m 0644"  BSD_INSTALL_MAN="install  -m 4
 44"
--End MAKE_ENV--

--PLIST_SUB--
OSREL=12.2 PREFIX=%D LOCALBASE=/usr/local  RESETPREFIX=/usr/local LIB32DIR=lib DOCSDIR="share/doc/bsdec2-image-upload"  EXAMPLESDIR="share/examples/bsdec2-image-upload"  DATADIR="share/bsdec2-image-upload"  WWWDIR="www/bsdec2-image-upload"  ETCDIR="etc/bsdec2-image-upload"
--End PLIST_SUB--

--SUB_LIST--
PREFIX=/usr/local LOCALBASE=/usr/local  DATADIR=/usr/local/share/bsdec2-image-upload DOCSDIR=/usr/local/share/doc/bsdec2-image-upload EXAMPLESDIR=/usr/local/share/examples/bsdec2-image-upload  WWWDIR=/usr/local/www/bsdec2-image-upload ETCDIR=/usr/local/etc/bsdec2-image-upload
--End SUB_LIST--

---Begin make.conf---
USE_PACKAGE_DEPENDS=yes
BATCH=yes
WRKDIRPREFIX=/wrkdirs
PORTSDIR=/usr/ports
PACKAGES=/packages
DISTDIR=/distfiles
PACKAGE_BUILDING=yes
PACKAGE_BUILDING_FLAVORS=yes
#### /usr/local/etc/poudriere.d/make.conf ####
# XXX: We really need this but cannot use it while 'make checksum' does not
# try the next mirror on checksum failure.  It currently retries the same
# failed mirror and then fails rather then trying another.  It *does*
# try the next if the size is mismatched though.
#MASTER_SITE_FREEBSD=yes
# Build ALLOW_MAKE_JOBS_PACKAGES with 2 jobs
MAKE_JOBS_NUMBER=2
#### /usr/ports/Mk/Scripts/ports_env.sh ####
_CCVERSION_921dbbb2=cc (GCC) 4.2.1 20070831 patched [FreeBSD] Copyright (C) 2007 Free Software Foundation, Inc. This is free software; see the source for copying conditions. There is NO warranty; not even for MERCHANTABILITY or FITNESS FOR A PARTICULAR PURPOSE.
_ALTCCVERSION_921dbbb2=none
_CXXINTERNAL_acaad9ca=Using built-in specs. Target: powerpc64-undermydesk-freebsd Configured with: FreeBSD/powerpc64 system compiler Thread model: posix gcc version 4.2.1 20070831 patched [FreeBSD] "/usr/bin/ld" "--eh-frame-hdr" "-Qy" "-melf64ppc_fbsd" "--enable-new-dtags" "-dynamic-linker" "/libexec/ld-elf.so.1" "/usr/lib/crt1.o" "/usr/lib/crti.o" "/usr/lib/crtbegin.o" "-L/usr/lib" "-L/usr/lib" "/dev/null" "-lstdc++" "-lm" "-lgcc_s" "-lgcc" "-lc" "-lgcc_s" "-lgcc" "/usr/lib/crtsavres.o" "/usr/lib/crtend.o" "/usr/lib/crtn.o"
CC_OUTPUT_921dbbb2_58173849=yes
CC_OUTPUT_921dbbb2_9bdba57c=yes
CC_OUTPUT_921dbbb2_6a4fe7f5=cc1: error: unrecognized command line option "-std=c11"
CC_OUTPUT_921dbbb2_6bcac02b=yes
CC_OUTPUT_921dbbb2_67d20829=yes
CC_OUTPUT_921dbbb2_bfa62e83=cc1: error: unrecognized command line option "-std=gnu11"
CC_OUTPUT_921dbbb2_f0b4d593=yes
CC_OUTPUT_921dbbb2_308abb44=cc1plus: error: unrecognized command line option "-std=c++0x"
CC_OUTPUT_921dbbb2_f00456e5=cc1plus: error: unrecognized command line option "-std=c++11"
CC_OUTPUT_921dbbb2_65ad290d=cc1plus: error: unrecognized command line option "-std=c++14"
CC_OUTPUT_921dbbb2_f2776b26=cc1plus: error: unrecognized command line option "-std=c++17"
CC_OUTPUT_921dbbb2_b2657cc3=yes
CC_OUTPUT_921dbbb2_380987f7=cc1plus: error: unrecognized command line option "-std=gnu++11"
CC_OUTPUT_921dbbb2_160933ec=cc1plus: error: unrecognized command line option "-std=gnu++14"
CC_OUTPUT_921dbbb2_fb62803b=cc1plus: error: unrecognized command line option "-std=gnu++17"
_OBJC_CCVERSION_921dbbb2=cc (GCC) 4.2.1 20070831 patched [FreeBSD] Copyright (C) 2007 Free Software Foundation, Inc. This is free software; see the source for copying conditions. There is NO warranty; not even for MERCHANTABILITY or FITNESS FOR A PARTICULAR PURPOSE.
_OBJC_ALTCCVERSION_921dbbb2=none
ARCH=powerpc64
PPC_ABI=ELFv1
OPSYS=FreeBSD
_OSRELEASE=12.2-RELEASE
OSREL=12.2
OSVERSION=1202000
PYTHONBASE=/usr/local
CONFIGURE_MAX_CMD_LEN=524288
HAVE_PORTS_ENV=1
#### Misc Poudriere ####
GID=0
UID=0
---End make.conf---
--Resource limits--
cpu time               (seconds, -t)  unlimited
file size           (512-blocks, -f)  unlimited
data seg size           (kbytes, -d)  33554432
stack size              (kbytes, -s)  524288
core file size      (512-blocks, -c)  unlimited
max memory size         (kbytes, -m)  unlimited
locked memory           (kbytes, -l)  unlimited
max user processes              (-u)  89999
open files                      (-n)  1024
virtual mem size        (kbytes, -v)  unlimited
swap limit              (kbytes, -w)  unlimited
socket buffer size       (bytes, -b)  unlimited
pseudo-terminals                (-p)  unlimited
kqueues                         (-k)  unlimited
umtx shared locks               (-o)  unlimited
--End resource limits--
=======================<phase: check-sanity   >============================
===>  License BSD2CLAUSE accepted by the user
===========================================================================
=======================<phase: pkg-depends    >============================
===>   bsdec2-image-upload-1.4.1 depends on file: /usr/local/sbin/pkg - not found
===>   Installing existing package /packages/All/pkg-1.16.3.txz
[122powerpc64-quarterly-job-13] Installing pkg-1.16.3...
[122powerpc64-quarterly-job-13] Extracting pkg-1.16.3: .......... done
===>   bsdec2-image-upload-1.4.1 depends on file: /usr/local/sbin/pkg - found
===>   Returning to build of bsdec2-image-upload-1.4.1
===========================================================================
=======================<phase: fetch-depends  >============================
===========================================================================
=======================<phase: fetch          >============================
===>  License BSD2CLAUSE accepted by the user
===> Fetching all distfiles required by bsdec2-image-upload-1.4.1 for building
===========================================================================
=======================<phase: checksum       >============================
===>  License BSD2CLAUSE accepted by the user
===> Fetching all distfiles required by bsdec2-image-upload-1.4.1 for building
=> SHA256 Checksum OK for bsdec2-image-upload-1.4.1.tgz.
===========================================================================
=======================<phase: extract-depends>============================
===========================================================================
=======================<phase: extract        >============================
===>  License BSD2CLAUSE accepted by the user
===> Fetching all distfiles required by bsdec2-image-upload-1.4.1 for building
===>  Extracting for bsdec2-image-upload-1.4.1
=> SHA256 Checksum OK for bsdec2-image-upload-1.4.1.tgz.
===========================================================================
=======================<phase: patch-depends  >============================
===========================================================================
=======================<phase: patch          >============================
===>  Patching for bsdec2-image-upload-1.4.1
===========================================================================
=======================<phase: build-depends  >============================
===========================================================================
=======================<phase: lib-depends    >============================
===========================================================================
=======================<phase: configure      >============================
===>  Configuring for bsdec2-image-upload-1.4.1
===========================================================================
=======================<phase: build          >============================
===>  Building for bsdec2-image-upload-1.4.1
--- cflags-filter.sh ---
--- cpusupport-config.h ---
--- cflags-filter.sh ---
if [ -d libcperciva/POSIX/ ]; then			 export CC="cc";					 cd libcperciva/POSIX;				 command -p sh posix-cflags-filter.sh "$PATH";		 fi > cflags-filter.sh
--- cpusupport-config.h ---
if [ -d libcperciva/cpusupport/ ]; then			 export CC="cc";					 command -p sh						 libcperciva/cpusupport/Build/cpusupport.sh	 "$PATH";						 fi > cpusupport-config.h
if [ ! -s cpusupport-config.h ]; then						 printf "#define CPUSUPPORT_NONE 1\n";			 fi >> cpusupport-config.h
--- cflags-filter.sh ---
if [ ! -s cflags-filter.sh ]; then						 printf "# Compiler understands normal flags; ";		 printf "nothing to filter out\n";			 fi >> cflags-filter.sh
--- posix-flags.sh ---
if [ -d libcperciva/POSIX/ ]; then			 export CC="cc";					 cd libcperciva/POSIX;				 printf "export \"LDADD_POSIX=";				 command -p sh posix-l.sh "$PATH";			 printf "\"\n";						 printf "export \"CFLAGS_POSIX=";			 command -p sh posix-cflags.sh "$PATH";			 printf "\"\n";						 fi > posix-flags.sh
if [ ! -s posix-flags.sh ]; then						 printf "#define POSIX_COMPATIBILITY_NOT_CHECKED 1\n";	 fi >> posix-flags.sh
--- all ---
export CFLAGS="${CFLAGS:--O2}";	 . ./posix-flags.sh;				 . ./cpusupport-config.h;			 . ./cflags-filter.sh;				 export HAVE_BUILD_FLAGS=1;			 for D in bsdec2-image-upload ; do			 ( cd ${D} && /usr/bin/make all ) || exit 2;	 done
#define POSIX_COMPATIBILITY_NOT_CHECKED 1
#define CPUSUPPORT_NONE 1
# Compiler understands normal flags; nothing to filter out
--- all ---
if [ -z "${HAVE_BUILD_FLAGS}" ]; then  cd ..;  /usr/bin/make BUILD_SUBDIR=bsdec2-image-upload  BUILD_TARGET=bsdec2-image-upload buildsubdir;  else  /usr/bin/make bsdec2-image-upload;  fi
--- main.o ---
--- sha256.o ---
--- main.o ---
cc  -D_POSIX_C_SOURCE=200809L -D_XOPEN_SOURCE=700 -DCPUSUPPORT_CONFIG_FILE=\"cpusupport-config.h\"  -I.. -I ../libcperciva/alg -I ../libcperciva/datastruct -I ../libcperciva/util -I ../libcperciva/aws -I ../lib/util  -O2 -pipe  -I/usr/include -fstack-protector-strong -fno-strict-aliasing  -c main.c -o main.o
--- sha256.o ---
cc  -D_POSIX_C_SOURCE=200809L -D_XOPEN_SOURCE=700 -DCPUSUPPORT_CONFIG_FILE=\"cpusupport-config.h\"  -I.. -I ../libcperciva/alg -I ../libcperciva/datastruct -I ../libcperciva/util -I ../libcperciva/aws -I ../lib/util  -O2 -pipe  -I/usr/include -fstack-protector-strong -fno-strict-aliasing  -c ../libcperciva/alg/sha256.c -o sha256.o
./libcperciva/alg/sha256.c:97: error: 'restrict' undeclared here (not in a function)
./libcperciva/alg/sha256.c:97: error: expected ']' before numeric constant
./libcperciva/alg/sha256.c:98: error: expected ';', ',' or ')' before 'const'
./libcperciva/alg/sha256.c:162: error: 'restrict' undeclared here (not in a function)
./libcperciva/alg/sha256.c:162: error: expected ']' before numeric constant
./libcperciva/alg/sha256.c: In function 'SHA256_Pad':
./libcperciva/alg/sha256.c:176: error: 'tmp32' undeclared (first use in this function)
./libcperciva/alg/sha256.c:176: error: (Each undeclared identifier is reported only once
./libcperciva/alg/sha256.c:176: error: for each function it appears in.)
./libcperciva/alg/sha256.c: At top level:
./libcperciva/alg/sha256.c:216: error: 'restrict' undeclared here (not in a function)
./libcperciva/alg/sha256.c:216: error: expected ']' before numeric constant
./libcperciva/alg/sha256.c: In function '_SHA256_Update':
./libcperciva/alg/sha256.c:239: error: 'tmp32' undeclared (first use in this function)
./libcperciva/alg/sha256.c: In function 'libcperciva_SHA256_Update':
./libcperciva/alg/sha256.c:261: error: too many arguments to function '_SHA256_Update'
./libcperciva/alg/sha256.c: At top level:
./libcperciva/alg/sha256.c:274: error: 'restrict' undeclared here (not in a function)
./libcperciva/alg/sha256.c:274: error: expected ']' before numeric constant
./libcperciva/alg/sha256.c: In function '_SHA256_Final':
./libcperciva/alg/sha256.c:278: error: 'tmp32' undeclared (first use in this function)
./libcperciva/alg/sha256.c:278: error: too many arguments to function 'SHA256_Pad'
./libcperciva/alg/sha256.c: In function 'libcperciva_SHA256_Final':
./libcperciva/alg/sha256.c:291: error: too many arguments to function '_SHA256_Final'
./libcperciva/alg/sha256.c: In function 'libcperciva_SHA256_Buf':
./libcperciva/alg/sha256.c:311: error: too many arguments to function '_SHA256_Update'
./libcperciva/alg/sha256.c:312: error: too many arguments to function '_SHA256_Final'
./libcperciva/alg/sha256.c: At top level:
./libcperciva/alg/sha256.c:326: error: 'restrict' undeclared here (not in a function)
./libcperciva/alg/sha256.c:326: error: expected ']' before numeric constant
./libcperciva/alg/sha256.c:326: error: expected ';', ',' or ')' before 'uint8_t'
./libcperciva/alg/sha256.c:379: error: 'restrict' undeclared here (not in a function)
./libcperciva/alg/sha256.c:379: error: expected ']' before numeric constant
./libcperciva/alg/sha256.c: In function '_HMAC_SHA256_Update':
./libcperciva/alg/sha256.c:383: error: 'tmp32' undeclared (first use in this function)
./libcperciva/alg/sha256.c:383: error: too many arguments to function '_SHA256_Update'
./libcperciva/alg/sha256.c: In function 'libcperciva_HMAC_SHA256_Update':
./libcperciva/alg/sha256.c:393: error: too many arguments to function '_HMAC_SHA256_Update'
./libcperciva/alg/sha256.c: At top level:
./libcperciva/alg/sha256.c:406: error: 'restrict' undeclared here (not in a function)
./libcperciva/alg/sha256.c:406: error: expected ']' before numeric constant
./libcperciva/alg/sha256.c:406: error: expected ';', ',' or ')' before 'uint8_t'
./libcperciva/alg/sha256.c: In function 'libcperciva_HMAC_SHA256_Buf':
./libcperciva/alg/sha256.c:448: error: too many arguments to function '_HMAC_SHA256_Update'
./libcperciva/alg/sha256.c: In function 'PBKDF2_SHA256':
./libcperciva/alg/sha256.c:486: error: too many arguments to function '_HMAC_SHA256_Update'
./libcperciva/alg/sha256.c:495: error: too many arguments to function '_HMAC_SHA256_Update'
./libcperciva/alg/sha256.c:504: error: too many arguments to function '_HMAC_SHA256_Update'
*** [sha256.o] Error code 1

make[3]: stopped in /wrkdirs/usr/ports/net/bsdec2-image-upload/work/bsdec2-image-upload-1.4.1/bsdec2-image-upload
1 error

make[3]: stopped in /wrkdirs/usr/ports/net/bsdec2-image-upload/work/bsdec2-image-upload-1.4.1/bsdec2-image-upload
*** [all] Error code 2

make[2]: stopped in /wrkdirs/usr/ports/net/bsdec2-image-upload/work/bsdec2-image-upload-1.4.1/bsdec2-image-upload
1 error

make[2]: stopped in /wrkdirs/usr/ports/net/bsdec2-image-upload/work/bsdec2-image-upload-1.4.1/bsdec2-image-upload
*** [all] Error code 2

make[1]: stopped in /wrkdirs/usr/ports/net/bsdec2-image-upload/work/bsdec2-image-upload-1.4.1
1 error

make[1]: stopped in /wrkdirs/usr/ports/net/bsdec2-image-upload/work/bsdec2-image-upload-1.4.1
===> Compilation failed unexpectedly.
Try to set MAKE_JOBS_UNSAFE=yes and rebuild before reporting the failure to
the maintainer.
*** Error code 1

Stop.
make: stopped in /usr/ports/net/bsdec2-image-upload
Received on Thu Jun 24 2021 - 03:25:22 UTC

Original text of this message