[package - 122powerpc64-quarterly][devel/py-maturin] Failed for py37-maturin-0.8.3_5 in build

From: <pkg-fallout_at_FreeBSD.org>
Date: Thu, 24 Jun 2021 03:01:13 GMT
You are receiving this mail as a port that you maintain
is failing to build on the FreeBSD package build server.
Please investigate the failure and submit a PR to fix
build.

Maintainer:     kai_at_FreeBSD.org
Log URL:        http://foul1.nyi.freebsd.org/data/122powerpc64-quarterly/3e55273e25e2/logs/py37-maturin-0.8.3_5.log
Build URL:      http://foul1.nyi.freebsd.org/build.html?mastername=122powerpc64-quarterly&build=3e55273e25e2
Log:

=>> Building devel/py-maturin
build started at Thu Jun 24 02:55:39 UTC 2021
port directory: /usr/ports/devel/py-maturin
package name: py37-maturin-0.8.3_5
building for: FreeBSD 122powerpc64-quarterly-job-10 12.2-RELEASE FreeBSD 12.2-RELEASE powerpc
maintained by: kai_at_FreeBSD.org
Makefile ident: 
Poudriere version: 3.2.8-8-gaf08dbda
Host OSVERSION: 1400008
Jail OSVERSION: 1202000
Job Id: 10

---Begin Environment---
SHELL=/bin/csh
OSVERSION=1202000
UNAME_v=FreeBSD 12.2-RELEASE
UNAME_r=12.2-RELEASE
BLOCKSIZE=K
MAIL=/var/mail/root
STATUS=1
HOME=/root
PATH=/sbin:/bin:/usr/sbin:/usr/bin:/usr/local/sbin:/usr/local/bin:/root/bin
LOCALBASE=/usr/local
USER=root
LIBEXECPREFIX=/usr/local/libexec/poudriere
POUDRIERE_VERSION=3.2.8-8-gaf08dbda
MASTERMNT=/usr/local/poudriere/data/.m/122powerpc64-quarterly/ref
POUDRIERE_BUILD_TYPE=bulk
PACKAGE_BUILDING=yes
SAVED_TERM=
PWD=/usr/local/poudriere/data/.m/122powerpc64-quarterly/ref/.p/pool
P_PORTS_FEATURES=FLAVORS SELECTED_OPTIONS
MASTERNAME=122powerpc64-quarterly
SCRIPTPREFIX=/usr/local/share/poudriere
OLDPWD=/usr/local/poudriere/data/.m/122powerpc64-quarterly/ref/.p
SCRIPTPATH=/usr/local/share/poudriere/bulk.sh
POUDRIEREPATH=/usr/local/bin/poudriere
---End Environment---

---Begin Poudriere Port Flags/Env---
PORT_FLAGS=
PKGENV=
FLAVOR=py37
DEPENDS_ARGS=
MAKE_ARGS= FLAVOR=py37
---End Poudriere Port Flags/Env---

---Begin OPTIONS List---
---End OPTIONS List---

--MAINTAINER--
kai_at_FreeBSD.org
--End MAINTAINER--

--CONFIGURE_ARGS--

--End CONFIGURE_ARGS--

--CONFIGURE_ENV--
PKG_CONFIG=pkgconf PYTHON="/usr/local/bin/python3.7" XDG_DATA_HOME=/wrkdirs/usr/ports/devel/py-maturin/work-py37  XDG_CONFIG_HOME=/wrkdirs/usr/ports/devel/py-maturin/work-py37  HOME=/wrkdirs/usr/ports/devel/py-maturin/work-py37 TMPDIR="/tmp" PATH=/wrkdirs/usr/ports/devel/py-maturin/work-py37/.bin:/sbin:/bin:/usr/sbin:/usr/bin:/usr/local/sbin:/usr/local/bin:/root/bin SHELL=/bin/sh CONFIG_SHELL=/bin/sh
--End CONFIGURE_ENV--

--MAKE_ENV--
XDG_DATA_HOME=/wrkdirs/usr/ports/devel/py-maturin/work-py37  XDG_CONFIG_HOME=/wrkdirs/usr/ports/devel/py-maturin/work-py37  HOME=/wrkdirs/usr/ports/devel/py-maturin/work-py37 TMPDIR="/tmp" PATH=/wrkdirs/usr/ports/devel/py-maturin/work-py37/.bin:/sbin:/bin:/usr/sbin:/usr/bin:/usr/local/sbin:/usr/local/bin:/root/bin NO_PIE=yes MK_DEBUG_FILES=no MK_KERNEL_SYMBOLS=no SHELL=/bin/sh NO_LINT=YES ADDR2LINE="/usr/local/bin/addr2line" AR="/usr/local/bin/ar" AS="/usr/local/bin/as" CPPFILT="/usr/local/bin/c++filt" GPROF="/usr/local/bin/gprof" LD="/usr/local/bin/ld" NM="/usr/local/bin/nm" OBJCOPY="/usr/local/bin/objcopy" OBJDUMP="/usr/local/bin/objdump" RANLIB="/usr/local/bin/ranlib" READELF="/usr/local/bin/readelf" SIZE="/usr/local/bin/size" STRINGS="/usr/local/bin/strings" LDSHARED="gcc10 -shared" PYTHONDONTWRITEBYTECODE= PYTHONOPTIMIZE= PREFIX=/usr/local  LOCALBASE=/usr/local  CC="gcc10" CFLAGS="-O2 -pipe  -fstack-protector-strong -Wl,-rpath=/usr/local/lib/gcc10 -fno-strict-aliasing "  CPP="cp
 p10" CPPFLAGS=""  LDFLAGS=" -fstack-protector-strong -Wl,-rpath=/usr/local/lib/gcc10 -L/usr/local/lib/gcc10 " LIBS=""  CXX="g++10" CXXFLAGS="-O2 -pipe  -fstack-protector-strong -Wl,-rpath=/usr/local/lib/gcc10  -Wl,-rpath=/usr/local/lib/gcc10 "  MANPREFIX="/usr/local" BSD_INSTALL_PROGRAM="install  -s -m 555"  BSD_INSTALL_LIB="install  -s -m 0644"  BSD_INSTALL_SCRIPT="install  -m 555"  BSD_INSTALL_DATA="install  -m 0644"  BSD_INSTALL_MAN="install  -m 444"
--End MAKE_ENV--

--PLIST_SUB--
PYTHON_INCLUDEDIR=include/python3.7m  PYTHON_LIBDIR=lib/python3.7  PYTHON_PLATFORM=freebsd12  PYTHON_SITELIBDIR=lib/python3.7/site-packages  PYTHON_SUFFIX=37  PYTHON_EXT_SUFFIX=  PYTHON_VER=3.7  PYTHON_VERSION=python3.7 PYTHON2="_at_comment " PYTHON3="" OSREL=12.2 PREFIX=%D LOCALBASE=/usr/local  RESETPREFIX=/usr/local LIB32DIR=lib DOCSDIR="share/doc/py37-maturin"  EXAMPLESDIR="share/examples/py37-maturin"  DATADIR="share/py37-maturin"  WWWDIR="www/py37-maturin"  ETCDIR="etc/py37-maturin"
--End PLIST_SUB--

--SUB_LIST--
PREFIX=/usr/local LOCALBASE=/usr/local  DATADIR=/usr/local/share/py37-maturin DOCSDIR=/usr/local/share/doc/py37-maturin EXAMPLESDIR=/usr/local/share/examples/py37-maturin  WWWDIR=/usr/local/www/py37-maturin ETCDIR=/usr/local/etc/py37-maturin
--End SUB_LIST--

---Begin make.conf---
USE_PACKAGE_DEPENDS=yes
BATCH=yes
WRKDIRPREFIX=/wrkdirs
PORTSDIR=/usr/ports
PACKAGES=/packages
DISTDIR=/distfiles
PACKAGE_BUILDING=yes
PACKAGE_BUILDING_FLAVORS=yes
#### /usr/local/etc/poudriere.d/make.conf ####
# XXX: We really need this but cannot use it while 'make checksum' does not
# try the next mirror on checksum failure.  It currently retries the same
# failed mirror and then fails rather then trying another.  It *does*
# try the next if the size is mismatched though.
#MASTER_SITE_FREEBSD=yes
# Build ALLOW_MAKE_JOBS_PACKAGES with 2 jobs
MAKE_JOBS_NUMBER=2
#### /usr/ports/Mk/Scripts/ports_env.sh ####
_CCVERSION_921dbbb2=cc (GCC) 4.2.1 20070831 patched [FreeBSD] Copyright (C) 2007 Free Software Foundation, Inc. This is free software; see the source for copying conditions. There is NO warranty; not even for MERCHANTABILITY or FITNESS FOR A PARTICULAR PURPOSE.
_ALTCCVERSION_921dbbb2=none
_CXXINTERNAL_acaad9ca=Using built-in specs. Target: powerpc64-undermydesk-freebsd Configured with: FreeBSD/powerpc64 system compiler Thread model: posix gcc version 4.2.1 20070831 patched [FreeBSD] "/usr/bin/ld" "--eh-frame-hdr" "-Qy" "-melf64ppc_fbsd" "--enable-new-dtags" "-dynamic-linker" "/libexec/ld-elf.so.1" "/usr/lib/crt1.o" "/usr/lib/crti.o" "/usr/lib/crtbegin.o" "-L/usr/lib" "-L/usr/lib" "/dev/null" "-lstdc++" "-lm" "-lgcc_s" "-lgcc" "-lc" "-lgcc_s" "-lgcc" "/usr/lib/crtsavres.o" "/usr/lib/crtend.o" "/usr/lib/crtn.o"
CC_OUTPUT_921dbbb2_58173849=yes
CC_OUTPUT_921dbbb2_9bdba57c=yes
CC_OUTPUT_921dbbb2_6a4fe7f5=cc1: error: unrecognized command line option "-std=c11"
CC_OUTPUT_921dbbb2_6bcac02b=yes
CC_OUTPUT_921dbbb2_67d20829=yes
CC_OUTPUT_921dbbb2_bfa62e83=cc1: error: unrecognized command line option "-std=gnu11"
CC_OUTPUT_921dbbb2_f0b4d593=yes
CC_OUTPUT_921dbbb2_308abb44=cc1plus: error: unrecognized command line option "-std=c++0x"
CC_OUTPUT_921dbbb2_f00456e5=cc1plus: error: unrecognized command line option "-std=c++11"
CC_OUTPUT_921dbbb2_65ad290d=cc1plus: error: unrecognized command line option "-std=c++14"
CC_OUTPUT_921dbbb2_f2776b26=cc1plus: error: unrecognized command line option "-std=c++17"
CC_OUTPUT_921dbbb2_b2657cc3=yes
CC_OUTPUT_921dbbb2_380987f7=cc1plus: error: unrecognized command line option "-std=gnu++11"
CC_OUTPUT_921dbbb2_160933ec=cc1plus: error: unrecognized command line option "-std=gnu++14"
CC_OUTPUT_921dbbb2_fb62803b=cc1plus: error: unrecognized command line option "-std=gnu++17"
_OBJC_CCVERSION_921dbbb2=cc (GCC) 4.2.1 20070831 patched [FreeBSD] Copyright (C) 2007 Free Software Foundation, Inc. This is free software; see the source for copying conditions. There is NO warranty; not even for MERCHANTABILITY or FITNESS FOR A PARTICULAR PURPOSE.
_OBJC_ALTCCVERSION_921dbbb2=none
ARCH=powerpc64
PPC_ABI=ELFv1
OPSYS=FreeBSD
_OSRELEASE=12.2-RELEASE
OSREL=12.2
OSVERSION=1202000
PYTHONBASE=/usr/local
CONFIGURE_MAX_CMD_LEN=524288
HAVE_PORTS_ENV=1
#### Misc Poudriere ####
GID=0
UID=0
---End make.conf---
--Resource limits--
cpu time               (seconds, -t)  unlimited
file size           (512-blocks, -f)  unlimited
data seg size           (kbytes, -d)  33554432
stack size              (kbytes, -s)  524288
core file size      (512-blocks, -c)  unlimited
max memory size         (kbytes, -m)  unlimited
locked memory           (kbytes, -l)  unlimited
max user processes              (-u)  89999
open files                      (-n)  1024
virtual mem size        (kbytes, -v)  unlimited
swap limit              (kbytes, -w)  unlimited
socket buffer size       (bytes, -b)  unlimited
pseudo-terminals                (-p)  unlimited
kqueues                         (-k)  unlimited
umtx shared locks               (-o)  unlimited
--End resource limits--
=======================<phase: check-sanity   >============================
===>  License APACHE20 MIT accepted by the user
===========================================================================
=======================<phase: pkg-depends    >============================
===>   py37-maturin-0.8.3_5 depends on file: /usr/local/sbin/pkg - not found
===>   Installing existing package /packages/All/pkg-1.16.3.txz
[122powerpc64-quarterly-job-10] Installing pkg-1.16.3...
[122powerpc64-quarterly-job-10] Extracting pkg-1.16.3: .......... done
===>   py37-maturin-0.8.3_5 depends on file: /usr/local/sbin/pkg - found
===>   Returning to build of py37-maturin-0.8.3_5
===========================================================================
=======================<phase: fetch-depends  >============================
===========================================================================
=======================<phase: fetch          >============================
===>  License APACHE20 MIT accepted by the user
=> rust/crates/aho-corasick-0.7.13.tar.gz doesn't seem to exist in /portdistfiles/.
=> Attempting to fetch https://crates.io/api/v1/crates/aho-corasick/0.7.13/download?dummy=/rust/crates/aho-corasick-0.7.13.tar.gz
rust/crates/aho-corasick-0.7.13.tar.gz                 108 kB   22 MBps    00s
=> rust/crates/ansi_term-0.11.0.tar.gz doesn't seem to exist in /portdistfiles/.
=> Attempting to fetch https://crates.io/api/v1/crates/ansi_term/0.11.0/download?dummy=/rust/crates/ansi_term-0.11.0.tar.gz
rust/crates/ansi_term-0.11.0.tar.gz                     16 kB   18 MBps    00s
=> rust/crates/atty-0.2.14.tar.gz doesn't seem to exist in /portdistfiles/.
=> Attempting to fetch https://crates.io/api/v1/crates/atty/0.2.14/download?dummy=/rust/crates/atty-0.2.14.tar.gz
rust/crates/atty-0.2.14.tar.gz                        5470  B   11 MBps    00s
=> rust/crates/autocfg-1.0.0.tar.gz doesn't seem to exist in /portdistfiles/.
=> Attempting to fetch https://crates.io/api/v1/crates/autocfg/1.0.0/download?dummy=/rust/crates/autocfg-1.0.0.tar.gz
rust/crates/autocfg-1.0.0.tar.gz                        12 kB   38 MBps    00s
=> rust/crates/base64-0.12.3.tar.gz doesn't seem to exist in /portdistfiles/.
=> Attempting to fetch https://crates.io/api/v1/crates/base64/0.12.3/download?dummy=/rust/crates/base64-0.12.3.tar.gz
rust/crates/base64-0.12.3.tar.gz                        56 kB   15 MBps    00s
=> rust/crates/bitflags-1.2.1.tar.gz doesn't seem to exist in /portdistfiles/.
=> Attempting to fetch https://crates.io/api/v1/crates/bitflags/1.2.1/download?dummy=/rust/crates/bitflags-1.2.1.tar.gz
rust/crates/bitflags-1.2.1.tar.gz                       16 kB   17 MBps    00s
=> rust/crates/block-buffer-0.7.3.tar.gz doesn't seem to exist in /portdistfiles/.
=> Attempting to fetch https://crates.io/api/v1/crates/block-buffer/0.7.3/download?dummy=/rust/crates/block-buffer-0.7.3.tar.gz
rust/crates/block-buffer-0.7.3.tar.gz                 7179  B   16 MBps    00s
=> rust/crates/block-padding-0.1.5.tar.gz doesn't seem to exist in /portdistfiles/.
=> Attempting to fetch https://crates.io/api/v1/crates/block-padding/0.1.5/download?dummy=/rust/crates/block-padding-0.1.5.tar.gz
rust/crates/block-padding-0.1.5.tar.gz                7342  B   20 MBps    00s
=> rust/crates/byte-tools-0.3.1.tar.gz doesn't seem to exist in /portdistfiles/.
=> Attempting to fetch https://crates.io/api/v1/crates/byte-tools/0.3.1/download?dummy=/rust/crates/byte-tools-0.3.1.tar.gz
rust/crates/byte-tools-0.3.1.tar.gz                   5526  B   15 MBps    00s
=> rust/crates/byteorder-1.3.4.tar.gz doesn't seem to exist in /portdistfiles/.
=> Attempting to fetch https://crates.io/api/v1/crates/byteorder/1.3.4/download?dummy=/rust/crates/byteorder-1.3.4.tar.gz
rust/crates/byteorder-1.3.4.tar.gz                      21 kB   20 MBps    00s
=> rust/crates/cfg-if-0.1.10.tar.gz doesn't seem to exist in /portdistfiles/.
=> Attempting to fetch https://crates.io/api/v1/crates/cfg-if/0.1.10/download?dummy=/rust/crates/cfg-if-0.1.10.tar.gz
rust/crates/cfg-if-0.1.10.tar.gz                      7933  B   20 MBps    00s
=> rust/crates/clap-2.33.3.tar.gz doesn't seem to exist in /portdistfiles/.
=> Attempting to fetch https://crates.io/api/v1/crates/clap/2.33.3/download?dummy=/rust/crates/clap-2.33.3.tar.gz
rust/crates/clap-2.33.3.tar.gz                         197 kB   34 MBps    00s
=> rust/crates/digest-0.8.1.tar.gz doesn't seem to exist in /portdistfiles/.
=> Attempting to fetch https://crates.io/api/v1/crates/digest/0.8.1/download?dummy=/rust/crates/digest-0.8.1.tar.gz
rust/crates/digest-0.8.1.tar.gz                       9449  B   28 MBps    00s
=> rust/crates/generic-array-0.12.3.tar.gz doesn't seem to exist in /portdistfiles/.
=> Attempting to fetch https://crates.io/api/v1/crates/generic-array/0.12.3/download?dummy=/rust/crates/generic-array-0.12.3.tar.gz
rust/crates/generic-array-0.12.3.tar.gz                 17 kB   20 MBps    00s
<snip>
   Compiling thread_local v1.0.1
     Running `/usr/local/bin/rustc --crate-name thread_local /wrkdirs/usr/ports/devel/py-maturin/work-py37/maturin-0.8.3/cargo-crates/thread_local-1.0.1/src/lib.rs --error-format=json --json=diagnostic-rendered-ansi,artifacts --crate-type lib --emit=dep-info,metadata,link -C opt-level=2 -C embed-bitcode=no -C metadata=492abf682707c0cc -C extra-filename=-492abf682707c0cc --out-dir /wrkdirs/usr/ports/devel/py-maturin/work-py37/maturin-0.8.3/target/release/deps -L dependency=/wrkdirs/usr/ports/devel/py-maturin/work-py37/maturin-0.8.3/target/release/deps --extern lazy_static=/wrkdirs/usr/ports/devel/py-maturin/work-py37/maturin-0.8.3/target/release/deps/liblazy_static-988da8583efe2320.rmeta --cap-lints allow -C linker=gcc10 -C link-arg=-fstack-protector-strong -C link-arg=-Wl,-rpath=/usr/local/lib/gcc10 -C link-arg=-L/usr/local/lib/gcc10`
   Compiling tracing-core v0.1.14
     Running `/usr/local/bin/rustc --crate-name tracing_core --edition=2018 /wrkdirs/usr/ports/devel/py-maturin/work-py37/maturin-0.8.3/cargo-crates/tracing-core-0.1.14/src/lib.rs --error-format=json --json=diagnostic-rendered-ansi,artifacts --crate-type lib --emit=dep-info,metadata,link -C opt-level=2 -C embed-bitcode=no --cfg 'feature="lazy_static"' --cfg 'feature="std"' -C metadata=61cbcf053ee50a5d -C extra-filename=-61cbcf053ee50a5d --out-dir /wrkdirs/usr/ports/devel/py-maturin/work-py37/maturin-0.8.3/target/release/deps -L dependency=/wrkdirs/usr/ports/devel/py-maturin/work-py37/maturin-0.8.3/target/release/deps --extern lazy_static=/wrkdirs/usr/ports/devel/py-maturin/work-py37/maturin-0.8.3/target/release/deps/liblazy_static-988da8583efe2320.rmeta --cap-lints allow -C linker=gcc10 -C link-arg=-fstack-protector-strong -C link-arg=-Wl,-rpath=/usr/local/lib/gcc10 -C link-arg=-L/usr/local/lib/gcc10`
     Running `/wrkdirs/usr/ports/devel/py-maturin/work-py37/maturin-0.8.3/target/release/build/memchr-a2c899a43fdaec5e/build-script-build`
   Compiling futures-task v0.3.5
     Running `/usr/local/bin/rustc --crate-name futures_task --edition=2018 /wrkdirs/usr/ports/devel/py-maturin/work-py37/maturin-0.8.3/cargo-crates/futures-task-0.3.5/src/lib.rs --error-format=json --json=diagnostic-rendered-ansi,artifacts --crate-type lib --emit=dep-info,metadata,link -C opt-level=2 -C embed-bitcode=no --cfg 'feature="alloc"' --cfg 'feature="once_cell"' --cfg 'feature="std"' -C metadata=7dbbf72148010457 -C extra-filename=-7dbbf72148010457 --out-dir /wrkdirs/usr/ports/devel/py-maturin/work-py37/maturin-0.8.3/target/release/deps -L dependency=/wrkdirs/usr/ports/devel/py-maturin/work-py37/maturin-0.8.3/target/release/deps --extern once_cell=/wrkdirs/usr/ports/devel/py-maturin/work-py37/maturin-0.8.3/target/release/deps/libonce_cell-e18a6dc414385362.rmeta --cap-lints allow -C linker=gcc10 -C link-arg=-fstack-protector-strong -C link-arg=-Wl,-rpath=/usr/local/lib/gcc10 -C link-arg=-L/usr/local/lib/gcc10`
     Running `/wrkdirs/usr/ports/devel/py-maturin/work-py37/maturin-0.8.3/target/release/build/serde_derive-38719d58008b1fa5/build-script-build`
   Compiling ring v0.16.15
     Running `/usr/local/bin/rustc --crate-name build_script_build --edition=2018 /wrkdirs/usr/ports/devel/py-maturin/work-py37/maturin-0.8.3/cargo-crates/ring-0.16.15/build.rs --error-format=json --json=diagnostic-rendered-ansi --crate-type bin --emit=dep-info,link -C embed-bitcode=no -C debug-assertions=off --cfg 'feature="alloc"' --cfg 'feature="default"' --cfg 'feature="dev_urandom_fallback"' --cfg 'feature="once_cell"' -C metadata=3837192992426037 -C extra-filename=-3837192992426037 --out-dir /wrkdirs/usr/ports/devel/py-maturin/work-py37/maturin-0.8.3/target/release/build/ring-3837192992426037 -L dependency=/wrkdirs/usr/ports/devel/py-maturin/work-py37/maturin-0.8.3/target/release/deps --extern cc=/wrkdirs/usr/ports/devel/py-maturin/work-py37/maturin-0.8.3/target/release/deps/libcc-e00eb490ca615d62.rlib --cap-lints allow -C linker=gcc10 -C link-arg=-fstack-protector-strong -C link-arg=-Wl,-rpath=/usr/local/lib/gcc10 -C link-arg=-L/usr/local/lib/gcc10`
   Compiling hashbrown v0.8.2
     Running `/usr/local/bin/rustc --crate-name build_script_build --edition=2018 /wrkdirs/usr/ports/devel/py-maturin/work-py37/maturin-0.8.3/cargo-crates/hashbrown-0.8.2/build.rs --error-format=json --json=diagnostic-rendered-ansi --crate-type bin --emit=dep-info,link -C embed-bitcode=no -C debug-assertions=off --cfg 'feature="raw"' -C metadata=f1733525ee1f7512 -C extra-filename=-f1733525ee1f7512 --out-dir /wrkdirs/usr/ports/devel/py-maturin/work-py37/maturin-0.8.3/target/release/build/hashbrown-f1733525ee1f7512 -L dependency=/wrkdirs/usr/ports/devel/py-maturin/work-py37/maturin-0.8.3/target/release/deps --extern autocfg=/wrkdirs/usr/ports/devel/py-maturin/work-py37/maturin-0.8.3/target/release/deps/libautocfg-44397494fc11a5f1.rlib --cap-lints allow -C linker=gcc10 -C link-arg=-fstack-protector-strong -C link-arg=-Wl,-rpath=/usr/local/lib/gcc10 -C link-arg=-L/usr/local/lib/gcc10`
   Compiling indexmap v1.5.1
     Running `/usr/local/bin/rustc --crate-name build_script_build --edition=2018 /wrkdirs/usr/ports/devel/py-maturin/work-py37/maturin-0.8.3/cargo-crates/indexmap-1.5.1/build.rs --error-format=json --json=diagnostic-rendered-ansi --crate-type bin --emit=dep-info,link -C embed-bitcode=no -C debug-assertions=off -C metadata=9af967ceb804e549 -C extra-filename=-9af967ceb804e549 --out-dir /wrkdirs/usr/ports/devel/py-maturin/work-py37/maturin-0.8.3/target/release/build/indexmap-9af967ceb804e549 -L dependency=/wrkdirs/usr/ports/devel/py-maturin/work-py37/maturin-0.8.3/target/release/deps --extern autocfg=/wrkdirs/usr/ports/devel/py-maturin/work-py37/maturin-0.8.3/target/release/deps/libautocfg-44397494fc11a5f1.rlib --cap-lints allow -C linker=gcc10 -C link-arg=-fstack-protector-strong -C link-arg=-Wl,-rpath=/usr/local/lib/gcc10 -C link-arg=-L/usr/local/lib/gcc10`
   Compiling futures-channel v0.3.5
     Running `/usr/local/bin/rustc --crate-name futures_channel --edition=2018 /wrkdirs/usr/ports/devel/py-maturin/work-py37/maturin-0.8.3/cargo-crates/futures-channel-0.3.5/src/lib.rs --error-format=json --json=diagnostic-rendered-ansi,artifacts --crate-type lib --emit=dep-info,metadata,link -C opt-level=2 -C embed-bitcode=no --cfg 'feature="alloc"' --cfg 'feature="default"' --cfg 'feature="std"' -C metadata=96e8c4c6af03b802 -C extra-filename=-96e8c4c6af03b802 --out-dir /wrkdirs/usr/ports/devel/py-maturin/work-py37/maturin-0.8.3/target/release/deps -L dependency=/wrkdirs/usr/ports/devel/py-maturin/work-py37/maturin-0.8.3/target/release/deps --extern futures_core=/wrkdirs/usr/ports/devel/py-maturin/work-py37/maturin-0.8.3/target/release/deps/libfutures_core-2b71a6dcec365b02.rmeta --cap-lints allow -C linker=gcc10 -C link-arg=-fstack-protector-strong -C link-arg=-Wl,-rpath=/usr/local/lib/gcc10 -C link-arg=-L/usr/local/lib/gcc10`
     Running `/wrkdirs/usr/ports/devel/py-maturin/work-py37/maturin-0.8.3/target/release/build/serde-feda4992a5ef0c07/build-script-build`
     Running `/wrkdirs/usr/ports/devel/py-maturin/work-py37/maturin-0.8.3/target/release/build/getrandom-04f0dd227f9701bb/build-script-build`
   Compiling http v0.2.1
     Running `/usr/local/bin/rustc --crate-name http --edition=2018 /wrkdirs/usr/ports/devel/py-maturin/work-py37/maturin-0.8.3/cargo-crates/http-0.2.1/src/lib.rs --error-format=json --json=diagnostic-rendered-ansi,artifacts --crate-type lib --emit=dep-info,metadata,link -C opt-level=2 -C embed-bitcode=no -C metadata=23240e7acfc0c3de -C extra-filename=-23240e7acfc0c3de --out-dir /wrkdirs/usr/ports/devel/py-maturin/work-py37/maturin-0.8.3/target/release/deps -L dependency=/wrkdirs/usr/ports/devel/py-maturin/work-py37/maturin-0.8.3/target/release/deps --extern bytes=/wrkdirs/usr/ports/devel/py-maturin/work-py37/maturin-0.8.3/target/release/deps/libbytes-f799759bebb0f497.rmeta --extern fnv=/wrkdirs/usr/ports/devel/py-maturin/work-py37/maturin-0.8.3/target/release/deps/libfnv-231c2a46d48000be.rmeta --extern itoa=/wrkdirs/usr/ports/devel/py-maturin/work-py37/maturin-0.8.3/target/release/deps/libitoa-be8feac1855b9f52.rmeta --cap-lints allow -C linker=gcc10 -C link-arg=-fstack-protector-str
 ong -C link-arg=-Wl,-rpath=/usr/local/lib/gcc10 -C link-arg=-L/usr/local/lib/gcc10`
     Running `/wrkdirs/usr/ports/devel/py-maturin/work-py37/maturin-0.8.3/target/release/build/pin-project-internal-9ee7c84d90c1fd56/build-script-build`
     Running `/wrkdirs/usr/ports/devel/py-maturin/work-py37/maturin-0.8.3/target/release/build/proc-macro-nested-391c78d01d1ae902/build-script-build`
     Running `/wrkdirs/usr/ports/devel/py-maturin/work-py37/maturin-0.8.3/target/release/build/typenum-a9e9e258453b4038/build-script-main`
   Compiling unicode-bidi v0.3.4
     Running `/usr/local/bin/rustc --crate-name unicode_bidi /wrkdirs/usr/ports/devel/py-maturin/work-py37/maturin-0.8.3/cargo-crates/unicode-bidi-0.3.4/src/lib.rs --error-format=json --json=diagnostic-rendered-ansi,artifacts --crate-type lib --emit=dep-info,metadata,link -C opt-level=2 -C embed-bitcode=no --cfg 'feature="default"' -C metadata=2fb484afb8ba20c7 -C extra-filename=-2fb484afb8ba20c7 --out-dir /wrkdirs/usr/ports/devel/py-maturin/work-py37/maturin-0.8.3/target/release/deps -L dependency=/wrkdirs/usr/ports/devel/py-maturin/work-py37/maturin-0.8.3/target/release/deps --extern matches=/wrkdirs/usr/ports/devel/py-maturin/work-py37/maturin-0.8.3/target/release/deps/libmatches-c108e3a5f5a5df03.rmeta --cap-lints allow -C linker=gcc10 -C link-arg=-fstack-protector-strong -C link-arg=-Wl,-rpath=/usr/local/lib/gcc10 -C link-arg=-L/usr/local/lib/gcc10`
     Running `/wrkdirs/usr/ports/devel/py-maturin/work-py37/maturin-0.8.3/target/release/build/ryu-79baab849e17d79c/build-script-build`
     Running `/wrkdirs/usr/ports/devel/py-maturin/work-py37/maturin-0.8.3/target/release/build/httparse-27a44764993d2c3e/build-script-build`
   Compiling unicode-normalization v0.1.13
     Running `/usr/local/bin/rustc --crate-name unicode_normalization --edition=2018 /wrkdirs/usr/ports/devel/py-maturin/work-py37/maturin-0.8.3/cargo-crates/unicode-normalization-0.1.13/src/lib.rs --error-format=json --json=diagnostic-rendered-ansi,artifacts --crate-type lib --emit=dep-info,metadata,link -C opt-level=2 -C embed-bitcode=no --cfg 'feature="default"' --cfg 'feature="std"' -C metadata=2e3cc878a5f31ae0 -C extra-filename=-2e3cc878a5f31ae0 --out-dir /wrkdirs/usr/ports/devel/py-maturin/work-py37/maturin-0.8.3/target/release/deps -L dependency=/wrkdirs/usr/ports/devel/py-maturin/work-py37/maturin-0.8.3/target/release/deps --extern tinyvec=/wrkdirs/usr/ports/devel/py-maturin/work-py37/maturin-0.8.3/target/release/deps/libtinyvec-16654c82491cbe45.rmeta --cap-lints allow -C linker=gcc10 -C link-arg=-fstack-protector-strong -C link-arg=-Wl,-rpath=/usr/local/lib/gcc10 -C link-arg=-L/usr/local/lib/gcc10`
   Compiling miniz_oxide v0.4.0
     Running `/usr/local/bin/rustc --crate-name miniz_oxide --edition=2018 /wrkdirs/usr/ports/devel/py-maturin/work-py37/maturin-0.8.3/cargo-crates/miniz_oxide-0.4.0/src/lib.rs --error-format=json --json=diagnostic-rendered-ansi,artifacts --crate-type lib --emit=dep-info,metadata,link -C opt-level=2 -C embed-bitcode=no -C metadata=1d92455dc82f0a5b -C extra-filename=-1d92455dc82f0a5b --out-dir /wrkdirs/usr/ports/devel/py-maturin/work-py37/maturin-0.8.3/target/release/deps -L dependency=/wrkdirs/usr/ports/devel/py-maturin/work-py37/maturin-0.8.3/target/release/deps --extern adler=/wrkdirs/usr/ports/devel/py-maturin/work-py37/maturin-0.8.3/target/release/deps/libadler-3298f9bc7c681bf4.rmeta --cap-lints allow -C linker=gcc10 -C link-arg=-fstack-protector-strong -C link-arg=-Wl,-rpath=/usr/local/lib/gcc10 -C link-arg=-L/usr/local/lib/gcc10`
   Compiling bzip2-sys v0.1.9+1.0.8
     Running `/usr/local/bin/rustc --crate-name build_script_build /wrkdirs/usr/ports/devel/py-maturin/work-py37/maturin-0.8.3/cargo-crates/bzip2-sys-0.1.9+1.0.8/build.rs --error-format=json --json=diagnostic-rendered-ansi --crate-type bin --emit=dep-info,link -C embed-bitcode=no -C debug-assertions=off -C metadata=d2d96199b5ea244c -C extra-filename=-d2d96199b5ea244c --out-dir /wrkdirs/usr/ports/devel/py-maturin/work-py37/maturin-0.8.3/target/release/build/bzip2-sys-d2d96199b5ea244c -L dependency=/wrkdirs/usr/ports/devel/py-maturin/work-py37/maturin-0.8.3/target/release/deps --extern cc=/wrkdirs/usr/ports/devel/py-maturin/work-py37/maturin-0.8.3/target/release/deps/libcc-e00eb490ca615d62.rlib --extern pkg_config=/wrkdirs/usr/ports/devel/py-maturin/work-py37/maturin-0.8.3/target/release/deps/libpkg_config-13f41fd5d482ae22.rlib --cap-lints allow -C linker=gcc10 -C link-arg=-fstack-protector-strong -C link-arg=-Wl,-rpath=/usr/local/lib/gcc10 -C link-arg=-L/usr/local/lib/gcc10`
     Running `/wrkdirs/usr/ports/devel/py-maturin/work-py37/maturin-0.8.3/target/release/build/crc32fast-d39a5e86831db889/build-script-build`
     Running `/wrkdirs/usr/ports/devel/py-maturin/work-py37/maturin-0.8.3/target/release/build/serde_json-0151d1100688c32e/build-script-build`
     Running `/wrkdirs/usr/ports/devel/py-maturin/work-py37/maturin-0.8.3/target/release/build/bitflags-03e63c28b01762f5/build-script-build`
   Compiling addr2line v0.13.0
     Running `/usr/local/bin/rustc --crate-name addr2line /wrkdirs/usr/ports/devel/py-maturin/work-py37/maturin-0.8.3/cargo-crates/addr2line-0.13.0/src/lib.rs --error-format=json --json=diagnostic-rendered-ansi,artifacts --crate-type lib --emit=dep-info,metadata,link -C opt-level=2 -C embed-bitcode=no -C metadata=e3b2ba99905b2f10 -C extra-filename=-e3b2ba99905b2f10 --out-dir /wrkdirs/usr/ports/devel/py-maturin/work-py37/maturin-0.8.3/target/release/deps -L dependency=/wrkdirs/usr/ports/devel/py-maturin/work-py37/maturin-0.8.3/target/release/deps --extern gimli=/wrkdirs/usr/ports/devel/py-maturin/work-py37/maturin-0.8.3/target/release/deps/libgimli-aa88a2ad829f72cf.rmeta --cap-lints allow -C linker=gcc10 -C link-arg=-fstack-protector-strong -C link-arg=-Wl,-rpath=/usr/local/lib/gcc10 -C link-arg=-L/usr/local/lib/gcc10`
     Running `/wrkdirs/usr/ports/devel/py-maturin/work-py37/maturin-0.8.3/target/release/build/encoding_rs-5cc28803651edd03/build-script-build`
   Compiling heck v0.3.1
     Running `/usr/local/bin/rustc --crate-name heck /wrkdirs/usr/ports/devel/py-maturin/work-py37/maturin-0.8.3/cargo-crates/heck-0.3.1/src/lib.rs --error-format=json --json=diagnostic-rendered-ansi --crate-type lib --emit=dep-info,metadata,link -C embed-bitcode=no -C debug-assertions=off -C metadata=3e0fb3090a81aee7 -C extra-filename=-3e0fb3090a81aee7 --out-dir /wrkdirs/usr/ports/devel/py-maturin/work-py37/maturin-0.8.3/target/release/deps -L dependency=/wrkdirs/usr/ports/devel/py-maturin/work-py37/maturin-0.8.3/target/release/deps --extern unicode_segmentation=/wrkdirs/usr/ports/devel/py-maturin/work-py37/maturin-0.8.3/target/release/deps/libunicode_segmentation-fbb7d7b85c360a12.rmeta --cap-lints allow -C linker=gcc10 -C link-arg=-fstack-protector-strong -C link-arg=-Wl,-rpath=/usr/local/lib/gcc10 -C link-arg=-L/usr/local/lib/gcc10`
   Compiling textwrap v0.11.0
     Running `/usr/local/bin/rustc --crate-name textwrap /wrkdirs/usr/ports/devel/py-maturin/work-py37/maturin-0.8.3/cargo-crates/textwrap-0.11.0/src/lib.rs --error-format=json --json=diagnostic-rendered-ansi,artifacts --crate-type lib --emit=dep-info,metadata,link -C opt-level=2 -C embed-bitcode=no -C metadata=01b53329bb1fd6f6 -C extra-filename=-01b53329bb1fd6f6 --out-dir /wrkdirs/usr/ports/devel/py-maturin/work-py37/maturin-0.8.3/target/release/deps -L dependency=/wrkdirs/usr/ports/devel/py-maturin/work-py37/maturin-0.8.3/target/release/deps --extern unicode_width=/wrkdirs/usr/ports/devel/py-maturin/work-py37/maturin-0.8.3/target/release/deps/libunicode_width-a8e04e40e4beef85.rmeta --cap-lints allow -C linker=gcc10 -C link-arg=-fstack-protector-strong -C link-arg=-Wl,-rpath=/usr/local/lib/gcc10 -C link-arg=-L/usr/local/lib/gcc10`
   Compiling humantime v1.3.0
     Running `/usr/local/bin/rustc --crate-name humantime /wrkdirs/usr/ports/devel/py-maturin/work-py37/maturin-0.8.3/cargo-crates/humantime-1.3.0/src/lib.rs --error-format=json --json=diagnostic-rendered-ansi,artifacts --crate-type lib --emit=dep-info,metadata,link -C opt-level=2 -C embed-bitcode=no -C metadata=748394088a1c21be -C extra-filename=-748394088a1c21be --out-dir /wrkdirs/usr/ports/devel/py-maturin/work-py37/maturin-0.8.3/target/release/deps -L dependency=/wrkdirs/usr/ports/devel/py-maturin/work-py37/maturin-0.8.3/target/release/deps --extern quick_error=/wrkdirs/usr/ports/devel/py-maturin/work-py37/maturin-0.8.3/target/release/deps/libquick_error-20c2035d0ed76e94.rmeta --cap-lints allow -C linker=gcc10 -C link-arg=-fstack-protector-strong -C link-arg=-Wl,-rpath=/usr/local/lib/gcc10 -C link-arg=-L/usr/local/lib/gcc10`
     Running `/wrkdirs/usr/ports/devel/py-maturin/work-py37/maturin-0.8.3/target/release/build/winapi-e447e7621254c845/build-script-build`
     Running `/wrkdirs/usr/ports/devel/py-maturin/work-py37/maturin-0.8.3/target/release/build/anyhow-327f824e3813af8e/build-script-build`
     Running `/wrkdirs/usr/ports/devel/py-maturin/work-py37/maturin-0.8.3/target/release/build/cbindgen-a48ed56a8090adb7/build-script-build`
     Running `/usr/local/bin/rustc --crate-name heck /wrkdirs/usr/ports/devel/py-maturin/work-py37/maturin-0.8.3/cargo-crates/heck-0.3.1/src/lib.rs --error-format=json --json=diagnostic-rendered-ansi,artifacts --crate-type lib --emit=dep-info,metadata,link -C opt-level=2 -C embed-bitcode=no -C metadata=3457ad10f405545d -C extra-filename=-3457ad10f405545d --out-dir /wrkdirs/usr/ports/devel/py-maturin/work-py37/maturin-0.8.3/target/release/deps -L dependency=/wrkdirs/usr/ports/devel/py-maturin/work-py37/maturin-0.8.3/target/release/deps --extern unicode_segmentation=/wrkdirs/usr/ports/devel/py-maturin/work-py37/maturin-0.8.3/target/release/deps/libunicode_segmentation-f55bce7750ae1457.rmeta --cap-lints allow -C linker=gcc10 -C link-arg=-fstack-protector-strong -C link-arg=-Wl,-rpath=/usr/local/lib/gcc10 -C link-arg=-L/usr/local/lib/gcc10`
   Compiling walkdir v2.3.1
     Running `/usr/local/bin/rustc --crate-name walkdir --edition=2018 /wrkdirs/usr/ports/devel/py-maturin/work-py37/maturin-0.8.3/cargo-crates/walkdir-2.3.1/src/lib.rs --error-format=json --json=diagnostic-rendered-ansi,artifacts --crate-type lib --emit=dep-info,metadata,link -C opt-level=2 -C embed-bitcode=no -C metadata=49f16b7353830027 -C extra-filename=-49f16b7353830027 --out-dir /wrkdirs/usr/ports/devel/py-maturin/work-py37/maturin-0.8.3/target/release/deps -L dependency=/wrkdirs/usr/ports/devel/py-maturin/work-py37/maturin-0.8.3/target/release/deps --extern same_file=/wrkdirs/usr/ports/devel/py-maturin/work-py37/maturin-0.8.3/target/release/deps/libsame_file-7f4699e2318babb7.rmeta --cap-lints allow -C linker=gcc10 -C link-arg=-fstack-protector-strong -C link-arg=-Wl,-rpath=/usr/local/lib/gcc10 -C link-arg=-L/usr/local/lib/gcc10`
     Running `/usr/local/bin/rustc --crate-name libc /wrkdirs/usr/ports/devel/py-maturin/work-py37/maturin-0.8.3/cargo-crates/libc-0.2.74/src/lib.rs --error-format=json --json=diagnostic-rendered-ansi,artifacts --crate-type lib --emit=dep-info,metadata,link -C opt-level=2 -C embed-bitcode=no --cfg 'feature="default"' --cfg 'feature="std"' -C metadata=17ced0a6d351ecca -C extra-filename=-17ced0a6d351ecca --out-dir /wrkdirs/usr/ports/devel/py-maturin/work-py37/maturin-0.8.3/target/release/deps -L dependency=/wrkdirs/usr/ports/devel/py-maturin/work-py37/maturin-0.8.3/target/release/deps --cap-lints allow -C linker=gcc10 -C link-arg=-fstack-protector-strong -C link-arg=-Wl,-rpath=/usr/local/lib/gcc10 -C link-arg=-L/usr/local/lib/gcc10 --cfg freebsd11 --cfg libc_priv_mod_use --cfg libc_union --cfg libc_const_size_of --cfg libc_align --cfg libc_core_cvoid --cfg libc_packedN`
     Running `/usr/local/bin/rustc --crate-name proc_macro2 --edition=2018 /wrkdirs/usr/ports/devel/py-maturin/work-py37/maturin-0.8.3/cargo-crates/proc-macro2-1.0.19/src/lib.rs --error-format=json --json=diagnostic-rendered-ansi,artifacts --crate-type lib --emit=dep-info,metadata,link -C embed-bitcode=no -C debug-assertions=off --cfg 'feature="default"' --cfg 'feature="proc-macro"' -C metadata=7aa1e1bb483f4b96 -C extra-filename=-7aa1e1bb483f4b96 --out-dir /wrkdirs/usr/ports/devel/py-maturin/work-py37/maturin-0.8.3/target/release/deps -L dependency=/wrkdirs/usr/ports/devel/py-maturin/work-py37/maturin-0.8.3/target/release/deps --extern unicode_xid=/wrkdirs/usr/ports/devel/py-maturin/work-py37/maturin-0.8.3/target/release/deps/libunicode_xid-e848b99053834b9d.rmeta --cap-lints allow -C linker=gcc10 -C link-arg=-fstack-protector-strong -C link-arg=-Wl,-rpath=/usr/local/lib/gcc10 -C link-arg=-L/usr/local/lib/gcc10 --cfg hygiene --cfg use_proc_macro --cfg wrap_proc_macro`
     Running `/usr/local/bin/rustc --crate-name proc_macro2 --edition=2018 /wrkdirs/usr/ports/devel/py-maturin/work-py37/maturin-0.8.3/cargo-crates/proc-macro2-1.0.19/src/lib.rs --error-format=json --json=diagnostic-rendered-ansi,artifacts --crate-type lib --emit=dep-info,metadata,link -C opt-level=2 -C embed-bitcode=no --cfg 'feature="default"' --cfg 'feature="proc-macro"' -C metadata=86672de933ee37b9 -C extra-filename=-86672de933ee37b9 --out-dir /wrkdirs/usr/ports/devel/py-maturin/work-py37/maturin-0.8.3/target/release/deps -L dependency=/wrkdirs/usr/ports/devel/py-maturin/work-py37/maturin-0.8.3/target/release/deps --extern unicode_xid=/wrkdirs/usr/ports/devel/py-maturin/work-py37/maturin-0.8.3/target/release/deps/libunicode_xid-e0cfdc9c62ad048a.rmeta --cap-lints allow -C linker=gcc10 -C link-arg=-fstack-protector-strong -C link-arg=-Wl,-rpath=/usr/local/lib/gcc10 -C link-arg=-L/usr/local/lib/gcc10 --cfg hygiene --cfg use_proc_macro --cfg wrap_proc_macro`
     Running `/usr/local/bin/rustc --crate-name log /wrkdirs/usr/ports/devel/py-maturin/work-py37/maturin-0.8.3/cargo-crates/log-0.4.11/src/lib.rs --error-format=json --json=diagnostic-rendered-ansi,artifacts --crate-type lib --emit=dep-info,metadata,link -C opt-level=2 -C embed-bitcode=no --cfg 'feature="std"' -C metadata=a8a4c0d745dd3720 -C extra-filename=-a8a4c0d745dd3720 --out-dir /wrkdirs/usr/ports/devel/py-maturin/work-py37/maturin-0.8.3/target/release/deps -L dependency=/wrkdirs/usr/ports/devel/py-maturin/work-py37/maturin-0.8.3/target/release/deps --extern cfg_if=/wrkdirs/usr/ports/devel/py-maturin/work-py37/maturin-0.8.3/target/release/deps/libcfg_if-d4a23a921bb05e06.rmeta --cap-lints allow -C linker=gcc10 -C link-arg=-fstack-protector-strong -C link-arg=-Wl,-rpath=/usr/local/lib/gcc10 -C link-arg=-L/usr/local/lib/gcc10 --cfg atomic_cas`
     Running `/wrkdirs/usr/ports/devel/py-maturin/work-py37/maturin-0.8.3/target/release/build/unicase-da6a076b1e729f66/build-script-build`
     Running `/wrkdirs/usr/ports/devel/py-maturin/work-py37/maturin-0.8.3/target/release/build/unicase-da6a076b1e729f66/build-script-build`
     Running `/wrkdirs/usr/ports/devel/py-maturin/work-py37/maturin-0.8.3/target/release/build/proc-macro-error-attr-c963fc72c05533f8/build-script-build`
     Running `/wrkdirs/usr/ports/devel/py-maturin/work-py37/maturin-0.8.3/target/release/build/generic-array-19f88895c6a5d8ad/build-script-build`
     Running `/wrkdirs/usr/ports/devel/py-maturin/work-py37/maturin-0.8.3/target/release/build/proc-macro-error-81747c748ea9fa55/build-script-build`
     Running `/usr/local/bin/rustc --crate-name memchr /wrkdirs/usr/ports/devel/py-maturin/work-py37/maturin-0.8.3/cargo-crates/memchr-2.3.3/src/lib.rs --error-format=json --json=diagnostic-rendered-ansi,artifacts --crate-type lib --emit=dep-info,metadata,link -C opt-level=2 -C embed-bitcode=no --cfg 'feature="default"' --cfg 'feature="std"' --cfg 'feature="use_std"' -C metadata=67c46519f9f547ae -C extra-filename=-67c46519f9f547ae --out-dir /wrkdirs/usr/ports/devel/py-maturin/work-py37/maturin-0.8.3/target/release/deps -L dependency=/wrkdirs/usr/ports/devel/py-maturin/work-py37/maturin-0.8.3/target/release/deps --cap-lints allow -C linker=gcc10 -C link-arg=-fstack-protector-strong -C link-arg=-Wl,-rpath=/usr/local/lib/gcc10 -C link-arg=-L/usr/local/lib/gcc10 --cfg memchr_runtime_simd --cfg memchr_runtime_sse2 --cfg memchr_runtime_sse42 --cfg memchr_runtime_avx`
     Running `/wrkdirs/usr/ports/devel/py-maturin/work-py37/maturin-0.8.3/target/release/build/hashbrown-f1733525ee1f7512/build-script-build`
     Running `/wrkdirs/usr/ports/devel/py-maturin/work-py37/maturin-0.8.3/target/release/build/ring-3837192992426037/build-script-build`
error: failed to run custom build command for `ring v0.16.15`

Caused by:
  process didn't exit successfully: `/wrkdirs/usr/ports/devel/py-maturin/work-py37/maturin-0.8.3/target/release/build/ring-3837192992426037/build-script-build` (exit code: 101)
  --- stderr
  ENV .MAKE.LEVEL.ENV=MAKELEVEL
  ENV ADDR2LINE=/usr/local/bin/addr2line
  ENV AR=/usr/local/bin/ar
  ENV ARCH=powerpc64
  ENV AS=/usr/local/bin/as
  ENV BLOCKSIZE=K
  ENV BSD_INSTALL_DATA=install  -m 0644
  ENV BSD_INSTALL_LIB=install  -s -m 0644
  ENV BSD_INSTALL_MAN=install  -m 444
  ENV BSD_INSTALL_PROGRAM=install  -s -m 555
  ENV BSD_INSTALL_SCRIPT=install  -m 555
  ENV CARGO=/usr/local/bin/cargo
  ENV CARGO_BUILD_JOBS=2
  ENV CARGO_CFG_TARGET_ARCH=powerpc64
  ENV CARGO_CFG_TARGET_ENDIAN=big
  ENV CARGO_CFG_TARGET_ENV=
  ENV CARGO_CFG_TARGET_FAMILY=unix
  ENV CARGO_CFG_TARGET_OS=freebsd
  ENV CARGO_CFG_TARGET_POINTER_WIDTH=64
  ENV CARGO_CFG_TARGET_VENDOR=unknown
  ENV CARGO_CFG_UNIX=
  ENV CARGO_FEATURE_ALLOC=1
  ENV CARGO_FEATURE_DEFAULT=1
  ENV CARGO_FEATURE_DEV_URANDOM_FALLBACK=1
  ENV CARGO_FEATURE_ONCE_CELL=1
  ENV CARGO_HOME=/wrkdirs/usr/ports/devel/py-maturin/work-py37/cargo-home
  ENV CARGO_MAKEFLAGS=--jobserver-fds=9,10 -j --jobserver-auth=9,10 -j
  ENV CARGO_MANIFEST_DIR=/wrkdirs/usr/ports/devel/py-maturin/work-py37/maturin-0.8.3/cargo-crates/ring-0.16.15
  ENV CARGO_MANIFEST_LINKS=ring-asm
  ENV CARGO_PKG_AUTHORS=Brian Smith <brian_at_briansmith.org>
  ENV CARGO_PKG_DESCRIPTION=Safe, fast, small crypto using Rust.
  ENV CARGO_PKG_HOMEPAGE=
  ENV CARGO_PKG_LICENSE=
  ENV CARGO_PKG_LICENSE_FILE=LICENSE
  ENV CARGO_PKG_NAME=ring
  ENV CARGO_PKG_REPOSITORY=https://github.com/briansmith/ring
  ENV CARGO_PKG_VERSION=0.16.15
  ENV CARGO_PKG_VERSION_MAJOR=0
  ENV CARGO_PKG_VERSION_MINOR=16
  ENV CARGO_PKG_VERSION_PATCH=15
  ENV CARGO_PKG_VERSION_PRE=
  ENV CARGO_TARGET_DIR=/wrkdirs/usr/ports/devel/py-maturin/work-py37/maturin-0.8.3/target
  ENV CC=gcc10
  ENV CFLAGS=-O2 -pipe  -fstack-protector-strong -Wl,-rpath=/usr/local/lib/gcc10 -fno-strict-aliasing 
  ENV CPP=cpp10
  ENV CPPFILT=/usr/local/bin/c++filt
  ENV CPPFLAGS=
  ENV CXX=g++10
  ENV CXXFLAGS=-O2 -pipe  -fstack-protector-strong -Wl,-rpath=/usr/local/lib/gcc10  -Wl,-rpath=/usr/local/lib/gcc10 
  ENV DEBUG=false
  ENV FLAVOR=py37
  ENV GID=0
  ENV GPROF=/usr/local/bin/gprof
  ENV HOME=/wrkdirs/usr/ports/devel/py-maturin/work-py37
  ENV HOST=powerpc64-unknown-freebsd
  ENV LANG=C
  ENV LC_ALL=C
  ENV LD=/usr/local/bin/ld
  ENV LDFLAGS= -fstack-protector-strong -Wl,-rpath=/usr/local/lib/gcc10 -L/usr/local/lib/gcc10 
  ENV LDSHARED=gcc10 -shared
  ENV LD_LIBRARY_PATH=/wrkdirs/usr/ports/devel/py-maturin/work-py37/maturin-0.8.3/target/release/deps:/wrkdirs/usr/ports/devel/py-maturin/work-py37/maturin-0.8.3/target/release:/usr/local/lib/rustlib/powerpc64-unknown-freebsd/lib
  ENV LIBEXECPREFIX=/usr/local/libexec/poudriere
  ENV LIBS=
  ENV LOCALBASE=/usr/local
  ENV MAIL=/var/mail/root
  ENV MAKEFLAGS= .MAKE.LEVEL.ENV=MAKELEVEL ARCH=powerpc64 OPSYS=FreeBSD OSREL=12.2 OSVERSION=1202000 PPC_ABI=ELFv1 PYTHONBASE=/usr/local _OSRELEASE=12.2-RELEASE
  ENV MAKELEVEL=1
  ENV MANPREFIX=/usr/local
  ENV MASTERMNT=/usr/local/poudriere/data/.m/122powerpc64-quarterly/ref
  ENV MASTERNAME=122powerpc64-quarterly
  ENV META_MODE=normal
  ENV MK_DEBUG_FILES=no
  ENV MK_KERNEL_SYMBOLS=no
  ENV NM=/usr/local/bin/nm
  ENV NO_DEPENDS=yes
  ENV NO_LINT=YES
  ENV NO_PIE=yes
  ENV NUM_JOBS=2
  ENV OBJCOPY=/usr/local/bin/objcopy
  ENV OBJDUMP=/usr/local/bin/objdump
  ENV OLDPWD=/usr/ports/devel/py-maturin
  ENV OPSYS=FreeBSD
  ENV OPT_LEVEL=2
  ENV OSREL=12.2
  ENV OSVERSION=1202000
  ENV OUT_DIR=/wrkdirs/usr/ports/devel/py-maturin/work-py37/maturin-0.8.3/target/release/build/ring-a25eaf384c39dbf9/out
  ENV PACKAGE_BUILDING=yes
  ENV PATH=/wrkdirs/usr/ports/devel/py-maturin/work-py37/.bin:/sbin:/bin:/usr/sbin:/usr/bin:/usr/local/sbin:/usr/local/bin:/root/bin
  ENV POUDRIEREPATH=/usr/local/bin/poudriere
  ENV POUDRIERE_BUILD_TYPE=bulk
  ENV POUDRIERE_VERSION=3.2.8-8-gaf08dbda
  ENV PPC_ABI=ELFv1
  ENV PREFIX=/usr/local
  ENV PROFILE=release
  ENV PWD=/wrkdirs/usr/ports/devel/py-maturin/work-py37/maturin-0.8.3
  ENV PYTHONBASE=/usr/local
  ENV PYTHONDONTWRITEBYTECODE=
  ENV PYTHONOPTIMIZE=
  ENV P_PORTS_FEATURES=FLAVORS SELECTED_OPTIONS
  ENV RANLIB=/usr/local/bin/ranlib
  ENV READELF=/usr/local/bin/readelf
  ENV RUSTC=/usr/local/bin/rustc
  ENV RUSTDOC=/usr/local/bin/rustdoc
  ENV RUSTFLAGS= -C linker=gcc10 -C link-arg=-fstack-protector-strong -C link-arg=-Wl,-rpath=/usr/local/lib/gcc10 -C link-arg=-L/usr/local/lib/gcc10
  ENV RUST_BACKTRACE=1
  ENV SAVED_TERM=
  ENV SCRIPTPATH=/usr/local/share/poudriere/bulk.sh
  ENV SCRIPTPREFIX=/usr/local/share/poudriere
  ENV SHELL=/bin/sh
  ENV SIZE=/usr/local/bin/size
  ENV SSL_CERT_DIR=/usr/local/share/certs
  ENV SSL_CERT_FILE=/usr/local/openssl/cert.pem
  ENV STATUS=1
  ENV STRINGS=/usr/local/bin/strings
  ENV TARGET=powerpc64-unknown-freebsd
  ENV TMPDIR=/tmp
  ENV UID=0
  ENV UNAME_r=12.2-RELEASE
  ENV UNAME_v=FreeBSD 12.2-RELEASE
  ENV USER=root
  ENV XDG_CONFIG_HOME=/wrkdirs/usr/ports/devel/py-maturin/work-py37
  ENV XDG_DATA_HOME=/wrkdirs/usr/ports/devel/py-maturin/work-py37
  ENV _OSRELEASE=12.2-RELEASE
  thread 'main' panicked at 'called `Option::unwrap()` on a `None` value', /wrkdirs/usr/ports/devel/py-maturin/work-py37/maturin-0.8.3/cargo-crates/ring-0.16.15/build.rs:378:10
  stack backtrace:
  note: Some details are omitted, run with `RUST_BACKTRACE=full` for a verbose backtrace.
warning: build failed, waiting for other jobs to finish...
error: build failed
*** Error code 101

Stop.
make: stopped in /usr/ports/devel/py-maturin
Received on Thu Jun 24 2021 - 03:01:13 UTC

Original text of this message