[package - 122powerpc64-quarterly][devel/msp430-debug-stack] Failed for msp430-debug-stack-3.15.0.1 in build

From: <pkg-fallout_at_FreeBSD.org>
Date: Thu, 24 Jun 2021 02:58:46 GMT
You are receiving this mail as a port that you maintain
is failing to build on the FreeBSD package build server.
Please investigate the failure and submit a PR to fix
build.

Maintainer:     lev_at_FreeBSD.org
Log URL:        http://foul1.nyi.freebsd.org/data/122powerpc64-quarterly/3e55273e25e2/logs/msp430-debug-stack-3.15.0.1.log
Build URL:      http://foul1.nyi.freebsd.org/build.html?mastername=122powerpc64-quarterly&build=3e55273e25e2
Log:

=>> Building devel/msp430-debug-stack
build started at Thu Jun 24 02:57:53 UTC 2021
port directory: /usr/ports/devel/msp430-debug-stack
package name: msp430-debug-stack-3.15.0.1
building for: FreeBSD 122powerpc64-quarterly-job-06 12.2-RELEASE FreeBSD 12.2-RELEASE powerpc
maintained by: lev_at_FreeBSD.org
Makefile ident: 
Poudriere version: 3.2.8-8-gaf08dbda
Host OSVERSION: 1400008
Jail OSVERSION: 1202000
Job Id: 06

---Begin Environment---
SHELL=/bin/csh
OSVERSION=1202000
UNAME_v=FreeBSD 12.2-RELEASE
UNAME_r=12.2-RELEASE
BLOCKSIZE=K
MAIL=/var/mail/root
STATUS=1
HOME=/root
PATH=/sbin:/bin:/usr/sbin:/usr/bin:/usr/local/sbin:/usr/local/bin:/root/bin
LOCALBASE=/usr/local
USER=root
LIBEXECPREFIX=/usr/local/libexec/poudriere
POUDRIERE_VERSION=3.2.8-8-gaf08dbda
MASTERMNT=/usr/local/poudriere/data/.m/122powerpc64-quarterly/ref
POUDRIERE_BUILD_TYPE=bulk
PACKAGE_BUILDING=yes
SAVED_TERM=
PWD=/usr/local/poudriere/data/.m/122powerpc64-quarterly/ref/.p/pool
P_PORTS_FEATURES=FLAVORS SELECTED_OPTIONS
MASTERNAME=122powerpc64-quarterly
SCRIPTPREFIX=/usr/local/share/poudriere
OLDPWD=/usr/local/poudriere/data/.m/122powerpc64-quarterly/ref/.p
SCRIPTPATH=/usr/local/share/poudriere/bulk.sh
POUDRIEREPATH=/usr/local/bin/poudriere
---End Environment---

---Begin Poudriere Port Flags/Env---
PORT_FLAGS=
PKGENV=
FLAVOR=
DEPENDS_ARGS=
MAKE_ARGS=
---End Poudriere Port Flags/Env---

---Begin OPTIONS List---
===> The following configuration options are available for msp430-debug-stack-3.15.0.1:
     DOCS=on: Build and/or install documentation
===> Use 'make config' to modify these settings
---End OPTIONS List---

--MAINTAINER--
lev_at_FreeBSD.org
--End MAINTAINER--

--CONFIGURE_ARGS--

--End CONFIGURE_ARGS--

--CONFIGURE_ENV--
MAKE=gmake XDG_DATA_HOME=/wrkdirs/usr/ports/devel/msp430-debug-stack/work  XDG_CONFIG_HOME=/wrkdirs/usr/ports/devel/msp430-debug-stack/work  HOME=/wrkdirs/usr/ports/devel/msp430-debug-stack/work TMPDIR="/tmp" PATH=/wrkdirs/usr/ports/devel/msp430-debug-stack/work/.bin:/sbin:/bin:/usr/sbin:/usr/bin:/usr/local/sbin:/usr/local/bin:/root/bin SHELL=/bin/sh CONFIG_SHELL=/bin/sh
--End CONFIGURE_ENV--

--MAKE_ENV--
XDG_DATA_HOME=/wrkdirs/usr/ports/devel/msp430-debug-stack/work  XDG_CONFIG_HOME=/wrkdirs/usr/ports/devel/msp430-debug-stack/work  HOME=/wrkdirs/usr/ports/devel/msp430-debug-stack/work TMPDIR="/tmp" PATH=/wrkdirs/usr/ports/devel/msp430-debug-stack/work/.bin:/sbin:/bin:/usr/sbin:/usr/bin:/usr/local/sbin:/usr/local/bin:/root/bin NO_PIE=yes MK_DEBUG_FILES=no MK_KERNEL_SYMBOLS=no SHELL=/bin/sh NO_LINT=YES ADDR2LINE="/usr/local/bin/addr2line" AR="/usr/local/bin/ar" AS="/usr/local/bin/as" CPPFILT="/usr/local/bin/c++filt" GPROF="/usr/local/bin/gprof" LD="/usr/local/bin/ld" NM="/usr/local/bin/nm" OBJCOPY="/usr/local/bin/objcopy" OBJDUMP="/usr/local/bin/objdump" RANLIB="/usr/local/bin/ranlib" READELF="/usr/local/bin/readelf" SIZE="/usr/local/bin/size" STRINGS="/usr/local/bin/strings" PREFIX=/usr/local  LOCALBASE=/usr/local  CC="gcc10" CFLAGS="-O2 -pipe  -fstack-protector-strong -Wl,-rpath=/usr/local/lib/gcc10 -fno-strict-aliasing "  CPP="cpp10" CPPFLAGS=""  LDFLAGS=" -fstack-protector-strong -
 Wl,-rpath=/usr/local/lib/gcc10 -L/usr/local/lib/gcc10 " LIBS=""  CXX="g++10" CXXFLAGS="-O2 -pipe  -fstack-protector-strong -Wl,-rpath=/usr/local/lib/gcc10  -Wl,-rpath=/usr/local/lib/gcc10 "  MANPREFIX="/usr/local" BSD_INSTALL_PROGRAM="install  -s -m 555"  BSD_INSTALL_LIB="install  -s -m 0644"  BSD_INSTALL_SCRIPT="install  -m 555"  BSD_INSTALL_DATA="install  -m 0644"  BSD_INSTALL_MAN="install  -m 444"
--End MAKE_ENV--

--PLIST_SUB--
PORTDOCS="" OSREL=12.2 PREFIX=%D LOCALBASE=/usr/local  RESETPREFIX=/usr/local LIB32DIR=lib DOCSDIR="share/doc/msp430-debug-stack"  EXAMPLESDIR="share/examples/msp430-debug-stack"  DATADIR="share/msp430-debug-stack"  WWWDIR="www/msp430-debug-stack"  ETCDIR="etc/msp430-debug-stack"
--End PLIST_SUB--

--SUB_LIST--
PREFIX=/usr/local LOCALBASE=/usr/local  DATADIR=/usr/local/share/msp430-debug-stack DOCSDIR=/usr/local/share/doc/msp430-debug-stack EXAMPLESDIR=/usr/local/share/examples/msp430-debug-stack  WWWDIR=/usr/local/www/msp430-debug-stack ETCDIR=/usr/local/etc/msp430-debug-stack
--End SUB_LIST--

---Begin make.conf---
USE_PACKAGE_DEPENDS=yes
BATCH=yes
WRKDIRPREFIX=/wrkdirs
PORTSDIR=/usr/ports
PACKAGES=/packages
DISTDIR=/distfiles
PACKAGE_BUILDING=yes
PACKAGE_BUILDING_FLAVORS=yes
#### /usr/local/etc/poudriere.d/make.conf ####
# XXX: We really need this but cannot use it while 'make checksum' does not
# try the next mirror on checksum failure.  It currently retries the same
# failed mirror and then fails rather then trying another.  It *does*
# try the next if the size is mismatched though.
#MASTER_SITE_FREEBSD=yes
# Build ALLOW_MAKE_JOBS_PACKAGES with 2 jobs
MAKE_JOBS_NUMBER=2
#### /usr/ports/Mk/Scripts/ports_env.sh ####
_CCVERSION_921dbbb2=cc (GCC) 4.2.1 20070831 patched [FreeBSD] Copyright (C) 2007 Free Software Foundation, Inc. This is free software; see the source for copying conditions. There is NO warranty; not even for MERCHANTABILITY or FITNESS FOR A PARTICULAR PURPOSE.
_ALTCCVERSION_921dbbb2=none
_CXXINTERNAL_acaad9ca=Using built-in specs. Target: powerpc64-undermydesk-freebsd Configured with: FreeBSD/powerpc64 system compiler Thread model: posix gcc version 4.2.1 20070831 patched [FreeBSD] "/usr/bin/ld" "--eh-frame-hdr" "-Qy" "-melf64ppc_fbsd" "--enable-new-dtags" "-dynamic-linker" "/libexec/ld-elf.so.1" "/usr/lib/crt1.o" "/usr/lib/crti.o" "/usr/lib/crtbegin.o" "-L/usr/lib" "-L/usr/lib" "/dev/null" "-lstdc++" "-lm" "-lgcc_s" "-lgcc" "-lc" "-lgcc_s" "-lgcc" "/usr/lib/crtsavres.o" "/usr/lib/crtend.o" "/usr/lib/crtn.o"
CC_OUTPUT_921dbbb2_58173849=yes
CC_OUTPUT_921dbbb2_9bdba57c=yes
CC_OUTPUT_921dbbb2_6a4fe7f5=cc1: error: unrecognized command line option "-std=c11"
CC_OUTPUT_921dbbb2_6bcac02b=yes
CC_OUTPUT_921dbbb2_67d20829=yes
CC_OUTPUT_921dbbb2_bfa62e83=cc1: error: unrecognized command line option "-std=gnu11"
CC_OUTPUT_921dbbb2_f0b4d593=yes
CC_OUTPUT_921dbbb2_308abb44=cc1plus: error: unrecognized command line option "-std=c++0x"
CC_OUTPUT_921dbbb2_f00456e5=cc1plus: error: unrecognized command line option "-std=c++11"
CC_OUTPUT_921dbbb2_65ad290d=cc1plus: error: unrecognized command line option "-std=c++14"
CC_OUTPUT_921dbbb2_f2776b26=cc1plus: error: unrecognized command line option "-std=c++17"
CC_OUTPUT_921dbbb2_b2657cc3=yes
CC_OUTPUT_921dbbb2_380987f7=cc1plus: error: unrecognized command line option "-std=gnu++11"
CC_OUTPUT_921dbbb2_160933ec=cc1plus: error: unrecognized command line option "-std=gnu++14"
CC_OUTPUT_921dbbb2_fb62803b=cc1plus: error: unrecognized command line option "-std=gnu++17"
_OBJC_CCVERSION_921dbbb2=cc (GCC) 4.2.1 20070831 patched [FreeBSD] Copyright (C) 2007 Free Software Foundation, Inc. This is free software; see the source for copying conditions. There is NO warranty; not even for MERCHANTABILITY or FITNESS FOR A PARTICULAR PURPOSE.
_OBJC_ALTCCVERSION_921dbbb2=none
ARCH=powerpc64
PPC_ABI=ELFv1
OPSYS=FreeBSD
_OSRELEASE=12.2-RELEASE
OSREL=12.2
OSVERSION=1202000
PYTHONBASE=/usr/local
CONFIGURE_MAX_CMD_LEN=524288
HAVE_PORTS_ENV=1
#### Misc Poudriere ####
GID=0
UID=0
---End make.conf---
--Resource limits--
cpu time               (seconds, -t)  unlimited
file size           (512-blocks, -f)  unlimited
data seg size           (kbytes, -d)  33554432
stack size              (kbytes, -s)  524288
core file size      (512-blocks, -c)  unlimited
max memory size         (kbytes, -m)  unlimited
locked memory           (kbytes, -l)  unlimited
max user processes              (-u)  89999
open files                      (-n)  1024
virtual mem size        (kbytes, -v)  unlimited
swap limit              (kbytes, -w)  unlimited
socket buffer size       (bytes, -b)  unlimited
pseudo-terminals                (-p)  unlimited
kqueues                         (-k)  unlimited
umtx shared locks               (-o)  unlimited
--End resource limits--
=======================<phase: check-sanity   >============================
===>  License BSD3CLAUSE accepted by the user
===========================================================================
=======================<phase: pkg-depends    >============================
===>   msp430-debug-stack-3.15.0.1 depends on file: /usr/local/sbin/pkg - not found
===>   Installing existing package /packages/All/pkg-1.16.3.txz
[122powerpc64-quarterly-job-06] Installing pkg-1.16.3...
[122powerpc64-quarterly-job-06] Extracting pkg-1.16.3: .......... done
===>   msp430-debug-stack-3.15.0.1 depends on file: /usr/local/sbin/pkg - found
===>   Returning to build of msp430-debug-stack-3.15.0.1
===========================================================================
=======================<phase: fetch-depends  >============================
===========================================================================
=======================<phase: fetch          >============================
===>  License BSD3CLAUSE accepted by the user
===> Fetching all distfiles required by msp430-debug-stack-3.15.0.1 for building
===========================================================================
=======================<phase: checksum       >============================
===>  License BSD3CLAUSE accepted by the user
===> Fetching all distfiles required by msp430-debug-stack-3.15.0.1 for building
=> SHA256 Checksum OK for MSPDebugStack_OS_Package_3_15_0_1.zip.
=> SHA256 Checksum OK for slau320ai.pdf.
=> SHA256 Checksum OK for slau656b.pdf.
===========================================================================
=======================<phase: extract-depends>============================
===>   msp430-debug-stack-3.15.0.1 depends on file: /usr/local/bin/unzip - not found
===>   Installing existing package /packages/All/unzip-6.0_8.txz
[122powerpc64-quarterly-job-06] Installing unzip-6.0_8...
[122powerpc64-quarterly-job-06] Extracting unzip-6.0_8: .......... done
===>   msp430-debug-stack-3.15.0.1 depends on file: /usr/local/bin/unzip - found
===>   Returning to build of msp430-debug-stack-3.15.0.1
===========================================================================
=======================<phase: extract        >============================
===>  License BSD3CLAUSE accepted by the user
===> Fetching all distfiles required by msp430-debug-stack-3.15.0.1 for building
===>  Extracting for msp430-debug-stack-3.15.0.1
=> SHA256 Checksum OK for MSPDebugStack_OS_Package_3_15_0_1.zip.
=> SHA256 Checksum OK for slau320ai.pdf.
=> SHA256 Checksum OK for slau656b.pdf.
===========================================================================
=======================<phase: patch-depends  >============================
===========================================================================
=======================<phase: patch          >============================
===>  Patching for msp430-debug-stack-3.15.0.1
===>   Converting DOS text files to UNIX text files
===>  Applying FreeBSD patches for msp430-debug-stack-3.15.0.1 from /usr/ports/devel/msp430-debug-stack/files
===========================================================================
=======================<phase: build-depends  >============================
===>   msp430-debug-stack-3.15.0.1 depends on package: gmake>=4.3 - not found
===>   Installing existing package /packages/All/gmake-4.3_2.txz
[122powerpc64-quarterly-job-06] Installing gmake-4.3_2...
[122powerpc64-quarterly-job-06] `-- Installing gettext-runtime-0.21...
[122powerpc64-quarterly-job-06] |   `-- Installing indexinfo-0.3.1...
[122powerpc64-quarterly-job-06] |   `-- Extracting indexinfo-0.3.1: .... done
[122powerpc64-quarterly-job-06] `-- Extracting gettext-runtime-0.21: .......... done
[122powerpc64-quarterly-job-06] Extracting gmake-4.3_2: .......... done
===>   msp430-debug-stack-3.15.0.1 depends on package: gmake>=4.3 - found
===>   Returning to build of msp430-debug-stack-3.15.0.1
===>   msp430-debug-stack-3.15.0.1 depends on executable: gcc10 - not found
===>   Installing existing package /packages/All/gcc10-10.2.0_1.txz
[122powerpc64-quarterly-job-06] Installing gcc10-10.2.0_1...
[122powerpc64-quarterly-job-06] `-- Installing binutils-2.33.1_4,1...
[122powerpc64-quarterly-job-06] `-- Extracting binutils-2.33.1_4,1: .......... done
[122powerpc64-quarterly-job-06] `-- Installing gcc9-9.3.0_3...
[122powerpc64-quarterly-job-06] |   `-- Installing gmp-6.2.1...
[122powerpc64-quarterly-job-06] |   `-- Extracting gmp-6.2.1: .......... done
[122powerpc64-quarterly-job-06] |   `-- Installing mpc-1.2.0...
[122powerpc64-quarterly-job-06] |   | `-- Installing mpfr-4.1.0...
[122powerpc64-quarterly-job-06] |   | `-- Extracting mpfr-4.1.0: .......... done
[122powerpc64-quarterly-job-06] |   `-- Extracting mpc-1.2.0: ......... done
[122powerpc64-quarterly-job-06] `-- Extracting gcc9-9.3.0_3: .......... done
[122powerpc64-quarterly-job-06] Extracting gcc10-10.2.0_1: .......... done
=====
Message from gcc9-9.3.0_3:

--
To ensure binaries built with this toolchain find appropriate versions
of the necessary run-time libraries, you may want to link using

  -Wl,-rpath=/usr/local/lib/gcc9

For ports leveraging USE_GCC, USES=compiler, or USES=fortran this happens
transparently.
=====
Message from gcc10-10.2.0_1:

--
To ensure binaries built with this toolchain find appropriate versions
of the necessary run-time libraries, you may want to link using

  -Wl,-rpath=/usr/local/lib/gcc10

For ports leveraging USE_GCC, USES=compiler, or USES=fortran this happens
transparently.
===>   msp430-debug-stack-3.15.0.1 depends on executable: gcc10 - found
===>   Returning to build of msp430-debug-stack-3.15.0.1
===>   msp430-debug-stack-3.15.0.1 depends on file: /usr/local/bin/as - found
===========================================================================
=======================<phase: lib-depends    >============================
===>   msp430-debug-stack-3.15.0.1 depends on shared library: libboost_filesystem.so - not found
===>   Installing existing package /packages/All/boost-libs-1.72.0_4.txz
[122powerpc64-quarterly-job-06] Installing boost-libs-1.72.0_4...
[122powerpc64-quarterly-job-06] `-- Installing icu-68.2,1...
[122powerpc64-quarterly-job-06] `-- Extracting icu-68.2,1: .......... done
[122powerpc64-quarterly-job-06] Extracting boost-libs-1.72.0_4: .......... done
=====
Message from boost-libs-1.72.0_4:

--
You have built the Boost library with thread support.

Don't forget to add -pthread to your linker options when
linking your code.
===>   msp430-debug-stack-3.15.0.1 depends on shared library: libboost_filesystem.so - found (/usr/local/lib/libboost_filesystem.so)
===>   Returning to build of msp430-debug-stack-3.15.0.1
===>   msp430-debug-stack-3.15.0.1 depends on shared library: libhidapi.so - not found
===>   Installing existing package /packages/All/hidapi-0.10.1.txz
[122powerpc64-quarterly-job-06] Installing hidapi-0.10.1...
[122powerpc64-quarterly-job-06] `-- Installing libiconv-1.16...
[122powerpc64-quarterly-job-06] `-- Extracting libiconv-1.16: .......... done
[122powerpc64-quarterly-job-06] Extracting hidapi-0.10.1: .......... done
===>   msp430-debug-stack-3.15.0.1 depends on shared library: libhidapi.so - found (/usr/local/lib/libhidapi.so)
===>   Returning to build of msp430-debug-stack-3.15.0.1
===========================================================================
=======================<phase: configure      >============================
===>  Configuring for msp430-debug-stack-3.15.0.1
===========================================================================
=======================<phase: build          >============================
===>  Building for msp430-debug-stack-3.15.0.1
gmake[1]: Entering directory '/wrkdirs/usr/ports/devel/msp430-debug-stack/work/msp430-debug-stack-3.15.0.1'
gmake -C ./ThirdParty/BSL430_DLL
gmake[2]: Entering directory '/wrkdirs/usr/ports/devel/msp430-debug-stack/work/msp430-debug-stack-3.15.0.1/ThirdParty/BSL430_DLL'
g++10 -x c++-header -c -o BSL430_DLL/pch.h.gch BSL430_DLL/pch.h -fPIC -std=c++0x -fvisibility=hidden -fvisibility-inlines-hidden -Os -I../include -I./BSL430_DLL -I./BSL430_DLL/Utility_Classes -I./BSL430_DLL/Physical_Interfaces -I./BSL430_DLL/Packet_Handlers -I./BSL430_DLL/Connections -I/usr/local/include -I/usr/local/include/hidapi -DUNIX -DNDEBUG
g++10 -c -o BSL430_DLL/MSPBSL_Factory.o BSL430_DLL/MSPBSL_Factory.cpp -include ./BSL430_DLL/pch.h -fPIC -std=c++0x -fvisibility=hidden -fvisibility-inlines-hidden -Os -I../include -I./BSL430_DLL -I./BSL430_DLL/Utility_Classes -I./BSL430_DLL/Physical_Interfaces -I./BSL430_DLL/Packet_Handlers -I./BSL430_DLL/Connections -I/usr/local/include -I/usr/local/include/hidapi -DUNIX -DNDEBUG

g++10: internal compiler error: Segmentation fault signal terminated program cc1plus
Please submit a full bug report,
with preprocessed source if appropriate.
See <https://gcc.gnu.org/bugs/> for instructions.
gmake[2]: *** [Makefile:68: BSL430_DLL/MSPBSL_Factory.o] Error 4
gmake[2]: Leaving directory '/wrkdirs/usr/ports/devel/msp430-debug-stack/work/msp430-debug-stack-3.15.0.1/ThirdParty/BSL430_DLL'
gmake[1]: *** [Makefile:143: ThirdParty/lib64/libbsl430.a] Error 2
gmake[1]: Leaving directory '/wrkdirs/usr/ports/devel/msp430-debug-stack/work/msp430-debug-stack-3.15.0.1'
*** Error code 1

Stop.
make: stopped in /usr/ports/devel/msp430-debug-stack
Received on Thu Jun 24 2021 - 02:58:46 UTC

Original text of this message