[package - 122powerpc64-quarterly][devel/folly] Failed for folly-2021.04.05.00 in build

From: <pkg-fallout_at_FreeBSD.org>
Date: Thu, 24 Jun 2021 02:45:51 GMT
You are receiving this mail as a port that you maintain
is failing to build on the FreeBSD package build server.
Please investigate the failure and submit a PR to fix
build.

Maintainer:     yuri_at_FreeBSD.org
Log URL:        http://foul1.nyi.freebsd.org/data/122powerpc64-quarterly/3e55273e25e2/logs/folly-2021.04.05.00.log
Build URL:      http://foul1.nyi.freebsd.org/build.html?mastername=122powerpc64-quarterly&build=3e55273e25e2
Log:

=>> Building devel/folly
build started at Thu Jun 24 02:42:21 UTC 2021
port directory: /usr/ports/devel/folly
package name: folly-2021.04.05.00
building for: FreeBSD 122powerpc64-quarterly-job-13 12.2-RELEASE FreeBSD 12.2-RELEASE powerpc
maintained by: yuri_at_FreeBSD.org
Makefile ident: 
Poudriere version: 3.2.8-8-gaf08dbda
Host OSVERSION: 1400008
Jail OSVERSION: 1202000
Job Id: 13

---Begin Environment---
SHELL=/bin/csh
OSVERSION=1202000
UNAME_v=FreeBSD 12.2-RELEASE
UNAME_r=12.2-RELEASE
BLOCKSIZE=K
MAIL=/var/mail/root
STATUS=1
HOME=/root
PATH=/sbin:/bin:/usr/sbin:/usr/bin:/usr/local/sbin:/usr/local/bin:/root/bin
LOCALBASE=/usr/local
USER=root
LIBEXECPREFIX=/usr/local/libexec/poudriere
POUDRIERE_VERSION=3.2.8-8-gaf08dbda
MASTERMNT=/usr/local/poudriere/data/.m/122powerpc64-quarterly/ref
POUDRIERE_BUILD_TYPE=bulk
PACKAGE_BUILDING=yes
SAVED_TERM=
PWD=/usr/local/poudriere/data/.m/122powerpc64-quarterly/ref/.p/pool
P_PORTS_FEATURES=FLAVORS SELECTED_OPTIONS
MASTERNAME=122powerpc64-quarterly
SCRIPTPREFIX=/usr/local/share/poudriere
OLDPWD=/usr/local/poudriere/data/.m/122powerpc64-quarterly/ref/.p
SCRIPTPATH=/usr/local/share/poudriere/bulk.sh
POUDRIEREPATH=/usr/local/bin/poudriere
---End Environment---

---Begin Poudriere Port Flags/Env---
PORT_FLAGS=
PKGENV=
FLAVOR=
DEPENDS_ARGS=
MAKE_ARGS=
---End Poudriere Port Flags/Env---

---Begin OPTIONS List---
---End OPTIONS List---

--MAINTAINER--
yuri_at_FreeBSD.org
--End MAINTAINER--

--CONFIGURE_ARGS--

--End CONFIGURE_ARGS--

--CONFIGURE_ENV--
XDG_DATA_HOME=/wrkdirs/usr/ports/devel/folly/work  XDG_CONFIG_HOME=/wrkdirs/usr/ports/devel/folly/work  HOME=/wrkdirs/usr/ports/devel/folly/work TMPDIR="/tmp" PATH=/wrkdirs/usr/ports/devel/folly/work/.bin:/sbin:/bin:/usr/sbin:/usr/bin:/usr/local/sbin:/usr/local/bin:/root/bin SHELL=/bin/sh CONFIG_SHELL=/bin/sh
--End CONFIGURE_ENV--

--MAKE_ENV--
OPENSSLBASE=/usr OPENSSLDIR=/etc/ssl OPENSSLINC=/usr/include OPENSSLLIB=/usr/lib XDG_DATA_HOME=/wrkdirs/usr/ports/devel/folly/work  XDG_CONFIG_HOME=/wrkdirs/usr/ports/devel/folly/work  HOME=/wrkdirs/usr/ports/devel/folly/work TMPDIR="/tmp" PATH=/wrkdirs/usr/ports/devel/folly/work/.bin:/sbin:/bin:/usr/sbin:/usr/bin:/usr/local/sbin:/usr/local/bin:/root/bin NO_PIE=yes MK_DEBUG_FILES=no MK_KERNEL_SYMBOLS=no SHELL=/bin/sh NO_LINT=YES ADDR2LINE="/usr/local/bin/addr2line" AR="/usr/local/bin/ar" AS="/usr/local/bin/as" CPPFILT="/usr/local/bin/c++filt" GPROF="/usr/local/bin/gprof" LD="/usr/local/bin/ld" NM="/usr/local/bin/nm" OBJCOPY="/usr/local/bin/objcopy" OBJDUMP="/usr/local/bin/objdump" RANLIB="/usr/local/bin/ranlib" READELF="/usr/local/bin/readelf" SIZE="/usr/local/bin/size" STRINGS="/usr/local/bin/strings" DESTDIR=/wrkdirs/usr/ports/devel/folly/work/stage PREFIX=/usr/local  LOCALBASE=/usr/local  CC="gcc10" CFLAGS="-O2 -pipe  -fstack-protector-strong -Wl,-rpath=/usr/local/lib/gcc10 -fno-s
 trict-aliasing "  CPP="cpp10" CPPFLAGS=""  LDFLAGS="  -fstack-protector-strong -Wl,-rpath=/usr/local/lib/gcc10 -L/usr/local/lib/gcc10 " LIBS=""  CXX="g++10" CXXFLAGS="-O2 -pipe  -fstack-protector-strong -Wl,-rpath=/usr/local/lib/gcc10  -fPIC -Wl,-rpath=/usr/local/lib/gcc10 -DFOLLY_QUOTIENT_MULTI_SET_SUPPORTED=0"  MANPREFIX="/usr/local" BSD_INSTALL_PROGRAM="install  -s -m 555"  BSD_INSTALL_LIB="install  -s -m 0644"  BSD_INSTALL_SCRIPT="install  -m 555"  BSD_INSTALL_DATA="install  -m 0644"  BSD_INSTALL_MAN="install  -m 444"
--End MAKE_ENV--

--PLIST_SUB--
CMAKE_BUILD_TYPE="release" OSREL=12.2 PREFIX=%D LOCALBASE=/usr/local  RESETPREFIX=/usr/local LIB32DIR=lib DOCSDIR="share/doc/folly"  EXAMPLESDIR="share/examples/folly"  DATADIR="share/folly"  WWWDIR="www/folly"  ETCDIR="etc/folly"
--End PLIST_SUB--

--SUB_LIST--
PREFIX=/usr/local LOCALBASE=/usr/local  DATADIR=/usr/local/share/folly DOCSDIR=/usr/local/share/doc/folly EXAMPLESDIR=/usr/local/share/examples/folly  WWWDIR=/usr/local/www/folly ETCDIR=/usr/local/etc/folly
--End SUB_LIST--

---Begin make.conf---
USE_PACKAGE_DEPENDS=yes
BATCH=yes
WRKDIRPREFIX=/wrkdirs
PORTSDIR=/usr/ports
PACKAGES=/packages
DISTDIR=/distfiles
PACKAGE_BUILDING=yes
PACKAGE_BUILDING_FLAVORS=yes
#### /usr/local/etc/poudriere.d/make.conf ####
# XXX: We really need this but cannot use it while 'make checksum' does not
# try the next mirror on checksum failure.  It currently retries the same
# failed mirror and then fails rather then trying another.  It *does*
# try the next if the size is mismatched though.
#MASTER_SITE_FREEBSD=yes
# Build ALLOW_MAKE_JOBS_PACKAGES with 2 jobs
MAKE_JOBS_NUMBER=2
#### /usr/ports/Mk/Scripts/ports_env.sh ####
_CCVERSION_921dbbb2=cc (GCC) 4.2.1 20070831 patched [FreeBSD] Copyright (C) 2007 Free Software Foundation, Inc. This is free software; see the source for copying conditions. There is NO warranty; not even for MERCHANTABILITY or FITNESS FOR A PARTICULAR PURPOSE.
_ALTCCVERSION_921dbbb2=none
_CXXINTERNAL_acaad9ca=Using built-in specs. Target: powerpc64-undermydesk-freebsd Configured with: FreeBSD/powerpc64 system compiler Thread model: posix gcc version 4.2.1 20070831 patched [FreeBSD] "/usr/bin/ld" "--eh-frame-hdr" "-Qy" "-melf64ppc_fbsd" "--enable-new-dtags" "-dynamic-linker" "/libexec/ld-elf.so.1" "/usr/lib/crt1.o" "/usr/lib/crti.o" "/usr/lib/crtbegin.o" "-L/usr/lib" "-L/usr/lib" "/dev/null" "-lstdc++" "-lm" "-lgcc_s" "-lgcc" "-lc" "-lgcc_s" "-lgcc" "/usr/lib/crtsavres.o" "/usr/lib/crtend.o" "/usr/lib/crtn.o"
CC_OUTPUT_921dbbb2_58173849=yes
CC_OUTPUT_921dbbb2_9bdba57c=yes
CC_OUTPUT_921dbbb2_6a4fe7f5=cc1: error: unrecognized command line option "-std=c11"
CC_OUTPUT_921dbbb2_6bcac02b=yes
CC_OUTPUT_921dbbb2_67d20829=yes
CC_OUTPUT_921dbbb2_bfa62e83=cc1: error: unrecognized command line option "-std=gnu11"
CC_OUTPUT_921dbbb2_f0b4d593=yes
CC_OUTPUT_921dbbb2_308abb44=cc1plus: error: unrecognized command line option "-std=c++0x"
CC_OUTPUT_921dbbb2_f00456e5=cc1plus: error: unrecognized command line option "-std=c++11"
CC_OUTPUT_921dbbb2_65ad290d=cc1plus: error: unrecognized command line option "-std=c++14"
CC_OUTPUT_921dbbb2_f2776b26=cc1plus: error: unrecognized command line option "-std=c++17"
CC_OUTPUT_921dbbb2_b2657cc3=yes
CC_OUTPUT_921dbbb2_380987f7=cc1plus: error: unrecognized command line option "-std=gnu++11"
CC_OUTPUT_921dbbb2_160933ec=cc1plus: error: unrecognized command line option "-std=gnu++14"
CC_OUTPUT_921dbbb2_fb62803b=cc1plus: error: unrecognized command line option "-std=gnu++17"
_OBJC_CCVERSION_921dbbb2=cc (GCC) 4.2.1 20070831 patched [FreeBSD] Copyright (C) 2007 Free Software Foundation, Inc. This is free software; see the source for copying conditions. There is NO warranty; not even for MERCHANTABILITY or FITNESS FOR A PARTICULAR PURPOSE.
_OBJC_ALTCCVERSION_921dbbb2=none
ARCH=powerpc64
PPC_ABI=ELFv1
OPSYS=FreeBSD
_OSRELEASE=12.2-RELEASE
OSREL=12.2
OSVERSION=1202000
PYTHONBASE=/usr/local
CONFIGURE_MAX_CMD_LEN=524288
HAVE_PORTS_ENV=1
#### Misc Poudriere ####
GID=0
UID=0
---End make.conf---
--Resource limits--
cpu time               (seconds, -t)  unlimited
file size           (512-blocks, -f)  unlimited
data seg size           (kbytes, -d)  33554432
stack size              (kbytes, -s)  524288
core file size      (512-blocks, -c)  unlimited
max memory size         (kbytes, -m)  unlimited
locked memory           (kbytes, -l)  unlimited
max user processes              (-u)  89999
open files                      (-n)  1024
virtual mem size        (kbytes, -v)  unlimited
swap limit              (kbytes, -w)  unlimited
socket buffer size       (bytes, -b)  unlimited
pseudo-terminals                (-p)  unlimited
kqueues                         (-k)  unlimited
umtx shared locks               (-o)  unlimited
--End resource limits--
=======================<phase: check-sanity   >============================
===>  License APACHE20 accepted by the user
===========================================================================
=======================<phase: pkg-depends    >============================
===>   folly-2021.04.05.00 depends on file: /usr/local/sbin/pkg - not found
===>   Installing existing package /packages/All/pkg-1.16.3.txz
[122powerpc64-quarterly-job-13] Installing pkg-1.16.3...
[122powerpc64-quarterly-job-13] Extracting pkg-1.16.3: .......... done
===>   folly-2021.04.05.00 depends on file: /usr/local/sbin/pkg - found
===>   Returning to build of folly-2021.04.05.00
===========================================================================
=======================<phase: fetch-depends  >============================
===========================================================================
=======================<phase: fetch          >============================
===>  License APACHE20 accepted by the user
===> Fetching all distfiles required by folly-2021.04.05.00 for building
===========================================================================
=======================<phase: checksum       >============================
===>  License APACHE20 accepted by the user
===> Fetching all distfiles required by folly-2021.04.05.00 for building
=> SHA256 Checksum OK for facebook-folly-v2021.04.05.00_GH0.tar.gz.
===========================================================================
=======================<phase: extract-depends>============================
===========================================================================
=======================<phase: extract        >============================
===>  License APACHE20 accepted by the user
===> Fetching all distfiles required by folly-2021.04.05.00 for building
===>  Extracting for folly-2021.04.05.00
=> SHA256 Checksum OK for facebook-folly-v2021.04.05.00_GH0.tar.gz.
===========================================================================
=======================<phase: patch-depends  >============================
===========================================================================
=======================<phase: patch          >============================
===>  Patching for folly-2021.04.05.00
===>  Applying FreeBSD patches for folly-2021.04.05.00 from /usr/ports/devel/folly/files
===========================================================================
=======================<phase: build-depends  >============================
===>   folly-2021.04.05.00 depends on file: /usr/local/bin/cmake - not found
===>   Installing existing package /packages/All/cmake-3.19.6.txz
[122powerpc64-quarterly-job-13] Installing cmake-3.19.6...
[122powerpc64-quarterly-job-13] `-- Installing curl-7.76.0...
[122powerpc64-quarterly-job-13] |   `-- Installing ca_root_nss-3.63...
[122powerpc64-quarterly-job-13] |   `-- Extracting ca_root_nss-3.63: ........ done
[122powerpc64-quarterly-job-13] |   `-- Installing libnghttp2-1.43.0...
[122powerpc64-quarterly-job-13] |   | `-- Installing gcc10-10.2.0_1...
[122powerpc64-quarterly-job-13] |   |   `-- Installing binutils-2.33.1_4,1...
[122powerpc64-quarterly-job-13] |   |   | `-- Installing gettext-runtime-0.21...
[122powerpc64-quarterly-job-13] |   |   |   `-- Installing indexinfo-0.3.1...
[122powerpc64-quarterly-job-13] |   |   |   `-- Extracting indexinfo-0.3.1: .... done
[122powerpc64-quarterly-job-13] |   |   | `-- Extracting gettext-runtime-0.21: .......... done
[122powerpc64-quarterly-job-13] |   |   `-- Extracting binutils-2.33.1_4,1: .......... done
[122powerpc64-quarterly-job-13] |   |   `-- Installing gcc9-9.3.0_3...
[122powerpc64-quarterly-job-13] |   |   | `-- Installing gmp-6.2.1...
[122powerpc64-quarterly-job-13] |   |   | `-- Extracting gmp-6.2.1: .......... done
[122powerpc64-quarterly-job-13] |   |   | `-- Installing mpc-1.2.0...
[122powerpc64-quarterly-job-13] |   |   |   `-- Installing mpfr-4.1.0...
[122powerpc64-quarterly-job-13] |   |   |   `-- Extracting mpfr-4.1.0: .......... done
<snip>
                 from /wrkdirs/usr/ports/devel/folly/work/folly-2021.04.05.00/folly/json.cpp:17:
/wrkdirs/usr/ports/devel/folly/work/folly-2021.04.05.00/folly/memory/Malloc.h: In lambda function:
/wrkdirs/usr/ports/devel/folly/work/folly-2021.04.05.00/folly/memory/Malloc.h:92:17: warning: the address of 'void* mallocx(size_t, int)' will never be NULL [-Waddress]
   92 |     if (mallocx == nullptr || rallocx == nullptr || xallocx == nullptr ||
      |         ~~~~~~~~^~~~~~~~~~
/wrkdirs/usr/ports/devel/folly/work/folly-2021.04.05.00/folly/memory/Malloc.h:92:39: warning: the address of 'void* rallocx(void*, size_t, int)' will never be NULL [-Waddress]
   92 |     if (mallocx == nullptr || rallocx == nullptr || xallocx == nullptr ||
      |                               ~~~~~~~~^~~~~~~~~~
/wrkdirs/usr/ports/devel/folly/work/folly-2021.04.05.00/folly/memory/Malloc.h:92:61: warning: the address of 'size_t xallocx(void*, size_t, size_t, int)' will never be NULL [-Waddress]
   92 |     if (mallocx == nullptr || rallocx == nullptr || xallocx == nullptr ||
      |                                                     ~~~~~~~~^~~~~~~~~~
/wrkdirs/usr/ports/devel/folly/work/folly-2021.04.05.00/folly/memory/Malloc.h:93:17: warning: the address of 'size_t sallocx(const void*, int)' will never be NULL [-Waddress]
   93 |         sallocx == nullptr || dallocx == nullptr || sdallocx == nullptr ||
      |         ~~~~~~~~^~~~~~~~~~
/wrkdirs/usr/ports/devel/folly/work/folly-2021.04.05.00/folly/memory/Malloc.h:93:39: warning: the address of 'void dallocx(void*, int)' will never be NULL [-Waddress]
   93 |         sallocx == nullptr || dallocx == nullptr || sdallocx == nullptr ||
      |                               ~~~~~~~~^~~~~~~~~~
/wrkdirs/usr/ports/devel/folly/work/folly-2021.04.05.00/folly/memory/Malloc.h:93:62: warning: the address of 'void sdallocx(void*, size_t, int)' will never be NULL [-Waddress]
   93 |         sallocx == nullptr || dallocx == nullptr || sdallocx == nullptr ||
      |                                                     ~~~~~~~~~^~~~~~~~~~
/wrkdirs/usr/ports/devel/folly/work/folly-2021.04.05.00/folly/memory/Malloc.h:94:17: warning: the address of 'size_t nallocx(size_t, int)' will never be NULL [-Waddress]
   94 |         nallocx == nullptr || mallctl == nullptr ||
      |         ~~~~~~~~^~~~~~~~~~
/wrkdirs/usr/ports/devel/folly/work/folly-2021.04.05.00/folly/memory/Malloc.h:94:39: warning: the address of 'int mallctl(const char*, void*, size_t*, void*, size_t)' will never be NULL [-Waddress]
   94 |         nallocx == nullptr || mallctl == nullptr ||
      |                               ~~~~~~~~^~~~~~~~~~
/wrkdirs/usr/ports/devel/folly/work/folly-2021.04.05.00/folly/memory/Malloc.h:95:26: warning: the address of 'int mallctlnametomib(const char*, size_t*, size_t*)' will never be NULL [-Waddress]
   95 |         mallctlnametomib == nullptr || mallctlbymib == nullptr) {
      |         ~~~~~~~~~~~~~~~~~^~~~~~~~~~
/wrkdirs/usr/ports/devel/folly/work/folly-2021.04.05.00/folly/memory/Malloc.h:95:53: warning: the address of 'int mallctlbymib(const size_t*, size_t, void*, size_t*, void*, size_t)' will never be NULL [-Waddress]
   95 |         mallctlnametomib == nullptr || mallctlbymib == nullptr) {
      |                                        ~~~~~~~~~~~~~^~~~~~~~~~
/wrkdirs/usr/ports/devel/folly/work/folly-2021.04.05.00/folly/memory/Malloc.h: In lambda function:
/wrkdirs/usr/ports/devel/folly/work/folly-2021.04.05.00/folly/memory/Malloc.h:154:18: warning: the address of 'void sdallocx(void*, size_t, int)' will never be NULL [-Waddress]
  154 |         sdallocx == nullptr || nallocx == nullptr) {
      |         ~~~~~~~~~^~~~~~~~~~
/wrkdirs/usr/ports/devel/folly/work/folly-2021.04.05.00/folly/memory/Malloc.h:154:40: warning: the address of 'size_t nallocx(size_t, int)' will never be NULL [-Waddress]
  154 |         sdallocx == nullptr || nallocx == nullptr) {
      |                                ~~~~~~~~^~~~~~~~~~
In file included from /usr/local/include/boost/core/demangle.hpp:32,
                 from /usr/local/include/boost/type_index/stl_type_index.hpp:34,
                 from /usr/local/include/boost/type_index.hpp:29,
                 from /usr/local/include/boost/function/function_base.hpp:21,
                 from /usr/local/include/boost/function/detail/prologue.hpp:17,
                 from /usr/local/include/boost/function.hpp:30,
                 from /usr/local/include/boost/algorithm/string/detail/find_iterator.hpp:18,
                 from /usr/local/include/boost/algorithm/string/find_iterator.hpp:24,
                 from /usr/local/include/boost/algorithm/string/iter_find.hpp:27,
                 from /usr/local/include/boost/algorithm/string/split.hpp:16,
                 from /usr/local/include/boost/algorithm/string.hpp:23,
                 from /wrkdirs/usr/ports/devel/folly/work/folly-2021.04.05.00/folly/json.cpp:24:
/usr/local/lib/gcc10/include/c++/cxxabi.h: At global scope:
/usr/local/lib/gcc10/include/c++/cxxabi.h:605:3: error: declaration of '__cxxabiv1::__cxa_eh_globals* __cxxabiv1::__cxa_get_globals() noexcept' has a different exception specifier
  605 |   __cxa_get_globals() _GLIBCXX_NOTHROW __attribute__ ((__const__));
      |   ^~~~~~~~~~~~~~~~~
In file included from /wrkdirs/usr/ports/devel/folly/work/folly-2021.04.05.00/folly/ScopeGuard.h:30,
                 from /wrkdirs/usr/ports/devel/folly/work/folly-2021.04.05.00/folly/container/detail/F14Table.h:40,
                 from /wrkdirs/usr/ports/devel/folly/work/folly-2021.04.05.00/folly/container/detail/F14Policy.h:28,
                 from /wrkdirs/usr/ports/devel/folly/work/folly-2021.04.05.00/folly/container/F14Map.h:42,
                 from /wrkdirs/usr/ports/devel/folly/work/folly-2021.04.05.00/folly/dynamic.h:68,
                 from /wrkdirs/usr/ports/devel/folly/work/folly-2021.04.05.00/folly/json.h:48,
                 from /wrkdirs/usr/ports/devel/folly/work/folly-2021.04.05.00/folly/json.cpp:17:
/wrkdirs/usr/ports/devel/folly/work/folly-2021.04.05.00/folly/lang/UncaughtExceptions.h:31:30: note: from previous declaration '__cxxabiv1::__cxa_eh_globals* __cxxabiv1::__cxa_get_globals()'
   31 | extern "C" __cxa_eh_globals* __cxa_get_globals(void);
      |                              ^~~~~~~~~~~~~~~~~
In file included from /wrkdirs/usr/ports/devel/folly/work/folly-2021.04.05.00/folly/container/F14Map.h:1235,
                 from /wrkdirs/usr/ports/devel/folly/work/folly-2021.04.05.00/folly/dynamic.h:68,
                 from /wrkdirs/usr/ports/devel/folly/work/folly-2021.04.05.00/folly/json.h:48,
                 from /wrkdirs/usr/ports/devel/folly/work/folly-2021.04.05.00/folly/json.cpp:17:
/wrkdirs/usr/ports/devel/folly/work/folly-2021.04.05.00/folly/container/detail/F14MapFallback.h: In instantiation of 'static std::enable_if_t<(! std::is_constructible<Iter, const LocalIter&>::value), Iter> folly::f14::detail::F14BasicMap<K, M, H, E, A>::fromLocal(const LocalIter&) [with Iter = std::__detail::_Node_const_iterator<std::pair<const folly::dynamic, folly::dynamic>, false, true>; LocalIter = std::__detail::_Local_const_iterator<folly::dynamic, std::pair<const folly::dynamic, folly::dynamic>, std::__detail::_Select1st, folly::detail::DynamicHasher, std::__detail::_Mod_range_hashing, std::__detail::_Default_ranged_hash, false, true>; K = folly::dynamic; M = folly::dynamic; H = folly::detail::DynamicHasher; E = folly::detail::DynamicKeyEqual; A = std::allocator<std::pair<const folly::dynamic, folly::dynamic> >; std::enable_if_t<(! std::is_constructible<Iter, const LocalIter&>::value), Iter> = std::enable_if<true, std::__detail::_Node_const_iterator<std::pair<const folly::dyna
 mic, folly::dynamic>, false, true> >::type]':
/wrkdirs/usr/ports/devel/folly/work/folly-2021.04.05.00/folly/container/detail/F14MapFallback.h:400:29:   required from 'static Iter folly::f14::detail::F14BasicMap<K, M, H, E, A>::findImpl(Self&, const K2&) [with Iter = std::__detail::_Node_const_iterator<std::pair<const folly::dynamic, folly::dynamic>, false, true>; Self = const folly::f14::detail::F14BasicMap<folly::dynamic, folly::dynamic, folly::detail::DynamicHasher, folly::detail::DynamicKeyEqual, std::allocator<std::pair<const folly::dynamic, folly::dynamic> > >; K2 = folly::Range<const char*>; K = folly::dynamic; M = folly::dynamic; H = folly::detail::DynamicHasher; E = folly::detail::DynamicKeyEqual; A = std::allocator<std::pair<const folly::dynamic, folly::dynamic> >]'
/wrkdirs/usr/ports/devel/folly/work/folly-2021.04.05.00/folly/container/detail/F14MapFallback.h:416:36:   required from 'folly::f14::detail::F14BasicMap<K, M, H, E, A>::EnableHeterogeneousFind<K2, typename std::unordered_map<_Key1, _Tp1, _Hash1, _Pred1, _Alloc1>::const_iterator> folly::f14::detail::F14BasicMap<K, M, H, E, A>::find(const K2&) const [with K2 = folly::Range<const char*>; K = folly::dynamic; M = folly::dynamic; H = folly::detail::DynamicHasher; E = folly::detail::DynamicKeyEqual; A = std::allocator<std::pair<const folly::dynamic, folly::dynamic> >; folly::f14::detail::F14BasicMap<K, M, H, E, A>::EnableHeterogeneousFind<K2, typename std::unordered_map<_Key1, _Tp1, _Hash1, _Pred1, _Alloc1>::const_iterator> = std::enable_if<true, std::__detail::_Node_const_iterator<std::pair<const folly::dynamic, folly::dynamic>, false, true> >::type; typename std::unordered_map<_Key1, _Tp1, _Hash1, _Pred1, _Alloc1>::const_iterator = std::__detail::_Hashtable_base<folly::dynamic, std::pair<
 const folly::dynamic, folly::dynamic>, std::__detail::_Select1st, folly::detail::DynamicKeyEqual, folly::detail::DynamicHasher, std::__detail::_Mod_range_hashing, std::__detail::_Default_ranged_hash, std::__detail::_Hashtable_traits<true, false, true> >::const_iterator]'
/wrkdirs/usr/ports/devel/folly/work/folly-2021.04.05.00/folly/dynamic-inl.h:814:36:   required from here
/wrkdirs/usr/ports/devel/folly/work/folly-2021.04.05.00/folly/container/detail/F14MapFallback.h:387:16: warning: 'void* memcpy(void*, const void*, size_t)' copying an object of non-trivial type 'struct std::__detail::_Node_const_iterator<std::pair<const folly::dynamic, folly::dynamic>, false, true>' from an array of 'const struct std::__detail::_Local_const_iterator<folly::dynamic, std::pair<const folly::dynamic, folly::dynamic>, std::__detail::_Select1st, folly::detail::DynamicHasher, std::__detail::_Mod_range_hashing, std::__detail::_Default_ranged_hash, false, true>' [-Wclass-memaccess]
  387 |     std::memcpy(std::addressof(dst), std::addressof(src), sizeof(dst));
      |     ~~~~~~~~~~~^~~~~~~~~~~~~~~~~~~~~~~~~~~~~~~~~~~~~~~~~~~~~~~~~~~~~~~
In file included from /usr/local/lib/gcc10/include/c++/bits/hashtable.h:35,
                 from /usr/local/lib/gcc10/include/c++/unordered_map:46,
                 from /usr/local/lib/gcc10/include/c++/functional:61,
                 from /wrkdirs/usr/ports/devel/folly/work/folly-2021.04.05.00/folly/Function.h:221,
                 from /wrkdirs/usr/ports/devel/folly/work/folly-2021.04.05.00/folly/json.h:46,
                 from /wrkdirs/usr/ports/devel/folly/work/folly-2021.04.05.00/folly/json.cpp:17:
/usr/local/lib/gcc10/include/c++/bits/hashtable_policy.h:369:12: note: 'struct std::__detail::_Node_const_iterator<std::pair<const folly::dynamic, folly::dynamic>, false, true>' declared here
  369 |     struct _Node_const_iterator
      |            ^~~~~~~~~~~~~~~~~~~~
In file included from /wrkdirs/usr/ports/devel/folly/work/folly-2021.04.05.00/folly/container/F14Map.h:1235,
                 from /wrkdirs/usr/ports/devel/folly/work/folly-2021.04.05.00/folly/dynamic.h:68,
                 from /wrkdirs/usr/ports/devel/folly/work/folly-2021.04.05.00/folly/json.h:48,
                 from /wrkdirs/usr/ports/devel/folly/work/folly-2021.04.05.00/folly/json.cpp:17:
/wrkdirs/usr/ports/devel/folly/work/folly-2021.04.05.00/folly/container/detail/F14MapFallback.h: In instantiation of 'static std::enable_if_t<(! std::is_constructible<Iter, const LocalIter&>::value), Iter> folly::f14::detail::F14BasicMap<K, M, H, E, A>::fromLocal(const LocalIter&) [with Iter = std::__detail::_Node_iterator<std::pair<const folly::dynamic, folly::dynamic>, false, true>; LocalIter = std::__detail::_Local_iterator<folly::dynamic, std::pair<const folly::dynamic, folly::dynamic>, std::__detail::_Select1st, folly::detail::DynamicHasher, std::__detail::_Mod_range_hashing, std::__detail::_Default_ranged_hash, false, true>; K = folly::dynamic; M = folly::dynamic; H = folly::detail::DynamicHasher; E = folly::detail::DynamicKeyEqual; A = std::allocator<std::pair<const folly::dynamic, folly::dynamic> >; std::enable_if_t<(! std::is_constructible<Iter, const LocalIter&>::value), Iter> = std::enable_if<true, std::__detail::_Node_iterator<std::pair<const folly::dynamic, folly::dynami
 c>, false, true> >::type]':
/wrkdirs/usr/ports/devel/folly/work/folly-2021.04.05.00/folly/container/detail/F14MapFallback.h:400:29:   required from 'static Iter folly::f14::detail::F14BasicMap<K, M, H, E, A>::findImpl(Self&, const K2&) [with Iter = std::__detail::_Node_iterator<std::pair<const folly::dynamic, folly::dynamic>, false, true>; Self = folly::f14::detail::F14BasicMap<folly::dynamic, folly::dynamic, folly::detail::DynamicHasher, folly::detail::DynamicKeyEqual, std::allocator<std::pair<const folly::dynamic, folly::dynamic> > >; K2 = folly::Range<const char*>; K = folly::dynamic; M = folly::dynamic; H = folly::detail::DynamicHasher; E = folly::detail::DynamicKeyEqual; A = std::allocator<std::pair<const folly::dynamic, folly::dynamic> >]'
/wrkdirs/usr/ports/devel/folly/work/folly-2021.04.05.00/folly/container/detail/F14MapFallback.h:411:30:   required from 'folly::f14::detail::F14BasicMap<K, M, H, E, A>::EnableHeterogeneousFind<K2, typename std::unordered_map<_Key1, _Tp1, _Hash1, _Pred1, _Alloc1>::iterator> folly::f14::detail::F14BasicMap<K, M, H, E, A>::find(const K2&) [with K2 = folly::Range<const char*>; K = folly::dynamic; M = folly::dynamic; H = folly::detail::DynamicHasher; E = folly::detail::DynamicKeyEqual; A = std::allocator<std::pair<const folly::dynamic, folly::dynamic> >; folly::f14::detail::F14BasicMap<K, M, H, E, A>::EnableHeterogeneousFind<K2, typename std::unordered_map<_Key1, _Tp1, _Hash1, _Pred1, _Alloc1>::iterator> = std::enable_if<true, std::__detail::_Node_iterator<std::pair<const folly::dynamic, folly::dynamic>, false, true> >::type; typename std::unordered_map<_Key1, _Tp1, _Hash1, _Pred1, _Alloc1>::iterator = std::__detail::_Hashtable_base<folly::dynamic, std::pair<const folly::dynamic, folly::d
 ynamic>, std::__detail::_Select1st, folly::detail::DynamicKeyEqual, folly::detail::DynamicHasher, std::__detail::_Mod_range_hashing, std::__detail::_Default_ranged_hash, std::__detail::_Hashtable_traits<true, false, true> >::iterator]'
/wrkdirs/usr/ports/devel/folly/work/folly-2021.04.05.00/folly/dynamic-inl.h:818:36:   required from here
/wrkdirs/usr/ports/devel/folly/work/folly-2021.04.05.00/folly/container/detail/F14MapFallback.h:387:16: warning: 'void* memcpy(void*, const void*, size_t)' copying an object of non-trivial type 'struct std::__detail::_Node_iterator<std::pair<const folly::dynamic, folly::dynamic>, false, true>' from an array of 'const struct std::__detail::_Local_iterator<folly::dynamic, std::pair<const folly::dynamic, folly::dynamic>, std::__detail::_Select1st, folly::detail::DynamicHasher, std::__detail::_Mod_range_hashing, std::__detail::_Default_ranged_hash, false, true>' [-Wclass-memaccess]
  387 |     std::memcpy(std::addressof(dst), std::addressof(src), sizeof(dst));
      |     ~~~~~~~~~~~^~~~~~~~~~~~~~~~~~~~~~~~~~~~~~~~~~~~~~~~~~~~~~~~~~~~~~~
In file included from /usr/local/lib/gcc10/include/c++/bits/hashtable.h:35,
                 from /usr/local/lib/gcc10/include/c++/unordered_map:46,
                 from /usr/local/lib/gcc10/include/c++/functional:61,
                 from /wrkdirs/usr/ports/devel/folly/work/folly-2021.04.05.00/folly/Function.h:221,
                 from /wrkdirs/usr/ports/devel/folly/work/folly-2021.04.05.00/folly/json.h:46,
                 from /wrkdirs/usr/ports/devel/folly/work/folly-2021.04.05.00/folly/json.cpp:17:
/usr/local/lib/gcc10/include/c++/bits/hashtable_policy.h:318:12: note: 'struct std::__detail::_Node_iterator<std::pair<const folly::dynamic, folly::dynamic>, false, true>' declared here
  318 |     struct _Node_iterator
      |            ^~~~~~~~~~~~~~
[33/283] /usr/local/bin/g++10 -DFMT_SHARED -DFOLLY_XLOG_STRIP_PREFIXES=\"/wrkdirs/usr/ports/devel/folly/work/folly-2021.04.05.00:/wrkdirs/usr/ports/devel/folly/work/.build\" -DGFLAGS_IS_A_DLL=0 -D_GNU_SOURCE -D_REENTRANT -I/wrkdirs/usr/ports/devel/folly/work/folly-2021.04.05.00 -I. -O2 -pipe  -fstack-protector-strong -Wl,-rpath=/usr/local/lib/gcc10  -fPIC -Wl,-rpath=/usr/local/lib/gcc10 -DFOLLY_QUOTIENT_MULTI_SET_SUPPORTED=0 -O2 -pipe  -fstack-protector-strong -Wl,-rpath=/usr/local/lib/gcc10  -fPIC -Wl,-rpath=/usr/local/lib/gcc10 -DFOLLY_QUOTIENT_MULTI_SET_SUPPORTED=0 -g -Wall -Wextra -O3 -fPIC -g -std=gnu++1z -finput-charset=UTF-8 -fsigned-char -Wall -Wno-deprecated -Wno-deprecated-declarations -Wno-sign-compare -Wno-unused -Wunused-label -Wunused-result -Wshadow-compatible-local -Wno-noexcept-type -faligned-new -fopenmp -std=gnu++17 -MD -MT CMakeFiles/folly_base.dir/folly/json_patch.cpp.o -MF CMakeFiles/folly_base.dir/folly/json_patch.cpp.o.d -o CMakeFiles/folly_base.dir/folly/json
 _patch.cpp.o -c /wrkdirs/usr/ports/devel/folly/work/folly-2021.04.05.00/folly/json_patch.cpp
In file included from /wrkdirs/usr/ports/devel/folly/work/folly-2021.04.05.00/folly/Memory.h:38,
                 from /wrkdirs/usr/ports/devel/folly/work/folly-2021.04.05.00/folly/container/detail/F14Policy.h:23,
                 from /wrkdirs/usr/ports/devel/folly/work/folly-2021.04.05.00/folly/container/F14Map.h:42,
                 from /wrkdirs/usr/ports/devel/folly/work/folly-2021.04.05.00/folly/dynamic.h:68,
                 from /wrkdirs/usr/ports/devel/folly/work/folly-2021.04.05.00/folly/json_patch.h:21,
                 from /wrkdirs/usr/ports/devel/folly/work/folly-2021.04.05.00/folly/json_patch.cpp:17:
/wrkdirs/usr/ports/devel/folly/work/folly-2021.04.05.00/folly/memory/Malloc.h: In lambda function:
/wrkdirs/usr/ports/devel/folly/work/folly-2021.04.05.00/folly/memory/Malloc.h:92:17: warning: the address of 'void* mallocx(size_t, int)' will never be NULL [-Waddress]
   92 |     if (mallocx == nullptr || rallocx == nullptr || xallocx == nullptr ||
      |         ~~~~~~~~^~~~~~~~~~
/wrkdirs/usr/ports/devel/folly/work/folly-2021.04.05.00/folly/memory/Malloc.h:92:39: warning: the address of 'void* rallocx(void*, size_t, int)' will never be NULL [-Waddress]
   92 |     if (mallocx == nullptr || rallocx == nullptr || xallocx == nullptr ||
      |                               ~~~~~~~~^~~~~~~~~~
/wrkdirs/usr/ports/devel/folly/work/folly-2021.04.05.00/folly/memory/Malloc.h:92:61: warning: the address of 'size_t xallocx(void*, size_t, size_t, int)' will never be NULL [-Waddress]
   92 |     if (mallocx == nullptr || rallocx == nullptr || xallocx == nullptr ||
      |                                                     ~~~~~~~~^~~~~~~~~~
/wrkdirs/usr/ports/devel/folly/work/folly-2021.04.05.00/folly/memory/Malloc.h:93:17: warning: the address of 'size_t sallocx(const void*, int)' will never be NULL [-Waddress]
   93 |         sallocx == nullptr || dallocx == nullptr || sdallocx == nullptr ||
      |         ~~~~~~~~^~~~~~~~~~
/wrkdirs/usr/ports/devel/folly/work/folly-2021.04.05.00/folly/memory/Malloc.h:93:39: warning: the address of 'void dallocx(void*, int)' will never be NULL [-Waddress]
   93 |         sallocx == nullptr || dallocx == nullptr || sdallocx == nullptr ||
      |                               ~~~~~~~~^~~~~~~~~~
/wrkdirs/usr/ports/devel/folly/work/folly-2021.04.05.00/folly/memory/Malloc.h:93:62: warning: the address of 'void sdallocx(void*, size_t, int)' will never be NULL [-Waddress]
   93 |         sallocx == nullptr || dallocx == nullptr || sdallocx == nullptr ||
      |                                                     ~~~~~~~~~^~~~~~~~~~
/wrkdirs/usr/ports/devel/folly/work/folly-2021.04.05.00/folly/memory/Malloc.h:94:17: warning: the address of 'size_t nallocx(size_t, int)' will never be NULL [-Waddress]
   94 |         nallocx == nullptr || mallctl == nullptr ||
      |         ~~~~~~~~^~~~~~~~~~
/wrkdirs/usr/ports/devel/folly/work/folly-2021.04.05.00/folly/memory/Malloc.h:94:39: warning: the address of 'int mallctl(const char*, void*, size_t*, void*, size_t)' will never be NULL [-Waddress]
   94 |         nallocx == nullptr || mallctl == nullptr ||
      |                               ~~~~~~~~^~~~~~~~~~
/wrkdirs/usr/ports/devel/folly/work/folly-2021.04.05.00/folly/memory/Malloc.h:95:26: warning: the address of 'int mallctlnametomib(const char*, size_t*, size_t*)' will never be NULL [-Waddress]
   95 |         mallctlnametomib == nullptr || mallctlbymib == nullptr) {
      |         ~~~~~~~~~~~~~~~~~^~~~~~~~~~
/wrkdirs/usr/ports/devel/folly/work/folly-2021.04.05.00/folly/memory/Malloc.h:95:53: warning: the address of 'int mallctlbymib(const size_t*, size_t, void*, size_t*, void*, size_t)' will never be NULL [-Waddress]
   95 |         mallctlnametomib == nullptr || mallctlbymib == nullptr) {
      |                                        ~~~~~~~~~~~~~^~~~~~~~~~
/wrkdirs/usr/ports/devel/folly/work/folly-2021.04.05.00/folly/memory/Malloc.h: In lambda function:
/wrkdirs/usr/ports/devel/folly/work/folly-2021.04.05.00/folly/memory/Malloc.h:154:18: warning: the address of 'void sdallocx(void*, size_t, int)' will never be NULL [-Waddress]
  154 |         sdallocx == nullptr || nallocx == nullptr) {
      |         ~~~~~~~~~^~~~~~~~~~
/wrkdirs/usr/ports/devel/folly/work/folly-2021.04.05.00/folly/memory/Malloc.h:154:40: warning: the address of 'size_t nallocx(size_t, int)' will never be NULL [-Waddress]
  154 |         sdallocx == nullptr || nallocx == nullptr) {
      |                                ~~~~~~~~^~~~~~~~~~
In file included from /wrkdirs/usr/ports/devel/folly/work/folly-2021.04.05.00/folly/container/F14Map.h:1235,
                 from /wrkdirs/usr/ports/devel/folly/work/folly-2021.04.05.00/folly/dynamic.h:68,
                 from /wrkdirs/usr/ports/devel/folly/work/folly-2021.04.05.00/folly/json_patch.h:21,
                 from /wrkdirs/usr/ports/devel/folly/work/folly-2021.04.05.00/folly/json_patch.cpp:17:
/wrkdirs/usr/ports/devel/folly/work/folly-2021.04.05.00/folly/container/detail/F14MapFallback.h: In instantiation of 'static std::enable_if_t<(! std::is_constructible<Iter, const LocalIter&>::value), Iter> folly::f14::detail::F14BasicMap<K, M, H, E, A>::fromLocal(const LocalIter&) [with Iter = std::__detail::_Node_const_iterator<std::pair<const folly::dynamic, folly::dynamic>, false, true>; LocalIter = std::__detail::_Local_const_iterator<folly::dynamic, std::pair<const folly::dynamic, folly::dynamic>, std::__detail::_Select1st, folly::detail::DynamicHasher, std::__detail::_Mod_range_hashing, std::__detail::_Default_ranged_hash, false, true>; K = folly::dynamic; M = folly::dynamic; H = folly::detail::DynamicHasher; E = folly::detail::DynamicKeyEqual; A = std::allocator<std::pair<const folly::dynamic, folly::dynamic> >; std::enable_if_t<(! std::is_constructible<Iter, const LocalIter&>::value), Iter> = std::enable_if<true, std::__detail::_Node_const_iterator<std::pair<const folly::dyna
 mic, folly::dynamic>, false, true> >::type]':
/wrkdirs/usr/ports/devel/folly/work/folly-2021.04.05.00/folly/container/detail/F14MapFallback.h:400:29:   required from 'static Iter folly::f14::detail::F14BasicMap<K, M, H, E, A>::findImpl(Self&, const K2&) [with Iter = std::__detail::_Node_const_iterator<std::pair<const folly::dynamic, folly::dynamic>, false, true>; Self = const folly::f14::detail::F14BasicMap<folly::dynamic, folly::dynamic, folly::detail::DynamicHasher, folly::detail::DynamicKeyEqual, std::allocator<std::pair<const folly::dynamic, folly::dynamic> > >; K2 = folly::Range<const char*>; K = folly::dynamic; M = folly::dynamic; H = folly::detail::DynamicHasher; E = folly::detail::DynamicKeyEqual; A = std::allocator<std::pair<const folly::dynamic, folly::dynamic> >]'
/wrkdirs/usr/ports/devel/folly/work/folly-2021.04.05.00/folly/container/detail/F14MapFallback.h:416:36:   required from 'folly::f14::detail::F14BasicMap<K, M, H, E, A>::EnableHeterogeneousFind<K2, typename std::unordered_map<_Key1, _Tp1, _Hash1, _Pred1, _Alloc1>::const_iterator> folly::f14::detail::F14BasicMap<K, M, H, E, A>::find(const K2&) const [with K2 = folly::Range<const char*>; K = folly::dynamic; M = folly::dynamic; H = folly::detail::DynamicHasher; E = folly::detail::DynamicKeyEqual; A = std::allocator<std::pair<const folly::dynamic, folly::dynamic> >; folly::f14::detail::F14BasicMap<K, M, H, E, A>::EnableHeterogeneousFind<K2, typename std::unordered_map<_Key1, _Tp1, _Hash1, _Pred1, _Alloc1>::const_iterator> = std::enable_if<true, std::__detail::_Node_const_iterator<std::pair<const folly::dynamic, folly::dynamic>, false, true> >::type; typename std::unordered_map<_Key1, _Tp1, _Hash1, _Pred1, _Alloc1>::const_iterator = std::__detail::_Hashtable_base<folly::dynamic, std::pair<
 const folly::dynamic, folly::dynamic>, std::__detail::_Select1st, folly::detail::DynamicKeyEqual, folly::detail::DynamicHasher, std::__detail::_Mod_range_hashing, std::__detail::_Default_ranged_hash, std::__detail::_Hashtable_traits<true, false, true> >::const_iterator]'
/wrkdirs/usr/ports/devel/folly/work/folly-2021.04.05.00/folly/dynamic-inl.h:814:36:   required from here
/wrkdirs/usr/ports/devel/folly/work/folly-2021.04.05.00/folly/container/detail/F14MapFallback.h:387:16: warning: 'void* memcpy(void*, const void*, size_t)' copying an object of non-trivial type 'struct std::__detail::_Node_const_iterator<std::pair<const folly::dynamic, folly::dynamic>, false, true>' from an array of 'const struct std::__detail::_Local_const_iterator<folly::dynamic, std::pair<const folly::dynamic, folly::dynamic>, std::__detail::_Select1st, folly::detail::DynamicHasher, std::__detail::_Mod_range_hashing, std::__detail::_Default_ranged_hash, false, true>' [-Wclass-memaccess]
  387 |     std::memcpy(std::addressof(dst), std::addressof(src), sizeof(dst));
      |     ~~~~~~~~~~~^~~~~~~~~~~~~~~~~~~~~~~~~~~~~~~~~~~~~~~~~~~~~~~~~~~~~~~
In file included from /usr/local/lib/gcc10/include/c++/bits/hashtable.h:35,
                 from /usr/local/lib/gcc10/include/c++/unordered_map:46,
                 from /usr/local/lib/gcc10/include/c++/functional:61,
                 from /wrkdirs/usr/ports/devel/folly/work/folly-2021.04.05.00/folly/Optional.h:58,
                 from /wrkdirs/usr/ports/devel/folly/work/folly-2021.04.05.00/folly/Expected.h:35,
                 from /wrkdirs/usr/ports/devel/folly/work/folly-2021.04.05.00/folly/json_patch.h:19,
                 from /wrkdirs/usr/ports/devel/folly/work/folly-2021.04.05.00/folly/json_patch.cpp:17:
/usr/local/lib/gcc10/include/c++/bits/hashtable_policy.h:369:12: note: 'struct std::__detail::_Node_const_iterator<std::pair<const folly::dynamic, folly::dynamic>, false, true>' declared here
  369 |     struct _Node_const_iterator
      |            ^~~~~~~~~~~~~~~~~~~~
In file included from /wrkdirs/usr/ports/devel/folly/work/folly-2021.04.05.00/folly/container/F14Map.h:1235,
                 from /wrkdirs/usr/ports/devel/folly/work/folly-2021.04.05.00/folly/dynamic.h:68,
                 from /wrkdirs/usr/ports/devel/folly/work/folly-2021.04.05.00/folly/json_patch.h:21,
                 from /wrkdirs/usr/ports/devel/folly/work/folly-2021.04.05.00/folly/json_patch.cpp:17:
/wrkdirs/usr/ports/devel/folly/work/folly-2021.04.05.00/folly/container/detail/F14MapFallback.h: In instantiation of 'static std::enable_if_t<(! std::is_constructible<Iter, const LocalIter&>::value), Iter> folly::f14::detail::F14BasicMap<K, M, H, E, A>::fromLocal(const LocalIter&) [with Iter = std::__detail::_Node_iterator<std::pair<const folly::dynamic, folly::dynamic>, false, true>; LocalIter = std::__detail::_Local_iterator<folly::dynamic, std::pair<const folly::dynamic, folly::dynamic>, std::__detail::_Select1st, folly::detail::DynamicHasher, std::__detail::_Mod_range_hashing, std::__detail::_Default_ranged_hash, false, true>; K = folly::dynamic; M = folly::dynamic; H = folly::detail::DynamicHasher; E = folly::detail::DynamicKeyEqual; A = std::allocator<std::pair<const folly::dynamic, folly::dynamic> >; std::enable_if_t<(! std::is_constructible<Iter, const LocalIter&>::value), Iter> = std::enable_if<true, std::__detail::_Node_iterator<std::pair<const folly::dynamic, folly::dynami
 c>, false, true> >::type]':
/wrkdirs/usr/ports/devel/folly/work/folly-2021.04.05.00/folly/container/detail/F14MapFallback.h:400:29:   required from 'static Iter folly::f14::detail::F14BasicMap<K, M, H, E, A>::findImpl(Self&, const K2&) [with Iter = std::__detail::_Node_iterator<std::pair<const folly::dynamic, folly::dynamic>, false, true>; Self = folly::f14::detail::F14BasicMap<folly::dynamic, folly::dynamic, folly::detail::DynamicHasher, folly::detail::DynamicKeyEqual, std::allocator<std::pair<const folly::dynamic, folly::dynamic> > >; K2 = folly::Range<const char*>; K = folly::dynamic; M = folly::dynamic; H = folly::detail::DynamicHasher; E = folly::detail::DynamicKeyEqual; A = std::allocator<std::pair<const folly::dynamic, folly::dynamic> >]'
/wrkdirs/usr/ports/devel/folly/work/folly-2021.04.05.00/folly/container/detail/F14MapFallback.h:411:30:   required from 'folly::f14::detail::F14BasicMap<K, M, H, E, A>::EnableHeterogeneousFind<K2, typename std::unordered_map<_Key1, _Tp1, _Hash1, _Pred1, _Alloc1>::iterator> folly::f14::detail::F14BasicMap<K, M, H, E, A>::find(const K2&) [with K2 = folly::Range<const char*>; K = folly::dynamic; M = folly::dynamic; H = folly::detail::DynamicHasher; E = folly::detail::DynamicKeyEqual; A = std::allocator<std::pair<const folly::dynamic, folly::dynamic> >; folly::f14::detail::F14BasicMap<K, M, H, E, A>::EnableHeterogeneousFind<K2, typename std::unordered_map<_Key1, _Tp1, _Hash1, _Pred1, _Alloc1>::iterator> = std::enable_if<true, std::__detail::_Node_iterator<std::pair<const folly::dynamic, folly::dynamic>, false, true> >::type; typename std::unordered_map<_Key1, _Tp1, _Hash1, _Pred1, _Alloc1>::iterator = std::__detail::_Hashtable_base<folly::dynamic, std::pair<const folly::dynamic, folly::d
 ynamic>, std::__detail::_Select1st, folly::detail::DynamicKeyEqual, folly::detail::DynamicHasher, std::__detail::_Mod_range_hashing, std::__detail::_Default_ranged_hash, std::__detail::_Hashtable_traits<true, false, true> >::iterator]'
/wrkdirs/usr/ports/devel/folly/work/folly-2021.04.05.00/folly/dynamic-inl.h:818:36:   required from here
/wrkdirs/usr/ports/devel/folly/work/folly-2021.04.05.00/folly/container/detail/F14MapFallback.h:387:16: warning: 'void* memcpy(void*, const void*, size_t)' copying an object of non-trivial type 'struct std::__detail::_Node_iterator<std::pair<const folly::dynamic, folly::dynamic>, false, true>' from an array of 'const struct std::__detail::_Local_iterator<folly::dynamic, std::pair<const folly::dynamic, folly::dynamic>, std::__detail::_Select1st, folly::detail::DynamicHasher, std::__detail::_Mod_range_hashing, std::__detail::_Default_ranged_hash, false, true>' [-Wclass-memaccess]
  387 |     std::memcpy(std::addressof(dst), std::addressof(src), sizeof(dst));
      |     ~~~~~~~~~~~^~~~~~~~~~~~~~~~~~~~~~~~~~~~~~~~~~~~~~~~~~~~~~~~~~~~~~~
In file included from /usr/local/lib/gcc10/include/c++/bits/hashtable.h:35,
                 from /usr/local/lib/gcc10/include/c++/unordered_map:46,
                 from /usr/local/lib/gcc10/include/c++/functional:61,
                 from /wrkdirs/usr/ports/devel/folly/work/folly-2021.04.05.00/folly/Optional.h:58,
                 from /wrkdirs/usr/ports/devel/folly/work/folly-2021.04.05.00/folly/Expected.h:35,
                 from /wrkdirs/usr/ports/devel/folly/work/folly-2021.04.05.00/folly/json_patch.h:19,
                 from /wrkdirs/usr/ports/devel/folly/work/folly-2021.04.05.00/folly/json_patch.cpp:17:
/usr/local/lib/gcc10/include/c++/bits/hashtable_policy.h:318:12: note: 'struct std::__detail::_Node_iterator<std::pair<const folly::dynamic, folly::dynamic>, false, true>' declared here
  318 |     struct _Node_iterator
      |            ^~~~~~~~~~~~~~
ninja: build stopped: subcommand failed.
===> Compilation failed unexpectedly.
Try to set MAKE_JOBS_UNSAFE=yes and rebuild before reporting the failure to
the maintainer.
*** Error code 1

Stop.
make: stopped in /usr/ports/devel/folly
Received on Thu Jun 24 2021 - 02:45:51 UTC

Original text of this message