[package - 130amd64-quarterly][security/sedutil] Failed for sedutil-1.12 in build

From: <pkg-fallout_at_FreeBSD.org>
Date: Thu, 24 Jun 2021 01:17:09 GMT
You are receiving this mail as a port that you maintain
is failing to build on the FreeBSD package build server.
Please investigate the failure and submit a PR to fix
build.

Maintainer:     ken_at_FreeBSD.org
Log URL:        http://beefy14.nyi.freebsd.org/data/130amd64-quarterly/3e55273e25e2/logs/sedutil-1.12.log
Build URL:      http://beefy14.nyi.freebsd.org/build.html?mastername=130amd64-quarterly&build=3e55273e25e2
Log:

=>> Building security/sedutil
build started at Thu Jun 24 01:17:03 UTC 2021
port directory: /usr/ports/security/sedutil
package name: sedutil-1.12
building for: FreeBSD 130amd64-quarterly-job-04 13.0-RELEASE-p2 FreeBSD 13.0-RELEASE-p2 amd64
maintained by: ken_at_FreeBSD.org
Makefile ident: 
Poudriere version: 3.2.8-8-gaf08dbda
Host OSVERSION: 1400008
Jail OSVERSION: 1300139
Job Id: 04

---Begin Environment---
SHELL=/bin/csh
OSVERSION=1300139
UNAME_v=FreeBSD 13.0-RELEASE-p2
UNAME_r=13.0-RELEASE-p2
BLOCKSIZE=K
MAIL=/var/mail/root
MM_CHARSET=UTF-8
LANG=C.UTF-8
STATUS=1
HOME=/root
PATH=/sbin:/bin:/usr/sbin:/usr/bin:/usr/local/sbin:/usr/local/bin:/root/bin
LOCALBASE=/usr/local
USER=root
LIBEXECPREFIX=/usr/local/libexec/poudriere
POUDRIERE_VERSION=3.2.8-8-gaf08dbda
MASTERMNT=/usr/local/poudriere/data/.m/130amd64-quarterly/ref
POUDRIERE_BUILD_TYPE=bulk
PACKAGE_BUILDING=yes
SAVED_TERM=
PWD=/usr/local/poudriere/data/.m/130amd64-quarterly/ref/.p/pool
P_PORTS_FEATURES=FLAVORS SELECTED_OPTIONS
MASTERNAME=130amd64-quarterly
SCRIPTPREFIX=/usr/local/share/poudriere
OLDPWD=/usr/local/poudriere/data/.m/130amd64-quarterly/ref/.p
SCRIPTPATH=/usr/local/share/poudriere/bulk.sh
POUDRIEREPATH=/usr/local/bin/poudriere
---End Environment---

---Begin Poudriere Port Flags/Env---
PORT_FLAGS=
PKGENV=
FLAVOR=
DEPENDS_ARGS=
MAKE_ARGS=
---End Poudriere Port Flags/Env---

---Begin OPTIONS List---
---End OPTIONS List---

--MAINTAINER--
ken_at_FreeBSD.org
--End MAINTAINER--

--CONFIGURE_ARGS--

--End CONFIGURE_ARGS--

--CONFIGURE_ENV--
MAKE=gmake PKG_CONFIG=pkgconf XDG_DATA_HOME=/wrkdirs/usr/ports/security/sedutil/work  XDG_CONFIG_HOME=/wrkdirs/usr/ports/security/sedutil/work  HOME=/wrkdirs/usr/ports/security/sedutil/work TMPDIR="/tmp" PATH=/wrkdirs/usr/ports/security/sedutil/work/.bin:/sbin:/bin:/usr/sbin:/usr/bin:/usr/local/sbin:/usr/local/bin:/root/bin SHELL=/bin/sh CONFIG_SHELL=/bin/sh
--End CONFIGURE_ENV--

--MAKE_ENV--
XDG_DATA_HOME=/wrkdirs/usr/ports/security/sedutil/work  XDG_CONFIG_HOME=/wrkdirs/usr/ports/security/sedutil/work  HOME=/wrkdirs/usr/ports/security/sedutil/work TMPDIR="/tmp" PATH=/wrkdirs/usr/ports/security/sedutil/work/.bin:/sbin:/bin:/usr/sbin:/usr/bin:/usr/local/sbin:/usr/local/bin:/root/bin NO_PIE=yes MK_DEBUG_FILES=no MK_KERNEL_SYMBOLS=no SHELL=/bin/sh NO_LINT=YES PREFIX=/usr/local  LOCALBASE=/usr/local  CC="cc" CFLAGS="-O2 -pipe  -fstack-protector-strong -fno-strict-aliasing "  CPP="cpp" CPPFLAGS=""  LDFLAGS=" -fstack-protector-strong " LIBS=""  CXX="c++" CXXFLAGS="-O2 -pipe -fstack-protector-strong -fno-strict-aliasing  "  MANPREFIX="/usr/local" BSD_INSTALL_PROGRAM="install  -s -m 555"  BSD_INSTALL_LIB="install  -s -m 0644"  BSD_INSTALL_SCRIPT="install  -m 555"  BSD_INSTALL_DATA="install  -m 0644"  BSD_INSTALL_MAN="install  -m 444"
--End MAKE_ENV--

--PLIST_SUB--
OSREL=13.0 PREFIX=%D LOCALBASE=/usr/local  RESETPREFIX=/usr/local LIB32DIR=lib DOCSDIR="share/doc/sedutil"  EXAMPLESDIR="share/examples/sedutil"  DATADIR="share/sedutil"  WWWDIR="www/sedutil"  ETCDIR="etc/sedutil"
--End PLIST_SUB--

--SUB_LIST--
PREFIX=/usr/local LOCALBASE=/usr/local  DATADIR=/usr/local/share/sedutil DOCSDIR=/usr/local/share/doc/sedutil EXAMPLESDIR=/usr/local/share/examples/sedutil  WWWDIR=/usr/local/www/sedutil ETCDIR=/usr/local/etc/sedutil
--End SUB_LIST--

---Begin make.conf---
USE_PACKAGE_DEPENDS=yes
BATCH=yes
WRKDIRPREFIX=/wrkdirs
PORTSDIR=/usr/ports
PACKAGES=/packages
DISTDIR=/distfiles
PACKAGE_BUILDING=yes
PACKAGE_BUILDING_FLAVORS=yes
#### /usr/local/etc/poudriere.d/make.conf ####
# XXX: We really need this but cannot use it while 'make checksum' does not
# try the next mirror on checksum failure.  It currently retries the same
# failed mirror and then fails rather then trying another.  It *does*
# try the next if the size is mismatched though.
#MASTER_SITE_FREEBSD=yes
# Build ALLOW_MAKE_JOBS_PACKAGES with 2 jobs
MAKE_JOBS_NUMBER=2
#### /usr/ports/Mk/Scripts/ports_env.sh ####
_CCVERSION_921dbbb2=FreeBSD clang version 11.0.1 (git_at_github.com:llvm/llvm-project.git llvmorg-11.0.1-0-g43ff75f2c3fe) Target: x86_64-unknown-freebsd13.0 Thread model: posix InstalledDir: /usr/bin
_ALTCCVERSION_921dbbb2=none
_CXXINTERNAL_acaad9ca=FreeBSD clang version 11.0.1 (git_at_github.com:llvm/llvm-project.git llvmorg-11.0.1-0-g43ff75f2c3fe) Target: x86_64-unknown-freebsd13.0 Thread model: posix InstalledDir: /usr/bin "/usr/bin/ld" "--eh-frame-hdr" "-dynamic-linker" "/libexec/ld-elf.so.1" "--hash-style=both" "--enable-new-dtags" "-o" "a.out" "/usr/lib/crt1.o" "/usr/lib/crti.o" "/usr/lib/crtbegin.o" "-L/usr/lib" "/dev/null" "-lc++" "-lm" "-lgcc" "--as-needed" "-lgcc_s" "--no-as-needed" "-lc" "-lgcc" "--as-needed" "-lgcc_s" "--no-as-needed" "/usr/lib/crtend.o" "/usr/lib/crtn.o"
CC_OUTPUT_921dbbb2_58173849=yes
CC_OUTPUT_921dbbb2_9bdba57c=yes
CC_OUTPUT_921dbbb2_6a4fe7f5=yes
CC_OUTPUT_921dbbb2_6bcac02b=yes
CC_OUTPUT_921dbbb2_67d20829=yes
CC_OUTPUT_921dbbb2_bfa62e83=yes
CC_OUTPUT_921dbbb2_f0b4d593=yes
CC_OUTPUT_921dbbb2_308abb44=yes
CC_OUTPUT_921dbbb2_f00456e5=yes
CC_OUTPUT_921dbbb2_65ad290d=yes
CC_OUTPUT_921dbbb2_f2776b26=yes
CC_OUTPUT_921dbbb2_b2657cc3=yes
CC_OUTPUT_921dbbb2_380987f7=yes
CC_OUTPUT_921dbbb2_160933ec=yes
CC_OUTPUT_921dbbb2_fb62803b=yes
_OBJC_CCVERSION_921dbbb2=FreeBSD clang version 11.0.1 (git_at_github.com:llvm/llvm-project.git llvmorg-11.0.1-0-g43ff75f2c3fe) Target: x86_64-unknown-freebsd13.0 Thread model: posix InstalledDir: /usr/bin
_OBJC_ALTCCVERSION_921dbbb2=none
ARCH=amd64
OPSYS=FreeBSD
_OSRELEASE=13.0-RELEASE-p2
OSREL=13.0
OSVERSION=1300139
PYTHONBASE=/usr/local
HAVE_COMPAT_IA32_KERN=YES
CONFIGURE_MAX_CMD_LEN=524288
HAVE_PORTS_ENV=1
#### Misc Poudriere ####
GID=0
UID=0
DISABLE_MAKE_JOBS=poudriere
---End make.conf---
--Resource limits--
cpu time               (seconds, -t)  unlimited
file size           (512-blocks, -f)  unlimited
data seg size           (kbytes, -d)  33554432
stack size              (kbytes, -s)  524288
core file size      (512-blocks, -c)  unlimited
max memory size         (kbytes, -m)  unlimited
locked memory           (kbytes, -l)  unlimited
max user processes              (-u)  89999
open files                      (-n)  1024
virtual mem size        (kbytes, -v)  unlimited
swap limit              (kbytes, -w)  unlimited
socket buffer size       (bytes, -b)  unlimited
pseudo-terminals                (-p)  unlimited
kqueues                         (-k)  unlimited
umtx shared locks               (-o)  unlimited
--End resource limits--
=======================<phase: check-sanity   >============================
===>  License GPLv3+ accepted by the user
===========================================================================
=======================<phase: pkg-depends    >============================
===>   sedutil-1.12 depends on file: /usr/local/sbin/pkg - not found
===>   Installing existing package /packages/All/pkg-1.16.3.txz
[130amd64-quarterly-job-04] Installing pkg-1.16.3...
[130amd64-quarterly-job-04] Extracting pkg-1.16.3: .......... done
===>   sedutil-1.12 depends on file: /usr/local/sbin/pkg - found
===>   Returning to build of sedutil-1.12
===========================================================================
=======================<phase: fetch-depends  >============================
===========================================================================
=======================<phase: fetch          >============================
===>  License GPLv3+ accepted by the user
===> Fetching all distfiles required by sedutil-1.12 for building
===========================================================================
=======================<phase: checksum       >============================
===>  License GPLv3+ accepted by the user
===> Fetching all distfiles required by sedutil-1.12 for building
=> SHA256 Checksum OK for kendmerry-sedutil-1.12-3122ba0_GH0.tar.gz.
===========================================================================
=======================<phase: extract-depends>============================
===========================================================================
=======================<phase: extract        >============================
===>  License GPLv3+ accepted by the user
===> Fetching all distfiles required by sedutil-1.12 for building
===>  Extracting for sedutil-1.12
=> SHA256 Checksum OK for kendmerry-sedutil-1.12-3122ba0_GH0.tar.gz.
===========================================================================
=======================<phase: patch-depends  >============================
===========================================================================
=======================<phase: patch          >============================
===>  Patching for sedutil-1.12
===========================================================================
=======================<phase: build-depends  >============================
===>   sedutil-1.12 depends on package: gmake>=4.3 - not found
===>   Installing existing package /packages/All/gmake-4.3_2.txz
[130amd64-quarterly-job-04] Installing gmake-4.3_2...
[130amd64-quarterly-job-04] `-- Installing gettext-runtime-0.21...
[130amd64-quarterly-job-04] |   `-- Installing indexinfo-0.3.1...
[130amd64-quarterly-job-04] |   `-- Extracting indexinfo-0.3.1: .... done
[130amd64-quarterly-job-04] `-- Extracting gettext-runtime-0.21: .......... done
[130amd64-quarterly-job-04] Extracting gmake-4.3_2: .......... done
===>   sedutil-1.12 depends on package: gmake>=4.3 - found
===>   Returning to build of sedutil-1.12
===>   sedutil-1.12 depends on package: pkgconf>=1.3.0_1 - not found
===>   Installing existing package /packages/All/pkgconf-1.7.4,1.txz
[130amd64-quarterly-job-04] Installing pkgconf-1.7.4,1...
[130amd64-quarterly-job-04] Extracting pkgconf-1.7.4,1: .......... done
===>   sedutil-1.12 depends on package: pkgconf>=1.3.0_1 - found
===>   Returning to build of sedutil-1.12
===========================================================================
=======================<phase: lib-depends    >============================
===========================================================================
=======================<phase: configure      >============================
===>  Configuring for sedutil-1.12
===========================================================================
=======================<phase: build          >============================
===>  Building for sedutil-1.12
gmake[1]: Entering directory '/wrkdirs/usr/ports/security/sedutil/work/sedutil-3122ba0/freebsd/CLI'
./GitVersion.sh > ../Version.h
./GitVersion.sh: git: not found
"gmake" -f nbproject/Makefile-Release.mk QMAKE= SUBPROJECTS= .build-conf
gmake[2]: Entering directory '/wrkdirs/usr/ports/security/sedutil/work/sedutil-3122ba0/freebsd/CLI'
"gmake"  -f nbproject/Makefile-Release.mk dist/Release/CLang-Generic/sedutil-cli
gmake[3]: Entering directory '/wrkdirs/usr/ports/security/sedutil/work/sedutil-3122ba0/freebsd/CLI'
mkdir -p build/Release/CLang-Generic/_ext/7a2a93ab
rm -f "build/Release/CLang-Generic/_ext/7a2a93ab/DtaAnnotatedDump.o.d"
clang++ -Wall   -c -Werror -I.. -I../../Common -I../../Common/pbkdf2 -std=c++11 -MMD -MP -MF "build/Release/CLang-Generic/_ext/7a2a93ab/DtaAnnotatedDump.o.d" -o build/Release/CLang-Generic/_ext/7a2a93ab/DtaAnnotatedDump.o ../../Common/DtaAnnotatedDump.cpp
In file included from ../../Common/DtaAnnotatedDump.cpp:31:
./../Common/DtaAnnotatedDump.h:20:14: error: anonymous non-C-compatible type given name for linkage purposes by typedef declaration; add a tag name here [-Werror,-Wnon-c-typedef-for-linkage]
typedef union
             ^
              CAtomHeader
./../Common/DtaAnnotatedDump.h:28:5: note: type is not C-compatible due to this member declaration
    public:
    ^~~~~~~
./../Common/DtaAnnotatedDump.h:100:3: note: type is given name 'CAtomHeader' for linkage purposes by this typedef declaration
} CAtomHeader;
  ^
1 error generated.
gmake[3]: *** [nbproject/Makefile-Release.mk:89: build/Release/CLang-Generic/_ext/7a2a93ab/DtaAnnotatedDump.o] Error 1
gmake[3]: Leaving directory '/wrkdirs/usr/ports/security/sedutil/work/sedutil-3122ba0/freebsd/CLI'
gmake[2]: *** [nbproject/Makefile-Release.mk:80: .build-conf] Error 2
gmake[2]: Leaving directory '/wrkdirs/usr/ports/security/sedutil/work/sedutil-3122ba0/freebsd/CLI'
gmake[1]: *** [nbproject/Makefile-impl.mk:40: .build-impl] Error 2
gmake[1]: Leaving directory '/wrkdirs/usr/ports/security/sedutil/work/sedutil-3122ba0/freebsd/CLI'
*** Error code 1

Stop.
make: stopped in /usr/ports/security/sedutil
Received on Thu Jun 24 2021 - 01:17:09 UTC

Original text of this message