[package - 130arm64-quarterly][sysutils/samesame] Failed for samesame-1.10_2 in build

From: <pkg-fallout_at_FreeBSD.org>
Date: Wed, 23 Jun 2021 15:52:10 GMT
You are receiving this mail as a port that you maintain
is failing to build on the FreeBSD package build server.
Please investigate the failure and submit a PR to fix
build.

Maintainer:     samesame_at_akruijff.dds.nl
Log URL:        http://ampere1.nyi.freebsd.org/data/130arm64-quarterly/dbe1c4c35016/logs/samesame-1.10_2.log
Build URL:      http://ampere1.nyi.freebsd.org/build.html?mastername=130arm64-quarterly&build=dbe1c4c35016
Log:

=>> Building sysutils/samesame
build started at Wed Jun 23 15:51:54 UTC 2021
port directory: /usr/ports/sysutils/samesame
package name: samesame-1.10_2
building for: FreeBSD 130arm64-quarterly-job-02 13.0-RELEASE-p2 FreeBSD 13.0-RELEASE-p2 arm64
maintained by: samesame_at_akruijff.dds.nl
Makefile ident: 
Poudriere version: 3.2.8-8-gaf08dbda
Host OSVERSION: 1400008
Jail OSVERSION: 1300139
Job Id: 02

---Begin Environment---
SHELL=/bin/csh
OSVERSION=1300139
UNAME_v=FreeBSD 13.0-RELEASE-p2
UNAME_r=13.0-RELEASE-p2
BLOCKSIZE=K
MAIL=/var/mail/root
MM_CHARSET=UTF-8
LANG=C.UTF-8
STATUS=1
HOME=/root
PATH=/sbin:/bin:/usr/sbin:/usr/bin:/usr/local/sbin:/usr/local/bin:/root/bin
LOCALBASE=/usr/local
USER=root
LIBEXECPREFIX=/usr/local/libexec/poudriere
POUDRIERE_VERSION=3.2.8-8-gaf08dbda
MASTERMNT=/usr/local/poudriere/data/.m/130arm64-quarterly/ref
POUDRIERE_BUILD_TYPE=bulk
PACKAGE_BUILDING=yes
SAVED_TERM=
PWD=/usr/local/poudriere/data/.m/130arm64-quarterly/ref/.p/pool
P_PORTS_FEATURES=FLAVORS SELECTED_OPTIONS
MASTERNAME=130arm64-quarterly
SCRIPTPREFIX=/usr/local/share/poudriere
OLDPWD=/usr/local/poudriere/data/.m/130arm64-quarterly/ref/.p
SCRIPTPATH=/usr/local/share/poudriere/bulk.sh
POUDRIEREPATH=/usr/local/bin/poudriere
---End Environment---

---Begin Poudriere Port Flags/Env---
PORT_FLAGS=
PKGENV=
FLAVOR=
DEPENDS_ARGS=
MAKE_ARGS=
---End Poudriere Port Flags/Env---

---Begin OPTIONS List---
===> The following configuration options are available for samesame-1.10_2:
     DEBUG=off: Build with debugging support
     DISK_STORAGE=off: Allows temporarily storage on disk
     EXPERIMENTAL=off: Enables experimental functionality
     LOW_MEMORY_PROFILE=off: Low memory profile reduces functionality
     PROFILER=off: Enables gprof support
===> Use 'make config' to modify these settings
---End OPTIONS List---

--MAINTAINER--
samesame_at_akruijff.dds.nl
--End MAINTAINER--

--CONFIGURE_ARGS--
--enable-samechflags --enable-samechmod  --mandir="/usr/local/man" --prefix="/usr/local"  --includedir="/usr/local/include" --libdir="/usr/local/lib" --disable-debug --disable-disk-storage --disable-experimental --disable-fsort --disable-profiler
--End CONFIGURE_ARGS--

--CONFIGURE_ENV--
XDG_DATA_HOME=/wrkdirs/usr/ports/sysutils/samesame/work  XDG_CONFIG_HOME=/wrkdirs/usr/ports/sysutils/samesame/work  HOME=/wrkdirs/usr/ports/sysutils/samesame/work TMPDIR="/tmp" PATH=/wrkdirs/usr/ports/sysutils/samesame/work/.bin:/sbin:/bin:/usr/sbin:/usr/bin:/usr/local/sbin:/usr/local/bin:/root/bin SHELL=/bin/sh CONFIG_SHELL=/bin/sh
--End CONFIGURE_ENV--

--MAKE_ENV--
XDG_DATA_HOME=/wrkdirs/usr/ports/sysutils/samesame/work  XDG_CONFIG_HOME=/wrkdirs/usr/ports/sysutils/samesame/work  HOME=/wrkdirs/usr/ports/sysutils/samesame/work TMPDIR="/tmp" PATH=/wrkdirs/usr/ports/sysutils/samesame/work/.bin:/sbin:/bin:/usr/sbin:/usr/bin:/usr/local/sbin:/usr/local/bin:/root/bin NO_PIE=yes MK_DEBUG_FILES=no MK_KERNEL_SYMBOLS=no SHELL=/bin/sh NO_LINT=YES PREFIX=/usr/local  LOCALBASE=/usr/local  CC="cc" CFLAGS="-O2 -pipe  -fstack-protector-strong -fno-strict-aliasing "  CPP="cpp" CPPFLAGS=""  LDFLAGS=" -fstack-protector-strong " LIBS=""  CXX="c++" CXXFLAGS="-O2 -pipe -fstack-protector-strong -fno-strict-aliasing  "  MANPREFIX="/usr/local" BSD_INSTALL_PROGRAM="install  -s -m 555"  BSD_INSTALL_LIB="install  -s -m 0644"  BSD_INSTALL_SCRIPT="install  -m 555"  BSD_INSTALL_DATA="install  -m 0644"  BSD_INSTALL_MAN="install  -m 444"
--End MAKE_ENV--

--PLIST_SUB--
DEBUG="_at_comment " NO_DEBUG="" DISK_STORAGE="_at_comment " NO_DISK_STORAGE="" EXPERIMENTAL="_at_comment " NO_EXPERIMENTAL="" LOW_MEMORY_PROFILE="_at_comment " NO_LOW_MEMORY_PROFILE="" PROFILER="_at_comment " NO_PROFILER="" OSREL=13.0 PREFIX=%D LOCALBASE=/usr/local  RESETPREFIX=/usr/local LIB32DIR=lib DOCSDIR="share/doc/samesame"  EXAMPLESDIR="share/examples/samesame"  DATADIR="share/samesame"  WWWDIR="www/samesame"  ETCDIR="etc/samesame"
--End PLIST_SUB--

--SUB_LIST--
DEBUG="_at_comment " NO_DEBUG="" DISK_STORAGE="_at_comment " NO_DISK_STORAGE="" EXPERIMENTAL="_at_comment " NO_EXPERIMENTAL="" LOW_MEMORY_PROFILE="_at_comment " NO_LOW_MEMORY_PROFILE="" PROFILER="_at_comment " NO_PROFILER="" PREFIX=/usr/local LOCALBASE=/usr/local  DATADIR=/usr/local/share/samesame DOCSDIR=/usr/local/share/doc/samesame EXAMPLESDIR=/usr/local/share/examples/samesame  WWWDIR=/usr/local/www/samesame ETCDIR=/usr/local/etc/samesame
--End SUB_LIST--

---Begin make.conf---
USE_PACKAGE_DEPENDS=yes
BATCH=yes
WRKDIRPREFIX=/wrkdirs
PORTSDIR=/usr/ports
PACKAGES=/packages
DISTDIR=/distfiles
PACKAGE_BUILDING=yes
PACKAGE_BUILDING_FLAVORS=yes
#### /usr/local/etc/poudriere.d/make.conf ####
# XXX: We really need this but cannot use it while 'make checksum' does not
# try the next mirror on checksum failure.  It currently retries the same
# failed mirror and then fails rather then trying another.  It *does*
# try the next if the size is mismatched though.
#MASTER_SITE_FREEBSD=yes
# Build ALLOW_MAKE_JOBS_PACKAGES with 2 jobs
MAKE_JOBS_NUMBER=2
#### /usr/ports/Mk/Scripts/ports_env.sh ####
_CCVERSION_921dbbb2=FreeBSD clang version 11.0.1 (git_at_github.com:llvm/llvm-project.git llvmorg-11.0.1-0-g43ff75f2c3fe) Target: aarch64-unknown-freebsd13.0 Thread model: posix InstalledDir: /usr/bin
_ALTCCVERSION_921dbbb2=none
_CXXINTERNAL_acaad9ca=FreeBSD clang version 11.0.1 (git_at_github.com:llvm/llvm-project.git llvmorg-11.0.1-0-g43ff75f2c3fe) Target: aarch64-unknown-freebsd13.0 Thread model: posix InstalledDir: /usr/bin "/usr/bin/ld" "--eh-frame-hdr" "-dynamic-linker" "/libexec/ld-elf.so.1" "--enable-new-dtags" "-o" "a.out" "/usr/lib/crt1.o" "/usr/lib/crti.o" "/usr/lib/crtbegin.o" "-L/usr/lib" "/dev/null" "-lc++" "-lm" "-lgcc" "--as-needed" "-lgcc_s" "--no-as-needed" "-lc" "-lgcc" "--as-needed" "-lgcc_s" "--no-as-needed" "/usr/lib/crtend.o" "/usr/lib/crtn.o"
CC_OUTPUT_921dbbb2_58173849=yes
CC_OUTPUT_921dbbb2_9bdba57c=yes
CC_OUTPUT_921dbbb2_6a4fe7f5=yes
CC_OUTPUT_921dbbb2_6bcac02b=yes
CC_OUTPUT_921dbbb2_67d20829=yes
CC_OUTPUT_921dbbb2_bfa62e83=yes
CC_OUTPUT_921dbbb2_f0b4d593=yes
CC_OUTPUT_921dbbb2_308abb44=yes
CC_OUTPUT_921dbbb2_f00456e5=yes
CC_OUTPUT_921dbbb2_65ad290d=yes
CC_OUTPUT_921dbbb2_f2776b26=yes
CC_OUTPUT_921dbbb2_b2657cc3=yes
CC_OUTPUT_921dbbb2_380987f7=yes
CC_OUTPUT_921dbbb2_160933ec=yes
CC_OUTPUT_921dbbb2_fb62803b=yes
_OBJC_CCVERSION_921dbbb2=FreeBSD clang version 11.0.1 (git_at_github.com:llvm/llvm-project.git llvmorg-11.0.1-0-g43ff75f2c3fe) Target: aarch64-unknown-freebsd13.0 Thread model: posix InstalledDir: /usr/bin
_OBJC_ALTCCVERSION_921dbbb2=none
ARCH=aarch64
OPSYS=FreeBSD
_OSRELEASE=13.0-RELEASE-p2
OSREL=13.0
OSVERSION=1300139
PYTHONBASE=/usr/local
CONFIGURE_MAX_CMD_LEN=524288
HAVE_PORTS_ENV=1
#### Misc Poudriere ####
GID=0
UID=0
---End make.conf---
--Resource limits--
cpu time               (seconds, -t)  unlimited
file size           (512-blocks, -f)  unlimited
data seg size           (kbytes, -d)  1048576
stack size              (kbytes, -s)  1048576
core file size      (512-blocks, -c)  unlimited
max memory size         (kbytes, -m)  unlimited
locked memory           (kbytes, -l)  unlimited
max user processes              (-u)  89999
open files                      (-n)  1024
virtual mem size        (kbytes, -v)  unlimited
swap limit              (kbytes, -w)  unlimited
socket buffer size       (bytes, -b)  unlimited
pseudo-terminals                (-p)  unlimited
kqueues                         (-k)  unlimited
umtx shared locks               (-o)  unlimited
--End resource limits--
=======================<phase: check-sanity   >============================
===>  License BSD2CLAUSE accepted by the user
===========================================================================
=======================<phase: pkg-depends    >============================
===>   samesame-1.10_2 depends on file: /usr/local/sbin/pkg - not found
===>   Installing existing package /packages/All/pkg-1.16.3.txz
[130arm64-quarterly-job-02] Installing pkg-1.16.3...
[130arm64-quarterly-job-02] Extracting pkg-1.16.3: .......... done
===>   samesame-1.10_2 depends on file: /usr/local/sbin/pkg - found
===>   Returning to build of samesame-1.10_2
===========================================================================
=======================<phase: fetch-depends  >============================
===========================================================================
=======================<phase: fetch          >============================
===>  License BSD2CLAUSE accepted by the user
===> Fetching all distfiles required by samesame-1.10_2 for building
===========================================================================
=======================<phase: checksum       >============================
===>  License BSD2CLAUSE accepted by the user
===> Fetching all distfiles required by samesame-1.10_2 for building
=> SHA256 Checksum OK for samesame-1.10.tar.bz2.
===========================================================================
=======================<phase: extract-depends>============================
===========================================================================
=======================<phase: extract        >============================
===>  License BSD2CLAUSE accepted by the user
===> Fetching all distfiles required by samesame-1.10_2 for building
===>  Extracting for samesame-1.10_2
=> SHA256 Checksum OK for samesame-1.10.tar.bz2.
===========================================================================
=======================<phase: patch-depends  >============================
===========================================================================
=======================<phase: patch          >============================
===>  Patching for samesame-1.10_2
===>  Applying FreeBSD patches for samesame-1.10_2 from /usr/ports/sysutils/samesame/files
===========================================================================
=======================<phase: build-depends  >============================
===========================================================================
=======================<phase: lib-depends    >============================
===========================================================================
=======================<phase: configure      >============================
===>  Configuring for samesame-1.10_2
checking for a BSD-compatible install... /usr/bin/install -c
checking whether build environment is sane... yes
checking for a thread-safe mkdir -p... ./install-sh -c -d
checking for gawk... no
checking for mawk... no
checking for nawk... nawk
checking whether make sets $(MAKE)... yes
<snip>
                                       ^
In file included from src/samearchive.cpp:21:
src/debug.cpp:49:6: warning: function previously declared with an explicit exception specification redeclared with an implicit exception specification [-Wimplicit-exception-spec-mismatch]
void operator delete(void *ptr)
     ^
/usr/include/c++/v1/new:188:36: note: previous declaration is here
_LIBCPP_OVERRIDABLE_FUNC_VIS void  operator delete(void* __p) _NOEXCEPT;
                                   ^
src/samearchive.cpp:98:5: warning: delete called on 'Iterator<Filename>' that is abstract but has non-virtual destructor [-Wdelete-abstract-non-virtual-dtor]
                                delete &a;
                                ^
src/samearchive.cpp:99:5: warning: delete called on 'Iterator<Filename>' that is abstract but has non-virtual destructor [-Wdelete-abstract-non-virtual-dtor]
                                delete &b;
                                ^
src/samearchive.cpp:103:2: warning: delete called on 'Iterator<Filename>' that is abstract but has non-virtual destructor [-Wdelete-abstract-non-virtual-dtor]
        delete &a;
        ^
src/samearchive.cpp:104:2: warning: delete called on 'Iterator<Filename>' that is abstract but has non-virtual destructor [-Wdelete-abstract-non-virtual-dtor]
        delete &b;
        ^
--- samearchive-lite.o ---
src/samearchive-lite.cpp:231:32: warning: '&&' within '||' [-Wlogical-op-parentheses]
                                m.s1.st_dev == m.s2.st_dev && m.s1.st_ino == m.s2.st_ino ||
                                ~~~~~~~~~~~~~~~~~~~~~~~~~~~^~~~~~~~~~~~~~~~~~~~~~~~~~~~~
src/samearchive-lite.cpp:231:32: note: place parentheses around the '&&' expression to silence this warning
                                m.s1.st_dev == m.s2.st_dev && m.s1.st_ino == m.s2.st_ino ||
                                                           ^
                                (                                                       )
--- samearchive.o ---
9 warnings generated.
mv -f .deps/samearchive.Tpo .deps/samearchive.Po
--- cache.o ---
c++ -DHAVE_CONFIG_H -I.    -DDEBUG -g -Wall   -DDISK_STORAGE -DEXPERIMENTAL    -DREAD_ONCES -pg -O2 -pipe -fstack-protector-strong -fno-strict-aliasing -MT cache.o -MD -MP -MF .deps/cache.Tpo -c -o cache.o `test -f 'src/cache.cpp' || echo './'`src/cache.cpp
--- samearchive-lite.o ---
1 warning generated.
--- cache.o ---
src/cache.cpp:75:24: warning: format specifies type 'unsigned int' but the argument has type 'size_t' (aka 'unsigned long') [-Wformat]
                        __FILE__, __LINE__, capacity);
                                            ^~~~~~~~
--- samearchive-lite.o ---
mv -f .deps/samearchive-lite.Tpo .deps/samearchive-lite.Po
--- samecp.o ---
c++ -DHAVE_CONFIG_H -I.    -DDEBUG -g -Wall   -DDISK_STORAGE -DEXPERIMENTAL    -DREAD_ONCES -pg -O2 -pipe -fstack-protector-strong -fno-strict-aliasing -MT samecp.o -MD -MP -MF .deps/samecp.Tpo -c -o samecp.o `test -f 'src/samecp.cpp' || echo './'`src/samecp.cpp
--- cache.o ---
1 warning generated.
mv -f .deps/cache.Tpo .deps/cache.Po
--- mainAction.o ---
c++ -DHAVE_CONFIG_H -I.    -DDEBUG -g -Wall   -DDISK_STORAGE -DEXPERIMENTAL    -DREAD_ONCES -pg -O2 -pipe -fstack-protector-strong -fno-strict-aliasing -MT mainAction.o -MD -MP -MF .deps/mainAction.Tpo -c -o mainAction.o `test -f 'src/mainAction.cpp' || echo './'`src/mainAction.cpp
--- samecp.o ---
src/samecp.cpp:54:24: warning: '&&' within '||' [-Wlogical-op-parentheses]
        if (S_HARDLINK(flags) && s1.st_dev == s2.st_dev || S_SYMLINK(flags))
            ~~~~~~~~~~~~~~~~~~^~~~~~~~~~~~~~~~~~~~~~~~~ ~~
src/samecp.cpp:54:24: note: place parentheses around the '&&' expression to silence this warning
        if (S_HARDLINK(flags) && s1.st_dev == s2.st_dev || S_SYMLINK(flags))
            ~~~~~~~~~~~~~~~~~~^~~~~~~~~~~~~~~~~~~~~~~~~
1 warning generated.
mv -f .deps/samecp.Tpo .deps/samecp.Po
--- samechflags.o ---
c++ -DHAVE_CONFIG_H -I.    -DDEBUG -g -Wall   -DDISK_STORAGE -DEXPERIMENTAL    -DREAD_ONCES -pg -O2 -pipe -fstack-protector-strong -fno-strict-aliasing -MT samechflags.o -MD -MP -MF .deps/samechflags.Tpo -c -o samechflags.o `test -f 'src/samechflags.cpp' || echo './'`src/samechflags.cpp
--- mainAction.o ---
mv -f .deps/mainAction.Tpo .deps/mainAction.Po
--- samechmod.o ---
c++ -DHAVE_CONFIG_H -I.    -DDEBUG -g -Wall   -DDISK_STORAGE -DEXPERIMENTAL    -DREAD_ONCES -pg -O2 -pipe -fstack-protector-strong -fno-strict-aliasing -MT samechmod.o -MD -MP -MF .deps/samechmod.Tpo -c -o samechmod.o `test -f 'src/samechmod.cpp' || echo './'`src/samechmod.cpp
--- samechflags.o ---
mv -f .deps/samechflags.Tpo .deps/samechflags.Po
--- samechown.o ---
c++ -DHAVE_CONFIG_H -I.    -DDEBUG -g -Wall   -DDISK_STORAGE -DEXPERIMENTAL    -DREAD_ONCES -pg -O2 -pipe -fstack-protector-strong -fno-strict-aliasing -MT samechown.o -MD -MP -MF .deps/samechown.Tpo -c -o samechown.o `test -f 'src/samechown.cpp' || echo './'`src/samechown.cpp
--- samechmod.o ---
In file included from src/samechmod.cpp:15:
In file included from src/mainAction.h:11:
src/toolkit.h:48:9: warning: 'PHYSPAGES_THRESHOLD' macro redefined [-Wmacro-redefined]
#define PHYSPAGES_THRESHOLD 32768 // more pages than this means a larger buffer
        ^
src/configure.h:40:9: note: previous definition is here
#define PHYSPAGES_THRESHOLD (32*1024)
        ^
1 warning generated.
mv -f .deps/samechmod.Tpo .deps/samechmod.Po
--- samedelay.o ---
c++ -DHAVE_CONFIG_H -I.    -DDEBUG -g -Wall   -DDISK_STORAGE -DEXPERIMENTAL    -DREAD_ONCES -pg -O2 -pipe -fstack-protector-strong -fno-strict-aliasing -MT samedelay.o -MD -MP -MF .deps/samedelay.Tpo -c -o samedelay.o `test -f 'src/samedelay.cpp' || echo './'`src/samedelay.cpp
--- samechown.o ---
mv -f .deps/samechown.Tpo .deps/samechown.Po
--- fsort.o ---
c++ -DHAVE_CONFIG_H -I.    -DDEBUG -g -Wall   -DDISK_STORAGE -DEXPERIMENTAL    -DREAD_ONCES -pg -O2 -pipe -fstack-protector-strong -fno-strict-aliasing -MT fsort.o -MD -MP -MF .deps/fsort.Tpo -c -o fsort.o `test -f 'src/fsort.cpp' || echo './'`src/fsort.cpp
--- samedelay.o ---
src/samedelay.cpp:52:25: warning: format specifies type 'unsigned int' but the argument has type 'size_t' (aka 'unsigned long') [-Wformat]
                                __FILE__, __LINE__, i);
                                                    ^
--- fsort.o ---
src/fsort.cpp:121:4: warning: 'delete' applied to a pointer that was allocated with 'new[]'; did you mean 'delete[]'? [-Wmismatched-new-delete]
                        delete arr;
                        ^
                              []
src/fsort.cpp:97:16: note: allocated with 'new[]' here
        entry **arr = new entry *[arrCapacity];
                      ^
src/fsort.cpp:173:43: warning: format specifies type 'unsigned int' but the argument has type 'size_t' (aka 'unsigned long') [-Wformat]
        fprintf(stderr, "\nprocessed lines: %u", lines);
                                            ~~   ^~~~~
                                            %zu
--- samedelay.o ---
1 warning generated.
mv -f .deps/samedelay.Tpo .deps/samedelay.Po
--- sameln.o ---
c++ -DHAVE_CONFIG_H -I.    -DDEBUG -g -Wall   -DDISK_STORAGE -DEXPERIMENTAL    -DREAD_ONCES -pg -O2 -pipe -fstack-protector-strong -fno-strict-aliasing -MT sameln.o -MD -MP -MF .deps/sameln.Tpo -c -o sameln.o `test -f 'src/sameln.cpp' || echo './'`src/sameln.cpp
--- fsort.o ---
2 warnings generated.
mv -f .deps/fsort.Tpo .deps/fsort.Po
--- samerm.o ---
c++ -DHAVE_CONFIG_H -I.    -DDEBUG -g -Wall   -DDISK_STORAGE -DEXPERIMENTAL    -DREAD_ONCES -pg -O2 -pipe -fstack-protector-strong -fno-strict-aliasing -MT samerm.o -MD -MP -MF .deps/samerm.Tpo -c -o samerm.o `test -f 'src/samerm.cpp' || echo './'`src/samerm.cpp
--- sameln.o ---
src/sameln.cpp:78:23: warning: format specifies type 'unsigned int' but the argument has type 'size_t' (aka 'unsigned long') [-Wformat]
                        sprintf(tmp, "%u", i);
                                      ~~   ^
                                      %zu
src/sameln.cpp:82:4: warning: 'delete' applied to a pointer that was allocated with 'new[]'; did you mean 'delete[]'? [-Wmismatched-new-delete]
                        delete backup;
                        ^
                              []
src/sameln.cpp:70:18: note: allocated with 'new[]' here
                char *backup = new char[strlen(src) + 10 + postfixLen];
                               ^
src/sameln.cpp:89:4: warning: 'delete' applied to a pointer that was allocated with 'new[]'; did you mean 'delete[]'? [-Wmismatched-new-delete]
                        delete backup;
                        ^
                              []
src/sameln.cpp:70:18: note: allocated with 'new[]' here
                char *backup = new char[strlen(src) + 10 + postfixLen];
                               ^
src/sameln.cpp:97:5: warning: 'delete' applied to a pointer that was allocated with 'new[]'; did you mean 'delete[]'? [-Wmismatched-new-delete]
                                delete backup;
                                ^
                                      []
src/sameln.cpp:70:18: note: allocated with 'new[]' here
                char *backup = new char[strlen(src) + 10 + postfixLen];
                               ^
src/sameln.cpp:102:5: warning: 'delete' applied to a pointer that was allocated with 'new[]'; did you mean 'delete[]'? [-Wmismatched-new-delete]
                                delete backup;
                                ^
                                      []
src/sameln.cpp:70:18: note: allocated with 'new[]' here
                char *backup = new char[strlen(src) + 10 + postfixLen];
                               ^
src/sameln.cpp:105:4: warning: 'delete' applied to a pointer that was allocated with 'new[]'; did you mean 'delete[]'? [-Wmismatched-new-delete]
                        delete backup;
                        ^
                              []
src/sameln.cpp:70:18: note: allocated with 'new[]' here
                char *backup = new char[strlen(src) + 10 + postfixLen];
                               ^
src/sameln.cpp:112:4: warning: 'delete' applied to a pointer that was allocated with 'new[]'; did you mean 'delete[]'? [-Wmismatched-new-delete]
                        delete backup;
                        ^
                              []
src/sameln.cpp:70:18: note: allocated with 'new[]' here
                char *backup = new char[strlen(src) + 10 + postfixLen];
                               ^
src/sameln.cpp:115:3: warning: 'delete' applied to a pointer that was allocated with 'new[]'; did you mean 'delete[]'? [-Wmismatched-new-delete]
                delete backup;
                ^
                      []
src/sameln.cpp:70:18: note: allocated with 'new[]' here
                char *backup = new char[strlen(src) + 10 + postfixLen];
                               ^
8 warnings generated.
mv -f .deps/sameln.Tpo .deps/sameln.Po
--- samefile ---
c++ -DDEBUG -g -Wall   -DDISK_STORAGE -DEXPERIMENTAL    -DREAD_ONCES -pg -O2 -pipe -fstack-protector-strong -fno-strict-aliasing  -fstack-protector-strong  -o samefile samefile.o main.o  holder.o sizegroup.o  matchmatrix.o storage.o  filegroup.o filename.o  templates.o list.o  container.o list.o  hash.o stats.o  printhardlinked.o write2disk.o  toolkit.o buffer.o  memory.o  
ld: error: undefined symbol: .mcount
>>> referenced by debug.cpp:19 (src/debug.cpp:19)
>>>               samefile.o:(operator new(unsigned long))
>>> referenced by debug.cpp:50 (src/debug.cpp:50)
>>>               samefile.o:(operator delete(void*))
>>> referenced by debug.cpp:65 (src/debug.cpp:65)
>>>               samefile.o:(checkDynamic())
>>> referenced 1882 more times
>>> did you mean: mcount
>>> defined in: /usr/lib/libc_p.a
c++: error: linker command failed with exit code 1 (use -v to see invocation)
*** [samefile] Error code 1

make[2]: stopped in /wrkdirs/usr/ports/sysutils/samesame/work/samesame-1.10
--- samerm.o ---
mv -f .deps/samerm.Tpo .deps/samerm.Po
1 error

make[2]: stopped in /wrkdirs/usr/ports/sysutils/samesame/work/samesame-1.10
*** [all] Error code 2

make[1]: stopped in /wrkdirs/usr/ports/sysutils/samesame/work/samesame-1.10
1 error

make[1]: stopped in /wrkdirs/usr/ports/sysutils/samesame/work/samesame-1.10
===> Compilation failed unexpectedly.
Try to set MAKE_JOBS_UNSAFE=yes and rebuild before reporting the failure to
the maintainer.
*** Error code 1

Stop.
make: stopped in /usr/ports/sysutils/samesame
Received on Wed Jun 23 2021 - 15:52:10 UTC

Original text of this message