[package - main-i386-default][science/opensph] Failed for OpenSPH-0.3.4_4 in build

From: <pkg-fallout_at_FreeBSD.org>
Date: Wed, 23 Jun 2021 03:06:32 GMT
You are receiving this mail as a port that you maintain
is failing to build on the FreeBSD package build server.
Please investigate the failure and submit a PR to fix
build.

Maintainer:     yuri_at_FreeBSD.org
Log URL:        http://beefy17.nyi.freebsd.org/data/main-i386-default/p670676cc73e1_s15fccd86b9/logs/OpenSPH-0.3.4_4.log
Build URL:      http://beefy17.nyi.freebsd.org/build.html?mastername=main-i386-default&build=p670676cc73e1_s15fccd86b9
Log:

=>> Building science/opensph
build started at Wed Jun 23 03:05:25 UTC 2021
port directory: /usr/ports/science/opensph
package name: OpenSPH-0.3.4_4
building for: FreeBSD main-i386-default-job-10 14.0-CURRENT FreeBSD 14.0-CURRENT 1400024 i386
maintained by: yuri_at_FreeBSD.org
Makefile ident: 
Poudriere version: 3.2.8-8-gaf08dbda
Host OSVERSION: 1400008
Jail OSVERSION: 1400024
Job Id: 10




!!! Jail is newer than host. (Jail: 1400024, Host: 1400008) !!!
!!! This is not supported. !!!
!!! Host kernel must be same or newer than jail. !!!
!!! Expect build failures. !!!



---Begin Environment---
SHELL=/bin/csh
UNAME_p=i386
UNAME_m=i386
OSVERSION=1400024
UNAME_v=FreeBSD 14.0-CURRENT 1400024
UNAME_r=14.0-CURRENT
BLOCKSIZE=K
MAIL=/var/mail/root
MM_CHARSET=UTF-8
LANG=C.UTF-8
STATUS=1
HOME=/root
PATH=/sbin:/bin:/usr/sbin:/usr/bin:/usr/local/sbin:/usr/local/bin:/root/bin
LOCALBASE=/usr/local
USER=root
LIBEXECPREFIX=/usr/local/libexec/poudriere
POUDRIERE_VERSION=3.2.8-8-gaf08dbda
MASTERMNT=/usr/local/poudriere/data/.m/main-i386-default/ref
POUDRIERE_BUILD_TYPE=bulk
PACKAGE_BUILDING=yes
SAVED_TERM=
PWD=/usr/local/poudriere/data/.m/main-i386-default/ref/.p/pool
P_PORTS_FEATURES=FLAVORS SELECTED_OPTIONS
MASTERNAME=main-i386-default
SCRIPTPREFIX=/usr/local/share/poudriere
OLDPWD=/usr/local/poudriere/data/.m/main-i386-default/ref/.p
SCRIPTPATH=/usr/local/share/poudriere/bulk.sh
POUDRIEREPATH=/usr/local/bin/poudriere
---End Environment---

---Begin Poudriere Port Flags/Env---
PORT_FLAGS=
PKGENV=
FLAVOR=
DEPENDS_ARGS=
MAKE_ARGS=
---End Poudriere Port Flags/Env---

---Begin OPTIONS List---
===> The following configuration options are available for OpenSPH-0.3.4_4:
     CHAISCRIPT=on: Be able to read and modify particle data from a script
     EIGEN=on: Eigen for additional methods to set up initial conditions
     HDF5=on: Be able to read files generated by miluphcuda code
     OPENMP=on: Parallel processing support via OpenMP
     TBB=on: Parallelize with Intel Threading Building Blocks
     VDB=on: Use OpenVDB for converting particles to volumetric data
===> Use 'make config' to modify these settings
---End OPTIONS List---

--MAINTAINER--
yuri_at_FreeBSD.org
--End MAINTAINER--

--CONFIGURE_ARGS--
--with-qt-includes=/usr/local/include/qt5  --with-qt-libraries=/usr/local/lib/qt5  --with-extra-includes=/usr/local/include  --with-extra-libs=/usr/local/lib
--End CONFIGURE_ARGS--

--CONFIGURE_ENV--
QT_SELECT=qt5 QMAKEMODULES="/wrkdirs/usr/ports/science/opensph/work/sph-76c4b601cf05303d4ff181699aa2f0da796eb096/mkspecs/modules:/usr/local/lib/qt5/mkspecs/modules" QTDIR="/usr/local/lib/qt5" QMAKE="/usr/local/lib/qt5/bin/qmake"  MOC="/usr/local/lib/qt5/bin/moc" RCC="/usr/local/lib/qt5/bin/rcc" UIC="/usr/local/lib/qt5/bin/uic"  QMAKESPEC="/usr/local/lib/qt5/mkspecs/freebsd-$(ccver="$(c++ --version)"; case "$ccver" in *clang*) echo clang ;; *) echo g++ ;; esac)" XDG_DATA_HOME=/wrkdirs/usr/ports/science/opensph/work  XDG_CONFIG_HOME=/wrkdirs/usr/ports/science/opensph/work  HOME=/wrkdirs/usr/ports/science/opensph/work TMPDIR="/tmp" PATH=/wrkdirs/usr/ports/science/opensph/work/.bin:/sbin:/bin:/usr/sbin:/usr/bin:/usr/local/sbin:/usr/local/bin:/root/bin SHELL=/bin/sh CONFIG_SHELL=/bin/sh WX_CONFIG=/usr/local/bin/wxgtk3u-3.1-config
--End CONFIGURE_ENV--

--MAKE_ENV--
QT_SELECT=qt5 QMAKEMODULES="/wrkdirs/usr/ports/science/opensph/work/sph-76c4b601cf05303d4ff181699aa2f0da796eb096/mkspecs/modules:/usr/local/lib/qt5/mkspecs/modules" XDG_DATA_HOME=/wrkdirs/usr/ports/science/opensph/work  XDG_CONFIG_HOME=/wrkdirs/usr/ports/science/opensph/work  HOME=/wrkdirs/usr/ports/science/opensph/work TMPDIR="/tmp" PATH=/wrkdirs/usr/ports/science/opensph/work/.bin:/sbin:/bin:/usr/sbin:/usr/bin:/usr/local/sbin:/usr/local/bin:/root/bin NO_PIE=yes MK_DEBUG_FILES=no MK_KERNEL_SYMBOLS=no SHELL=/bin/sh NO_LINT=YES WX_CONFIG=/usr/local/bin/wxgtk3u-3.1-config PREFIX=/usr/local  LOCALBASE=/usr/local  CC="cc" CFLAGS="-O2 -pipe  -fstack-protector-strong -fno-strict-aliasing "  CPP="cpp" CPPFLAGS=""  LDFLAGS=" -fstack-protector-strong " LIBS=""  CXX="c++" CXXFLAGS="-O2 -pipe -fstack-protector-strong -fno-strict-aliasing  -DSPH_CONFIG_SET "  MANPREFIX="/usr/local" BSD_INSTALL_PROGRAM="install  -s -m 555"  BSD_INSTALL_LIB="install  -s -m 0644"  BSD_INSTALL_SCRIPT="install  -m 55
 5"  BSD_INSTALL_DATA="install  -m 0644"  BSD_INSTALL_MAN="install  -m 444"
--End MAKE_ENV--

--PLIST_SUB--
QT_BINDIR="lib/qt5/bin" QT_INCDIR="include/qt5" QT_LIBDIR="lib/qt5" QT_ARCHDIR="lib/qt5" QT_PLUGINDIR="lib/qt5/plugins" QT_LIBEXECDIR="libexec/qt5" QT_IMPORTDIR="lib/qt5/imports" QT_QMLDIR="lib/qt5/qml" QT_DATADIR="share/qt5" QT_DOCDIR="share/doc/qt5" QT_L10NDIR="share/qt5/translations" QT_EXAMPLEDIR="share/examples/qt5" QT_TESTDIR="share/qt5/tests" QT_MKSPECDIR="lib/qt5/mkspecs" QT_QTCHOOSERDIR="etc/xdg/qtchooser" DEBUG="_at_comment " OSREL=14.0 PREFIX=%D LOCALBASE=/usr/local  RESETPREFIX=/usr/local LIB32DIR=lib DOCSDIR="share/doc/OpenSPH"  EXAMPLESDIR="share/examples/OpenSPH"  DATADIR="share/OpenSPH"  WWWDIR="www/OpenSPH"  ETCDIR="etc/OpenSPH"
--End PLIST_SUB--

--SUB_LIST--
PREFIX=/usr/local LOCALBASE=/usr/local  DATADIR=/usr/local/share/OpenSPH DOCSDIR=/usr/local/share/doc/OpenSPH EXAMPLESDIR=/usr/local/share/examples/OpenSPH  WWWDIR=/usr/local/www/OpenSPH ETCDIR=/usr/local/etc/OpenSPH
--End SUB_LIST--

---Begin make.conf---
USE_PACKAGE_DEPENDS=yes
BATCH=yes
WRKDIRPREFIX=/wrkdirs
PORTSDIR=/usr/ports
PACKAGES=/packages
DISTDIR=/distfiles
PACKAGE_BUILDING=yes
PACKAGE_BUILDING_FLAVORS=yes
MACHINE=i386
MACHINE_ARCH=i386
ARCH=${MACHINE_ARCH}
#### /usr/local/etc/poudriere.d/make.conf ####
# XXX: We really need this but cannot use it while 'make checksum' does not
# try the next mirror on checksum failure.  It currently retries the same
# failed mirror and then fails rather then trying another.  It *does*
# try the next if the size is mismatched though.
#MASTER_SITE_FREEBSD=yes
# Build ALLOW_MAKE_JOBS_PACKAGES with 2 jobs
MAKE_JOBS_NUMBER=2
#### /usr/ports/Mk/Scripts/ports_env.sh ####
_CCVERSION_921dbbb2=FreeBSD clang version 12.0.1 (git_at_github.com:llvm/llvm-project.git llvmorg-12.0.1-rc2-0-ge7dac564cd0e) Target: i386-unknown-freebsd14.0 Thread model: posix InstalledDir: /usr/bin
_ALTCCVERSION_921dbbb2=none
_CXXINTERNAL_acaad9ca=FreeBSD clang version 12.0.1 (git_at_github.com:llvm/llvm-project.git llvmorg-12.0.1-rc2-0-ge7dac564cd0e) Target: i386-unknown-freebsd14.0 Thread model: posix InstalledDir: /usr/bin "/usr/bin/ld" "--eh-frame-hdr" "-dynamic-linker" "/libexec/ld-elf.so.1" "--hash-style=both" "--enable-new-dtags" "-m" "elf_i386_fbsd" "-o" "a.out" "/usr/lib/crt1.o" "/usr/lib/crti.o" "/usr/lib/crtbegin.o" "-L/usr/lib" "/dev/null" "-lc++" "-lm" "-lgcc" "--as-needed" "-lgcc_s" "--no-as-needed" "-lc" "-lgcc" "--as-needed" "-lgcc_s" "--no-as-needed" "/usr/lib/crtend.o" "/usr/lib/crtn.o"
CC_OUTPUT_921dbbb2_58173849=yes
CC_OUTPUT_921dbbb2_9bdba57c=yes
CC_OUTPUT_921dbbb2_6a4fe7f5=yes
CC_OUTPUT_921dbbb2_6bcac02b=yes
CC_OUTPUT_921dbbb2_67d20829=yes
CC_OUTPUT_921dbbb2_bfa62e83=yes
CC_OUTPUT_921dbbb2_f0b4d593=yes
CC_OUTPUT_921dbbb2_308abb44=yes
CC_OUTPUT_921dbbb2_f00456e5=yes
CC_OUTPUT_921dbbb2_65ad290d=yes
CC_OUTPUT_921dbbb2_f2776b26=yes
CC_OUTPUT_921dbbb2_b2657cc3=yes
CC_OUTPUT_921dbbb2_380987f7=yes
CC_OUTPUT_921dbbb2_160933ec=yes
CC_OUTPUT_921dbbb2_fb62803b=yes
_OBJC_CCVERSION_921dbbb2=FreeBSD clang version 12.0.1 (git_at_github.com:llvm/llvm-project.git llvmorg-12.0.1-rc2-0-ge7dac564cd0e) Target: i386-unknown-freebsd14.0 Thread model: posix InstalledDir: /usr/bin
_OBJC_ALTCCVERSION_921dbbb2=none
ARCH=i386
OPSYS=FreeBSD
_OSRELEASE=14.0-CURRENT
OSREL=14.0
OSVERSION=1400024
PYTHONBASE=/usr/local
CONFIGURE_MAX_CMD_LEN=524288
HAVE_PORTS_ENV=1
#### Misc Poudriere ####
GID=0
UID=0
---End make.conf---
--Resource limits--
cpu time               (seconds, -t)  unlimited
file size           (512-blocks, -f)  unlimited
data seg size           (kbytes, -d)  524288
stack size              (kbytes, -s)  65536
core file size      (512-blocks, -c)  unlimited
max memory size         (kbytes, -m)  unlimited
locked memory           (kbytes, -l)  unlimited
max user processes              (-u)  89999
open files                      (-n)  1024
virtual mem size        (kbytes, -v)  unlimited
swap limit              (kbytes, -w)  unlimited
socket buffer size       (bytes, -b)  unlimited
pseudo-terminals                (-p)  unlimited
kqueues                         (-k)  unlimited
umtx shared locks               (-o)  unlimited
--End resource limits--
=======================<phase: check-sanity   >============================
===>  License MIT accepted by the user
===========================================================================
=======================<phase: pkg-depends    >============================
===>   OpenSPH-0.3.4_4 depends on file: /usr/local/sbin/pkg - not found
===>   Installing existing package /packages/All/pkg-1.16.3.txz
[main-i386-default-job-10] Installing pkg-1.16.3...
[main-i386-default-job-10] Extracting pkg-1.16.3: .......... done
===>   OpenSPH-0.3.4_4 depends on file: /usr/local/sbin/pkg - found
===>   Returning to build of OpenSPH-0.3.4_4
===========================================================================
=======================<phase: fetch-depends  >============================
===========================================================================
=======================<phase: fetch          >============================
===>  License MIT accepted by the user
===> Fetching all distfiles required by OpenSPH-0.3.4_4 for building
===========================================================================
=======================<phase: checksum       >============================
===>  License MIT accepted by the user
===> Fetching all distfiles required by OpenSPH-0.3.4_4 for building
=> SHA256 Checksum OK for sevecekp-sph-76c4b601cf05303d4ff181699aa2f0da796eb096_GL0.tar.gz.
===========================================================================
=======================<phase: extract-depends>============================
===========================================================================
=======================<phase: extract        >============================
===>  License MIT accepted by the user
===> Fetching all distfiles required by OpenSPH-0.3.4_4 for building
===>  Extracting for OpenSPH-0.3.4_4
=> SHA256 Checksum OK for sevecekp-sph-76c4b601cf05303d4ff181699aa2f0da796eb096_GL0.tar.gz.
===========================================================================
=======================<phase: patch-depends  >============================
===========================================================================
=======================<phase: patch          >============================
<snip>
Add the following line to the "Files" section of X Windows configuration file:

	FontPath "/usr/local/share/fonts/dejavu/"

Note: your X Windows configuration file is typically /etc/X11/XF86Config
if you are using XFree86, and /etc/X11/xorg.conf if you are using X.Org.
=====
Message from wayland-1.19.0_1:

--
Wayland requires XDG_RUNTIME_DIR to be defined to a path that will
contain "wayland-%d" unix(4) sockets. This is usually handled by
consolekit2 (via ck-launch-session) or pam_xdg (via login).
=====
Message from libxkbcommon-1.3.0:

--
If arrow keys don't work under X11 switch to legacy rules e.g.,

For sh/bash/ksh/zsh run and (optionally) add into ~/.profile:
  export XKB_DEFAULT_RULES=xorg

For csh/tcsh run and (optionally) add into ~/.login:
  setenv XKB_DEFAULT_RULES xorg
=====
Message from trousers-0.3.14_3:

--
To run tcsd automatically, add the following line to /etc/rc.conf:

tcsd_enable="YES"

You might want to edit /usr/local/etc/tcsd.conf to reflect your setup.

If you want to use tcsd with software TPM emulator, use the following
configuration in /etc/rc.conf:

tcsd_enable="YES"
tcsd_mode="emulator"
tpmd_enable="YES"

To use TPM, add your_account to '_tss' group like following:

# pw groupmod _tss -m your_account
===>   OpenSPH-0.3.4_4 depends on shared library: libwx_baseu-3.1.so - found (/usr/local/lib/libwx_baseu-3.1.so)
===>   Returning to build of OpenSPH-0.3.4_4
===========================================================================
=======================<phase: configure      >============================
===>  Configuring for OpenSPH-0.3.4_4
Info: creating stash file /wrkdirs/usr/ports/science/opensph/work/sph-76c4b601cf05303d4ff181699aa2f0da796eb096/.qmake.stash
Reading /wrkdirs/usr/ports/science/opensph/work/sph-76c4b601cf05303d4ff181699aa2f0da796eb096/lib/lib.pro
Project MESSAGE: SPH --- Building for Release
Reading /wrkdirs/usr/ports/science/opensph/work/sph-76c4b601cf05303d4ff181699aa2f0da796eb096/gui/gui.pro
Project MESSAGE: SPH --- Building for Release
Reading /wrkdirs/usr/ports/science/opensph/work/sph-76c4b601cf05303d4ff181699aa2f0da796eb096/cli/launcher/launcher.pro
Project MESSAGE: SPH --- Building for Release
Reading /wrkdirs/usr/ports/science/opensph/work/sph-76c4b601cf05303d4ff181699aa2f0da796eb096/cli/info/info.pro
Project MESSAGE: SPH --- Building for Release
Reading /wrkdirs/usr/ports/science/opensph/work/sph-76c4b601cf05303d4ff181699aa2f0da796eb096/gui/launcherGui/launcherGui.pro
Project MESSAGE: SPH --- Building for Release
===========================================================================
=======================<phase: build          >============================
===>  Building for OpenSPH-0.3.4_4
--- sub-lib-all-ordered ---
cd lib/ && ( test -e Makefile || /usr/local/lib/qt5/bin/qmake -o Makefile /wrkdirs/usr/ports/science/opensph/work/sph-76c4b601cf05303d4ff181699aa2f0da796eb096/lib/lib.pro CONFIG+=release CONFIG+=use_chaiscript CONFIG+=use_eigen CONFIG+=use_hdf5 CONFIG+=use_openmp CONFIG+=use_tbb CONFIG+=use_vdb -spec /usr/local/lib/qt5/mkspecs/freebsd-clang QMAKE_CC=cc QMAKE_CXX=c++ QMAKE_LINK_C=cc QMAKE_LINK_C_SHLIB=cc QMAKE_LINK=c++ QMAKE_LINK_SHLIB=c++ 'QMAKE_CFLAGS=-O2 -pipe  -fstack-protector-strong -fno-strict-aliasing ' 'QMAKE_CXXFLAGS=-O2 -pipe -fstack-protector-strong -fno-strict-aliasing  -DSPH_CONFIG_SET ' 'QMAKE_LFLAGS= -fstack-protector-strong ' QMAKE_LIBS= QMAKE_CFLAGS_DEBUG= QMAKE_CFLAGS_RELEASE= QMAKE_CXXFLAGS_DEBUG= QMAKE_CXXFLAGS_RELEASE= PREFIX=/usr/local CONFIG+=release 'CONFIG-=debug separate_debug_info' ) && /usr/bin/make -f Makefile all
--- Assert.o ---
--- AggregateSolver.o ---
--- Assert.o ---
compiling common/Assert.cpp
--- AggregateSolver.o ---
compiling gravity/AggregateSolver.cpp
--- BarnesHut.o ---
compiling gravity/BarnesHut.cpp
In file included from gravity/BarnesHut.cpp:1:
In file included from ./gravity/BarnesHut.h:9:
In file included from ./gravity/IGravity.h:9:
In file included from ./objects/geometry/Vector.h:9:
In file included from ./objects/containers/Tuple.h:8:
./common/Traits.h:125:21: error: no member named 'addressof' in namespace 'std'
        : data(std::addressof(ref)) {}
               ~~~~~^
--- Galaxy.o ---
compiling gravity/Galaxy.cpp
In file included from gravity/Galaxy.cpp:1:
In file included from ./gravity/Galaxy.h:4:
In file included from ./objects/geometry/Vector.h:9:
In file included from ./objects/containers/Tuple.h:8:
./common/Traits.h:125:21: error: no member named 'addressof' in namespace 'std'
        : data(std::addressof(ref)) {}
               ~~~~~^
--- BarnesHut.o ---
In file included from gravity/BarnesHut.cpp:1:
In file included from ./gravity/BarnesHut.h:9:
In file included from ./gravity/IGravity.h:9:
In file included from ./objects/geometry/Vector.h:10:
In file included from ./objects/geometry/Generic.h:9:
./objects/containers/StaticArray.h:281:12: error: no matching constructor for initialization of 'StaticArray<Sph::Box &, sizeof...(TArgs) + 1>'
    return StaticArray<T0&, sizeof...(TArgs) + 1>({ t0, rest... });
           ^                                      ~~~~~~~~~~~~~~~
./objects/finders/KdTree.inl.h:140:13: note: in instantiation of function template specialization 'Sph::tie<Sph::Box, Sph::Box>' requested here
            tie(box1, box2) = box.split(splitIdx, this->values[idxs[n1]][splitIdx]);
            ^
./objects/finders/KdTree.inl.h:33:15: note: in instantiation of member function 'Sph::KdTree<Sph::BarnesHutNode>::buildTree' requested here
        this->buildTree(scheduler, ROOT_PARENT_NODE, KdChild(-1), 0, points.size(), entireBox, 0, 0);
              ^
gravity/BarnesHut.cpp:17:12: note: in instantiation of member function 'Sph::KdTree<Sph::BarnesHutNode>::buildImpl' requested here
BarnesHut::BarnesHut(const Float theta,
           ^
./objects/containers/StaticArray.h:40:5: note: candidate constructor not viable: cannot convert initializer list argument to 'const Sph::EmptyArray'
    StaticArray(const EmptyArray&) {
    ^
./objects/containers/StaticArray.h:48:5: note: candidate constructor not viable: no known conversion from 'Sph::Box' to 'Sph::ReferenceWrapper<Sph::Box>' for 1st argument
    StaticArray(std::initializer_list<StorageType> list) {
    ^
./objects/containers/StaticArray.h:56:5: note: candidate constructor not viable: cannot convert initializer list argument to 'const Sph::StaticArray<Sph::Box &, 2>'
    StaticArray(const StaticArray& other) = delete;
    ^
./objects/containers/StaticArray.h:58:5: note: candidate constructor not viable: cannot convert initializer list argument to 'Sph::StaticArray<Sph::Box &, 2>'
    StaticArray(StaticArray&& other) {
    ^
./objects/containers/StaticArray.h:27:5: note: candidate constructor not viable: requires 0 arguments, but 1 was provided
    StaticArray() {
    ^
2 errors generated.
*** [BarnesHut.o] Error code 1

make[2]: stopped in /wrkdirs/usr/ports/science/opensph/work/sph-76c4b601cf05303d4ff181699aa2f0da796eb096/lib
--- Galaxy.o ---
In file included from gravity/Galaxy.cpp:1:
In file included from ./gravity/Galaxy.h:4:
In file included from ./objects/geometry/Vector.h:10:
In file included from ./objects/geometry/Generic.h:9:
./objects/containers/StaticArray.h:281:12: error: no matching constructor for initialization of 'StaticArray<Sph::ArrayView<Sph::BasicVector<double>> &, sizeof...(TArgs) + 1>'
    return StaticArray<T0&, sizeof...(TArgs) + 1>({ t0, rest... });
           ^                                      ~~~~~~~~~~~~~~~
gravity/Galaxy.cpp:276:5: note: in instantiation of function template specialization 'Sph::tie<Sph::ArrayView<Sph::BasicVector<double>>, Sph::ArrayView<Sph::BasicVector<double>>, Sph::ArrayView<Sph::BasicVector<double>>>' requested here
    tie(r, v, dv) = storage.getAll<Vector>(QuantityId::POSITION);
    ^
./objects/containers/StaticArray.h:40:5: note: candidate constructor not viable: cannot convert initializer list argument to 'const Sph::EmptyArray'
    StaticArray(const EmptyArray&) {
    ^
./objects/containers/StaticArray.h:48:5: note: candidate constructor not viable: no known conversion from 'Sph::ArrayView<Sph::BasicVector<double>>' to 'Sph::ReferenceWrapper<Sph::ArrayView<Sph::BasicVector<double>>>' for 1st argument
    StaticArray(std::initializer_list<StorageType> list) {
    ^
./objects/containers/StaticArray.h:56:5: note: candidate constructor not viable: cannot convert initializer list argument to 'const Sph::StaticArray<Sph::ArrayView<Sph::BasicVector<double>> &, 3>'
    StaticArray(const StaticArray& other) = delete;
    ^
./objects/containers/StaticArray.h:58:5: note: candidate constructor not viable: cannot convert initializer list argument to 'Sph::StaticArray<Sph::ArrayView<Sph::BasicVector<double>> &, 3>'
    StaticArray(StaticArray&& other) {
    ^
./objects/containers/StaticArray.h:27:5: note: candidate constructor not viable: requires 0 arguments, but 1 was provided
    StaticArray() {
    ^
./objects/containers/StaticArray.h:281:12: error: no matching constructor for initialization of 'StaticArray<Sph::Box &, sizeof...(TArgs) + 1>'
    return StaticArray<T0&, sizeof...(TArgs) + 1>({ t0, rest... });
           ^                                      ~~~~~~~~~~~~~~~
./objects/finders/KdTree.inl.h:140:13: note: in instantiation of function template specialization 'Sph::tie<Sph::Box, Sph::Box>' requested here
            tie(box1, box2) = box.split(splitIdx, this->values[idxs[n1]][splitIdx]);
            ^
./objects/finders/KdTree.inl.h:33:15: note: in instantiation of member function 'Sph::KdTree<Sph::BarnesHutNode>::buildTree' requested here
        this->buildTree(scheduler, ROOT_PARENT_NODE, KdChild(-1), 0, points.size(), entireBox, 0, 0);
              ^
./gravity/BarnesHut.h:43:7: note: in instantiation of member function 'Sph::KdTree<Sph::BarnesHutNode>::buildImpl' requested here
class BarnesHut : public IGravity {
      ^
./objects/containers/StaticArray.h:40:5: note: candidate constructor not viable: cannot convert initializer list argument to 'const Sph::EmptyArray'
    StaticArray(const EmptyArray&) {
    ^
./objects/containers/StaticArray.h:48:5: note: candidate constructor not viable: no known conversion from 'Sph::Box' to 'Sph::ReferenceWrapper<Sph::Box>' for 1st argument
    StaticArray(std::initializer_list<StorageType> list) {
    ^
./objects/containers/StaticArray.h:56:5: note: candidate constructor not viable: cannot convert initializer list argument to 'const Sph::StaticArray<Sph::Box &, 2>'
    StaticArray(const StaticArray& other) = delete;
    ^
./objects/containers/StaticArray.h:58:5: note: candidate constructor not viable: cannot convert initializer list argument to 'Sph::StaticArray<Sph::Box &, 2>'
    StaticArray(StaticArray&& other) {
    ^
./objects/containers/StaticArray.h:27:5: note: candidate constructor not viable: requires 0 arguments, but 1 was provided
    StaticArray() {
    ^
3 errors generated.
*** [Galaxy.o] Error code 1

make[2]: stopped in /wrkdirs/usr/ports/science/opensph/work/sph-76c4b601cf05303d4ff181699aa2f0da796eb096/lib
2 errors

make[2]: stopped in /wrkdirs/usr/ports/science/opensph/work/sph-76c4b601cf05303d4ff181699aa2f0da796eb096/lib
*** [sub-lib-all-ordered] Error code 2

make[1]: stopped in /wrkdirs/usr/ports/science/opensph/work/sph-76c4b601cf05303d4ff181699aa2f0da796eb096
1 error

make[1]: stopped in /wrkdirs/usr/ports/science/opensph/work/sph-76c4b601cf05303d4ff181699aa2f0da796eb096
===> Compilation failed unexpectedly.
Try to set MAKE_JOBS_UNSAFE=yes and rebuild before reporting the failure to
the maintainer.
*** Error code 1

Stop.
make: stopped in /usr/ports/science/opensph
Received on Wed Jun 23 2021 - 03:06:32 UTC

Original text of this message