[package - 122powerpc64-quarterly][net/ceph14] Failed for ceph14-14.2.21 in build

From: <pkg-fallout_at_FreeBSD.org>
Date: Tue, 22 Jun 2021 03:56:52 GMT
You are receiving this mail as a port that you maintain
is failing to build on the FreeBSD package build server.
Please investigate the failure and submit a PR to fix
build.

Maintainer:     wjw_at_digiware.nl
Log URL:        http://foul1.nyi.freebsd.org/data/122powerpc64-quarterly/dbe1c4c35016/logs/ceph14-14.2.21.log
Build URL:      http://foul1.nyi.freebsd.org/build.html?mastername=122powerpc64-quarterly&build=dbe1c4c35016
Log:

=>> Building net/ceph14
build started at Tue Jun 22 03:27:47 UTC 2021
port directory: /usr/ports/net/ceph14
package name: ceph14-14.2.21
building for: FreeBSD 122powerpc64-quarterly-job-11 12.2-RELEASE FreeBSD 12.2-RELEASE powerpc
maintained by: wjw_at_digiware.nl
Makefile ident: 
Poudriere version: 3.2.8-8-gaf08dbda
Host OSVERSION: 1400008
Jail OSVERSION: 1202000
Job Id: 11

---Begin Environment---
SHELL=/bin/csh
OSVERSION=1202000
UNAME_v=FreeBSD 12.2-RELEASE
UNAME_r=12.2-RELEASE
BLOCKSIZE=K
MAIL=/var/mail/root
STATUS=1
HOME=/root
PATH=/sbin:/bin:/usr/sbin:/usr/bin:/usr/local/sbin:/usr/local/bin:/root/bin
LOCALBASE=/usr/local
USER=root
LIBEXECPREFIX=/usr/local/libexec/poudriere
POUDRIERE_VERSION=3.2.8-8-gaf08dbda
MASTERMNT=/usr/local/poudriere/data/.m/122powerpc64-quarterly/ref
POUDRIERE_BUILD_TYPE=bulk
PACKAGE_BUILDING=yes
SAVED_TERM=
PWD=/usr/local/poudriere/data/.m/122powerpc64-quarterly/ref/.p/pool
P_PORTS_FEATURES=FLAVORS SELECTED_OPTIONS
MASTERNAME=122powerpc64-quarterly
SCRIPTPREFIX=/usr/local/share/poudriere
OLDPWD=/usr/local/poudriere/data/.m/122powerpc64-quarterly/ref/.p
SCRIPTPATH=/usr/local/share/poudriere/bulk.sh
POUDRIEREPATH=/usr/local/bin/poudriere
---End Environment---

---Begin Poudriere Port Flags/Env---
PORT_FLAGS=
PKGENV=
FLAVOR=
DEPENDS_ARGS=
MAKE_ARGS=
---End Poudriere Port Flags/Env---

---Begin OPTIONS List---
===> The following configuration options are available for ceph14-14.2.21:
     TESTS=off: Build test/debug tools (Broken with Clang)
===> Use 'make config' to modify these settings
---End OPTIONS List---

--MAINTAINER--
wjw_at_digiware.nl
--End MAINTAINER--

--CONFIGURE_ARGS--

--End CONFIGURE_ARGS--

--CONFIGURE_ENV--
MAKE=gmake PKG_CONFIG=pkgconf PYTHON="/usr/local/bin/python3.7" XDG_DATA_HOME=/wrkdirs/usr/ports/net/ceph14/work  XDG_CONFIG_HOME=/wrkdirs/usr/ports/net/ceph14/work  HOME=/wrkdirs/usr/ports/net/ceph14/work TMPDIR="/tmp" PATH=/wrkdirs/usr/ports/net/ceph14/work/.bin:/sbin:/bin:/usr/sbin:/usr/bin:/usr/local/sbin:/usr/local/bin:/root/bin SHELL=/bin/sh CONFIG_SHELL=/bin/sh
--End CONFIGURE_ENV--

--MAKE_ENV--
OPENSSLBASE=/usr OPENSSLDIR=/etc/ssl OPENSSLINC=/usr/include OPENSSLLIB=/usr/lib XDG_DATA_HOME=/wrkdirs/usr/ports/net/ceph14/work  XDG_CONFIG_HOME=/wrkdirs/usr/ports/net/ceph14/work  HOME=/wrkdirs/usr/ports/net/ceph14/work TMPDIR="/tmp" PATH=/wrkdirs/usr/ports/net/ceph14/work/.bin:/sbin:/bin:/usr/sbin:/usr/bin:/usr/local/sbin:/usr/local/bin:/root/bin NO_PIE=yes MK_DEBUG_FILES=no MK_KERNEL_SYMBOLS=no SHELL=/bin/sh NO_LINT=YES ADDR2LINE="/usr/local/bin/addr2line" AR="/usr/local/bin/ar" AS="/usr/local/bin/as" CPPFILT="/usr/local/bin/c++filt" GPROF="/usr/local/bin/gprof" LD="/usr/local/bin/ld" NM="/usr/local/bin/nm" OBJCOPY="/usr/local/bin/objcopy" OBJDUMP="/usr/local/bin/objdump" RANLIB="/usr/local/bin/ranlib" READELF="/usr/local/bin/readelf" SIZE="/usr/local/bin/size" STRINGS="/usr/local/bin/strings" PREFIX=/usr/local  LOCALBASE=/usr/local  CC="gcc10" CFLAGS="-O2 -pipe  -fstack-protector-strong -Wl,-rpath=/usr/local/lib/gcc10 -DLDAP_DEPRECATED -fno-strict-aliasing "  CPP="cpp10" CPPFLA
 GS="-I/usr/local/include"  LDFLAGS=" -L/usr/local/lib  -fstack-protector-strong -Wl,-rpath=/usr/local/lib/gcc10 -L/usr/local/lib/gcc10 " LIBS=""  CXX="g++10" CXXFLAGS="-O2 -pipe  -fstack-protector-strong -Wl,-rpath=/usr/local/lib/gcc10  -Wl,-rpath=/usr/local/lib/gcc10 -std=gnu++17 "  MANPREFIX="/usr/local" BSD_INSTALL_PROGRAM="install  -s -m 555"  BSD_INSTALL_LIB="install  -s -m 0644"  BSD_INSTALL_SCRIPT="install  -m 555"  BSD_INSTALL_DATA="install  -m 0644"  BSD_INSTALL_MAN="install  -m 444"
--End MAKE_ENV--

--PLIST_SUB--
TESTS="_at_comment " NO_TESTS="" NO_AMD64="_at_comment " CMAKE_BUILD_TYPE="release" PYTHON_INCLUDEDIR=include/python3.7m  PYTHON_LIBDIR=lib/python3.7  PYTHON_PLATFORM=freebsd12  PYTHON_SITELIBDIR=lib/python3.7/site-packages  PYTHON_SUFFIX=37  PYTHON_EXT_SUFFIX=  PYTHON_VER=3.7  PYTHON_VERSION=python3.7 PYTHON2="_at_comment " PYTHON3="" OSREL=12.2 PREFIX=%D LOCALBASE=/usr/local  RESETPREFIX=/usr/local LIB32DIR=lib DOCSDIR="share/doc/ceph"  EXAMPLESDIR="share/examples/ceph"  DATADIR="share/ceph"  WWWDIR="www/ceph"  ETCDIR="etc/ceph"
--End PLIST_SUB--

--SUB_LIST--
TESTS="_at_comment " NO_TESTS="" PREFIX=/usr/local LOCALBASE=/usr/local  DATADIR=/usr/local/share/ceph DOCSDIR=/usr/local/share/doc/ceph EXAMPLESDIR=/usr/local/share/examples/ceph  WWWDIR=/usr/local/www/ceph ETCDIR=/usr/local/etc/ceph
--End SUB_LIST--

---Begin make.conf---
USE_PACKAGE_DEPENDS=yes
BATCH=yes
WRKDIRPREFIX=/wrkdirs
PORTSDIR=/usr/ports
PACKAGES=/packages
DISTDIR=/distfiles
PACKAGE_BUILDING=yes
PACKAGE_BUILDING_FLAVORS=yes
#### /usr/local/etc/poudriere.d/make.conf ####
# XXX: We really need this but cannot use it while 'make checksum' does not
# try the next mirror on checksum failure.  It currently retries the same
# failed mirror and then fails rather then trying another.  It *does*
# try the next if the size is mismatched though.
#MASTER_SITE_FREEBSD=yes
# Build ALLOW_MAKE_JOBS_PACKAGES with 2 jobs
MAKE_JOBS_NUMBER=2
#### /usr/ports/Mk/Scripts/ports_env.sh ####
_CCVERSION_921dbbb2=cc (GCC) 4.2.1 20070831 patched [FreeBSD] Copyright (C) 2007 Free Software Foundation, Inc. This is free software; see the source for copying conditions. There is NO warranty; not even for MERCHANTABILITY or FITNESS FOR A PARTICULAR PURPOSE.
_ALTCCVERSION_921dbbb2=none
_CXXINTERNAL_acaad9ca=Using built-in specs. Target: powerpc64-undermydesk-freebsd Configured with: FreeBSD/powerpc64 system compiler Thread model: posix gcc version 4.2.1 20070831 patched [FreeBSD] "/usr/bin/ld" "--eh-frame-hdr" "-Qy" "-melf64ppc_fbsd" "--enable-new-dtags" "-dynamic-linker" "/libexec/ld-elf.so.1" "/usr/lib/crt1.o" "/usr/lib/crti.o" "/usr/lib/crtbegin.o" "-L/usr/lib" "-L/usr/lib" "/dev/null" "-lstdc++" "-lm" "-lgcc_s" "-lgcc" "-lc" "-lgcc_s" "-lgcc" "/usr/lib/crtsavres.o" "/usr/lib/crtend.o" "/usr/lib/crtn.o"
CC_OUTPUT_921dbbb2_58173849=yes
CC_OUTPUT_921dbbb2_9bdba57c=yes
CC_OUTPUT_921dbbb2_6a4fe7f5=cc1: error: unrecognized command line option "-std=c11"
CC_OUTPUT_921dbbb2_6bcac02b=yes
CC_OUTPUT_921dbbb2_67d20829=yes
CC_OUTPUT_921dbbb2_bfa62e83=cc1: error: unrecognized command line option "-std=gnu11"
CC_OUTPUT_921dbbb2_f0b4d593=yes
CC_OUTPUT_921dbbb2_308abb44=cc1plus: error: unrecognized command line option "-std=c++0x"
CC_OUTPUT_921dbbb2_f00456e5=cc1plus: error: unrecognized command line option "-std=c++11"
CC_OUTPUT_921dbbb2_65ad290d=cc1plus: error: unrecognized command line option "-std=c++14"
CC_OUTPUT_921dbbb2_f2776b26=cc1plus: error: unrecognized command line option "-std=c++17"
CC_OUTPUT_921dbbb2_b2657cc3=yes
CC_OUTPUT_921dbbb2_380987f7=cc1plus: error: unrecognized command line option "-std=gnu++11"
CC_OUTPUT_921dbbb2_160933ec=cc1plus: error: unrecognized command line option "-std=gnu++14"
CC_OUTPUT_921dbbb2_fb62803b=cc1plus: error: unrecognized command line option "-std=gnu++17"
_OBJC_CCVERSION_921dbbb2=cc (GCC) 4.2.1 20070831 patched [FreeBSD] Copyright (C) 2007 Free Software Foundation, Inc. This is free software; see the source for copying conditions. There is NO warranty; not even for MERCHANTABILITY or FITNESS FOR A PARTICULAR PURPOSE.
_OBJC_ALTCCVERSION_921dbbb2=none
ARCH=powerpc64
PPC_ABI=ELFv1
OPSYS=FreeBSD
_OSRELEASE=12.2-RELEASE
OSREL=12.2
OSVERSION=1202000
PYTHONBASE=/usr/local
CONFIGURE_MAX_CMD_LEN=524288
HAVE_PORTS_ENV=1
#### Misc Poudriere ####
GID=0
UID=0
---End make.conf---
--Resource limits--
cpu time               (seconds, -t)  unlimited
file size           (512-blocks, -f)  unlimited
data seg size           (kbytes, -d)  33554432
stack size              (kbytes, -s)  524288
core file size      (512-blocks, -c)  unlimited
max memory size         (kbytes, -m)  unlimited
locked memory           (kbytes, -l)  unlimited
max user processes              (-u)  89999
open files                      (-n)  1024
virtual mem size        (kbytes, -v)  unlimited
swap limit              (kbytes, -w)  unlimited
socket buffer size       (bytes, -b)  unlimited
pseudo-terminals                (-p)  unlimited
kqueues                         (-k)  unlimited
umtx shared locks               (-o)  unlimited
--End resource limits--
=======================<phase: check-sanity   >============================
===>  License GPLv2 LGPL3 accepted by the user
===========================================================================
=======================<phase: pkg-depends    >============================
===>   ceph14-14.2.21 depends on file: /usr/local/sbin/pkg - not found
===>   Installing existing package /packages/All/pkg-1.16.3.txz
[122powerpc64-quarterly-job-11] Installing pkg-1.16.3...
[122powerpc64-quarterly-job-11] Extracting pkg-1.16.3: .......... done
===>   ceph14-14.2.21 depends on file: /usr/local/sbin/pkg - found
===>   Returning to build of ceph14-14.2.21
===========================================================================
=======================<phase: fetch-depends  >============================
===========================================================================
=======================<phase: fetch          >============================
===>  License GPLv2 LGPL3 accepted by the user
===> Fetching all distfiles required by ceph14-14.2.21 for building
===========================================================================
=======================<phase: checksum       >============================
===>  License GPLv2 LGPL3 accepted by the user
===> Fetching all distfiles required by ceph14-14.2.21 for building
=> SHA256 Checksum OK for ceph-ceph-v14.2.21_GH0.tar.gz.
=> SHA256 Checksum OK for ceph-ceph-erasure-code-corpus-2d7d78b_GH0.tar.gz.
=> SHA256 Checksum OK for ceph-ceph-object-corpus-e32bf8c_GH0.tar.gz.
=> SHA256 Checksum OK for ceph-civetweb-bb99e93_GH0.tar.gz.
=> SHA256 Checksum OK for 01org-isa-l_crypto-603529a_GH0.tar.gz.
=> SHA256 Checksum OK for ceph-dmclock-4496dbc_GH0.tar.gz.
=> SHA256 Checksum OK for ceph-gf-complete-7e61b44_GH0.tar.gz.
=> SHA256 Checksum OK for ceph-jerasure-96c76b8_GH0.tar.gz.
=> SHA256 Checksum OK for ceph-googletest-fdb8504_GH0.tar.gz.
=> SHA256 Checksum OK for ceph-isa-l-7e1a337_GH0.tar.gz.
=> SHA256 Checksum OK for ceph-lua-1fce39c_GH0.tar.gz.
=> SHA256 Checksum OK for ceph-rapidjson-f54b0e4_GH0.tar.gz.
=> SHA256 Checksum OK for ceph-rocksdb-4c736f1_GH0.tar.gz.
=> SHA256 Checksum OK for ceph-xxHash-1f40c65_GH0.tar.gz.
=> SHA256 Checksum OK for facebook-zstd-f4340f4_GH0.tar.gz.
=> SHA256 Checksum OK for ceph-spawn-5f4742f_GH0.tar.gz.
===========================================================================
=======================<phase: extract-depends>============================
===========================================================================
=======================<phase: extract        >============================
===>  License GPLv2 LGPL3 accepted by the user
===> Fetching all distfiles required by ceph14-14.2.21 for building
===>  Extracting for ceph14-14.2.21
=> SHA256 Checksum OK for ceph-ceph-v14.2.21_GH0.tar.gz.
=> SHA256 Checksum OK for ceph-ceph-erasure-code-corpus-2d7d78b_GH0.tar.gz.
=> SHA256 Checksum OK for ceph-ceph-object-corpus-e32bf8c_GH0.tar.gz.
=> SHA256 Checksum OK for ceph-civetweb-bb99e93_GH0.tar.gz.
=> SHA256 Checksum OK for 01org-isa-l_crypto-603529a_GH0.tar.gz.
=> SHA256 Checksum OK for ceph-dmclock-4496dbc_GH0.tar.gz.
=> SHA256 Checksum OK for ceph-gf-complete-7e61b44_GH0.tar.gz.
=> SHA256 Checksum OK for ceph-jerasure-96c76b8_GH0.tar.gz.
=> SHA256 Checksum OK for ceph-googletest-fdb8504_GH0.tar.gz.
=> SHA256 Checksum OK for ceph-isa-l-7e1a337_GH0.tar.gz.
=> SHA256 Checksum OK for ceph-lua-1fce39c_GH0.tar.gz.
<snip>
                 from /wrkdirs/usr/ports/net/ceph14/work/ceph-14.2.21/src/auth/AuthSessionHandler.h:20,
                 from /wrkdirs/usr/ports/net/ceph14/work/ceph-14.2.21/src/msg/async/AsyncConnection.h:29,
                 from /wrkdirs/usr/ports/net/ceph14/work/ceph-14.2.21/src/msg/async/Protocol.h:10,
                 from /wrkdirs/usr/ports/net/ceph14/work/ceph-14.2.21/src/msg/async/ProtocolV2.h:7,
                 from /wrkdirs/usr/ports/net/ceph14/work/ceph-14.2.21/src/msg/async/ProtocolV2.cc:6:
/wrkdirs/usr/ports/net/ceph14/work/ceph-14.2.21/src/include/blobhash.h: In member function 'std::_Hashtable<_Key, _Value, _Alloc, _ExtractKey, _Equal, _H1, _H2, _Hash, _RehashPolicy, _Traits>::iterator std::_Hashtable<_Key, _Value, _Alloc, _ExtractKey, _Equal, _H1, _H2, _Hash, _RehashPolicy, _Traits>::find(const key_type&) [with _Key = entity_addrvec_t; _Value = std::pair<const entity_addrvec_t, boost::intrusive_ptr<AsyncConnection> >; _Alloc = std::allocator<std::pair<const entity_addrvec_t, boost::intrusive_ptr<AsyncConnection> > >; _ExtractKey = std::__detail::_Select1st; _Equal = std::equal_to<entity_addrvec_t>; _H1 = std::hash<entity_addrvec_t>; _H2 = std::__detail::_Mod_range_hashing; _Hash = std::__detail::_Default_ranged_hash; _RehashPolicy = std::__detail::_Prime_rehash_policy; _Traits = std::__detail::_Hashtable_traits<true, false, true>]':
/wrkdirs/usr/ports/net/ceph14/work/ceph-14.2.21/src/include/blobhash.h:38:10: warning: iteration 4 invokes undefined behavior [-Waggressive-loop-optimizations]
   38 |       sh += 8;
      |       ~~~^~~~
/wrkdirs/usr/ports/net/ceph14/work/ceph-14.2.21/src/include/blobhash.h:36:12: note: within this loop
   36 |     while (len) {
      |            ^~~
[ 15%] Building CXX object src/msg/CMakeFiles/common-msg-objs.dir/async/Event.cc.o
cd /wrkdirs/usr/ports/net/ceph14/work/.build/src/msg && /usr/local/bin/g++10 -D_FILE_OFFSET_BITS=64 -I/wrkdirs/usr/ports/net/ceph14/work/.build/src/include -I/wrkdirs/usr/ports/net/ceph14/work/ceph-14.2.21/src -I/usr/local/include/nss -I/usr/local/include/nspr -isystem /wrkdirs/usr/ports/net/ceph14/work/.build/include -isystem /wrkdirs/usr/ports/net/ceph14/work/ceph-14.2.21/src/xxHash -isystem /wrkdirs/usr/ports/net/ceph14/work/ceph-14.2.21/src/rapidjson/include -O2 -pipe  -fstack-protector-strong -Wl,-rpath=/usr/local/lib/gcc10 -DLDAP_DEPRECATED -fno-strict-aliasing -Wall -Wtype-limits -Wignored-qualifiers -Winit-self -Wpointer-arith -Werror=format-security -fno-strict-aliasing -fsigned-char -Wno-unknown-pragmas -rdynamic -U_FORTIFY_SOURCE -D_FORTIFY_SOURCE=2 -fstack-protector-strong -maltivec -maltivec -fdiagnostics-color=auto -fno-builtin-malloc -fno-builtin-calloc -fno-builtin-realloc -fno-builtin-free -O2 -pipe  -fstack-protector-strong -Wl,-rpath=/usr/local/lib/gcc10  -Wl,-rpat
 h=/usr/local/lib/gcc10 -std=gnu++17 -fPIC   -DHAVE_CONFIG_H -D__CEPH__ -D_REENTRANT -D_THREAD_SAFE -D__STDC_FORMAT_MACROS -std=c++17 -o CMakeFiles/common-msg-objs.dir/async/Event.cc.o -c /wrkdirs/usr/ports/net/ceph14/work/ceph-14.2.21/src/msg/async/Event.cc
[ 15%] Building C object src/common/CMakeFiles/common-common-objs.dir/reverse.c.o
cd /wrkdirs/usr/ports/net/ceph14/work/.build/src/common && /usr/local/bin/gcc10 -DCEPH_DATADIR=\"/usr/local/share/ceph\" -DCEPH_LIBDIR=\"/usr/local/lib\" -DCEPH_PKGLIBDIR=\"/usr/local/lib/ceph\" -D_FILE_OFFSET_BITS=64 -I/wrkdirs/usr/ports/net/ceph14/work/.build/src/include -I/wrkdirs/usr/ports/net/ceph14/work/ceph-14.2.21/src -I/usr/local/include/nss -I/usr/local/include/nspr -isystem /wrkdirs/usr/ports/net/ceph14/work/.build/include -isystem /wrkdirs/usr/ports/net/ceph14/work/ceph-14.2.21/src/xxHash -isystem /wrkdirs/usr/ports/net/ceph14/work/ceph-14.2.21/src/rapidjson/include -O2 -pipe  -fstack-protector-strong -Wl,-rpath=/usr/local/lib/gcc10 -DLDAP_DEPRECATED -fno-strict-aliasing -Wall -Wtype-limits -Wignored-qualifiers -Winit-self -Wpointer-arith -Werror=format-security -fno-strict-aliasing -fsigned-char -Wno-unknown-pragmas -rdynamic -U_FORTIFY_SOURCE -D_FORTIFY_SOURCE=2 -fstack-protector-strong -maltivec -fdiagnostics-color=auto -O2 -pipe  -fstack-protector-strong -Wl,-rpath=/u
 sr/local/lib/gcc10 -DLDAP_DEPRECATED -fno-strict-aliasing -fPIC   -DHAVE_CONFIG_H -D__CEPH__ -D_REENTRANT -D_THREAD_SAFE -D__STDC_FORMAT_MACROS -std=gnu99 -o CMakeFiles/common-common-objs.dir/reverse.c.o -c /wrkdirs/usr/ports/net/ceph14/work/ceph-14.2.21/src/common/reverse.c
[ 15%] Building CXX object src/common/CMakeFiles/common-common-objs.dir/run_cmd.cc.o
cd /wrkdirs/usr/ports/net/ceph14/work/.build/src/common && /usr/local/bin/g++10 -DCEPH_DATADIR=\"/usr/local/share/ceph\" -DCEPH_LIBDIR=\"/usr/local/lib\" -DCEPH_PKGLIBDIR=\"/usr/local/lib/ceph\" -D_FILE_OFFSET_BITS=64 -I/wrkdirs/usr/ports/net/ceph14/work/.build/src/include -I/wrkdirs/usr/ports/net/ceph14/work/ceph-14.2.21/src -I/usr/local/include/nss -I/usr/local/include/nspr -isystem /wrkdirs/usr/ports/net/ceph14/work/.build/include -isystem /wrkdirs/usr/ports/net/ceph14/work/ceph-14.2.21/src/xxHash -isystem /wrkdirs/usr/ports/net/ceph14/work/ceph-14.2.21/src/rapidjson/include -O2 -pipe  -fstack-protector-strong -Wl,-rpath=/usr/local/lib/gcc10 -DLDAP_DEPRECATED -fno-strict-aliasing -Wall -Wtype-limits -Wignored-qualifiers -Winit-self -Wpointer-arith -Werror=format-security -fno-strict-aliasing -fsigned-char -Wno-unknown-pragmas -rdynamic -U_FORTIFY_SOURCE -D_FORTIFY_SOURCE=2 -fstack-protector-strong -maltivec -maltivec -fdiagnostics-color=auto -fno-builtin-malloc -fno-builtin-calloc
  -fno-builtin-realloc -fno-builtin-free -O2 -pipe  -fstack-protector-strong -Wl,-rpath=/usr/local/lib/gcc10  -Wl,-rpath=/usr/local/lib/gcc10 -std=gnu++17 -fPIC   -DHAVE_CONFIG_H -D__CEPH__ -D_REENTRANT -D_THREAD_SAFE -D__STDC_FORMAT_MACROS -std=c++17 -o CMakeFiles/common-common-objs.dir/run_cmd.cc.o -c /wrkdirs/usr/ports/net/ceph14/work/ceph-14.2.21/src/common/run_cmd.cc
[ 15%] Building CXX object src/common/CMakeFiles/common-common-objs.dir/scrub_types.cc.o
cd /wrkdirs/usr/ports/net/ceph14/work/.build/src/common && /usr/local/bin/g++10 -DCEPH_DATADIR=\"/usr/local/share/ceph\" -DCEPH_LIBDIR=\"/usr/local/lib\" -DCEPH_PKGLIBDIR=\"/usr/local/lib/ceph\" -D_FILE_OFFSET_BITS=64 -I/wrkdirs/usr/ports/net/ceph14/work/.build/src/include -I/wrkdirs/usr/ports/net/ceph14/work/ceph-14.2.21/src -I/usr/local/include/nss -I/usr/local/include/nspr -isystem /wrkdirs/usr/ports/net/ceph14/work/.build/include -isystem /wrkdirs/usr/ports/net/ceph14/work/ceph-14.2.21/src/xxHash -isystem /wrkdirs/usr/ports/net/ceph14/work/ceph-14.2.21/src/rapidjson/include -O2 -pipe  -fstack-protector-strong -Wl,-rpath=/usr/local/lib/gcc10 -DLDAP_DEPRECATED -fno-strict-aliasing -Wall -Wtype-limits -Wignored-qualifiers -Winit-self -Wpointer-arith -Werror=format-security -fno-strict-aliasing -fsigned-char -Wno-unknown-pragmas -rdynamic -U_FORTIFY_SOURCE -D_FORTIFY_SOURCE=2 -fstack-protector-strong -maltivec -maltivec -fdiagnostics-color=auto -fno-builtin-malloc -fno-builtin-calloc
  -fno-builtin-realloc -fno-builtin-free -O2 -pipe  -fstack-protector-strong -Wl,-rpath=/usr/local/lib/gcc10  -Wl,-rpath=/usr/local/lib/gcc10 -std=gnu++17 -fPIC   -DHAVE_CONFIG_H -D__CEPH__ -D_REENTRANT -D_THREAD_SAFE -D__STDC_FORMAT_MACROS -std=c++17 -o CMakeFiles/common-common-objs.dir/scrub_types.cc.o -c /wrkdirs/usr/ports/net/ceph14/work/ceph-14.2.21/src/common/scrub_types.cc
In file included from /wrkdirs/usr/ports/net/ceph14/work/ceph-14.2.21/src/common/scrub_types.h:7,
                 from /wrkdirs/usr/ports/net/ceph14/work/ceph-14.2.21/src/common/scrub_types.cc:1:
/wrkdirs/usr/ports/net/ceph14/work/ceph-14.2.21/src/osd/osd_types.h:1467:3: warning: type qualifiers ignored on function return type [-Wignored-qualifiers]
 1467 |   const fingerprint_t get_fingerprint_type() const {
      |   ^~~~~
[ 15%] Building CXX object src/msg/CMakeFiles/common-msg-objs.dir/async/EventSelect.cc.o
cd /wrkdirs/usr/ports/net/ceph14/work/.build/src/msg && /usr/local/bin/g++10 -D_FILE_OFFSET_BITS=64 -I/wrkdirs/usr/ports/net/ceph14/work/.build/src/include -I/wrkdirs/usr/ports/net/ceph14/work/ceph-14.2.21/src -I/usr/local/include/nss -I/usr/local/include/nspr -isystem /wrkdirs/usr/ports/net/ceph14/work/.build/include -isystem /wrkdirs/usr/ports/net/ceph14/work/ceph-14.2.21/src/xxHash -isystem /wrkdirs/usr/ports/net/ceph14/work/ceph-14.2.21/src/rapidjson/include -O2 -pipe  -fstack-protector-strong -Wl,-rpath=/usr/local/lib/gcc10 -DLDAP_DEPRECATED -fno-strict-aliasing -Wall -Wtype-limits -Wignored-qualifiers -Winit-self -Wpointer-arith -Werror=format-security -fno-strict-aliasing -fsigned-char -Wno-unknown-pragmas -rdynamic -U_FORTIFY_SOURCE -D_FORTIFY_SOURCE=2 -fstack-protector-strong -maltivec -maltivec -fdiagnostics-color=auto -fno-builtin-malloc -fno-builtin-calloc -fno-builtin-realloc -fno-builtin-free -O2 -pipe  -fstack-protector-strong -Wl,-rpath=/usr/local/lib/gcc10  -Wl,-rpat
 h=/usr/local/lib/gcc10 -std=gnu++17 -fPIC   -DHAVE_CONFIG_H -D__CEPH__ -D_REENTRANT -D_THREAD_SAFE -D__STDC_FORMAT_MACROS -std=c++17 -o CMakeFiles/common-msg-objs.dir/async/EventSelect.cc.o -c /wrkdirs/usr/ports/net/ceph14/work/ceph-14.2.21/src/msg/async/EventSelect.cc
[ 15%] Building CXX object src/common/CMakeFiles/common-common-objs.dir/shared_mutex_debug.cc.o
cd /wrkdirs/usr/ports/net/ceph14/work/.build/src/common && /usr/local/bin/g++10 -DCEPH_DATADIR=\"/usr/local/share/ceph\" -DCEPH_LIBDIR=\"/usr/local/lib\" -DCEPH_PKGLIBDIR=\"/usr/local/lib/ceph\" -D_FILE_OFFSET_BITS=64 -I/wrkdirs/usr/ports/net/ceph14/work/.build/src/include -I/wrkdirs/usr/ports/net/ceph14/work/ceph-14.2.21/src -I/usr/local/include/nss -I/usr/local/include/nspr -isystem /wrkdirs/usr/ports/net/ceph14/work/.build/include -isystem /wrkdirs/usr/ports/net/ceph14/work/ceph-14.2.21/src/xxHash -isystem /wrkdirs/usr/ports/net/ceph14/work/ceph-14.2.21/src/rapidjson/include -O2 -pipe  -fstack-protector-strong -Wl,-rpath=/usr/local/lib/gcc10 -DLDAP_DEPRECATED -fno-strict-aliasing -Wall -Wtype-limits -Wignored-qualifiers -Winit-self -Wpointer-arith -Werror=format-security -fno-strict-aliasing -fsigned-char -Wno-unknown-pragmas -rdynamic -U_FORTIFY_SOURCE -D_FORTIFY_SOURCE=2 -fstack-protector-strong -maltivec -maltivec -fdiagnostics-color=auto -fno-builtin-malloc -fno-builtin-calloc
  -fno-builtin-realloc -fno-builtin-free -O2 -pipe  -fstack-protector-strong -Wl,-rpath=/usr/local/lib/gcc10  -Wl,-rpath=/usr/local/lib/gcc10 -std=gnu++17 -fPIC   -DHAVE_CONFIG_H -D__CEPH__ -D_REENTRANT -D_THREAD_SAFE -D__STDC_FORMAT_MACROS -std=c++17 -o CMakeFiles/common-common-objs.dir/shared_mutex_debug.cc.o -c /wrkdirs/usr/ports/net/ceph14/work/ceph-14.2.21/src/common/shared_mutex_debug.cc
[ 15%] Building CXX object src/common/CMakeFiles/common-common-objs.dir/signal.cc.o
cd /wrkdirs/usr/ports/net/ceph14/work/.build/src/common && /usr/local/bin/g++10 -DCEPH_DATADIR=\"/usr/local/share/ceph\" -DCEPH_LIBDIR=\"/usr/local/lib\" -DCEPH_PKGLIBDIR=\"/usr/local/lib/ceph\" -D_FILE_OFFSET_BITS=64 -I/wrkdirs/usr/ports/net/ceph14/work/.build/src/include -I/wrkdirs/usr/ports/net/ceph14/work/ceph-14.2.21/src -I/usr/local/include/nss -I/usr/local/include/nspr -isystem /wrkdirs/usr/ports/net/ceph14/work/.build/include -isystem /wrkdirs/usr/ports/net/ceph14/work/ceph-14.2.21/src/xxHash -isystem /wrkdirs/usr/ports/net/ceph14/work/ceph-14.2.21/src/rapidjson/include -O2 -pipe  -fstack-protector-strong -Wl,-rpath=/usr/local/lib/gcc10 -DLDAP_DEPRECATED -fno-strict-aliasing -Wall -Wtype-limits -Wignored-qualifiers -Winit-self -Wpointer-arith -Werror=format-security -fno-strict-aliasing -fsigned-char -Wno-unknown-pragmas -rdynamic -U_FORTIFY_SOURCE -D_FORTIFY_SOURCE=2 -fstack-protector-strong -maltivec -maltivec -fdiagnostics-color=auto -fno-builtin-malloc -fno-builtin-calloc
  -fno-builtin-realloc -fno-builtin-free -O2 -pipe  -fstack-protector-strong -Wl,-rpath=/usr/local/lib/gcc10  -Wl,-rpath=/usr/local/lib/gcc10 -std=gnu++17 -fPIC   -DHAVE_CONFIG_H -D__CEPH__ -D_REENTRANT -D_THREAD_SAFE -D__STDC_FORMAT_MACROS -std=c++17 -o CMakeFiles/common-common-objs.dir/signal.cc.o -c /wrkdirs/usr/ports/net/ceph14/work/ceph-14.2.21/src/common/signal.cc
[ 15%] Building CXX object src/msg/CMakeFiles/common-msg-objs.dir/async/PosixStack.cc.o
cd /wrkdirs/usr/ports/net/ceph14/work/.build/src/msg && /usr/local/bin/g++10 -D_FILE_OFFSET_BITS=64 -I/wrkdirs/usr/ports/net/ceph14/work/.build/src/include -I/wrkdirs/usr/ports/net/ceph14/work/ceph-14.2.21/src -I/usr/local/include/nss -I/usr/local/include/nspr -isystem /wrkdirs/usr/ports/net/ceph14/work/.build/include -isystem /wrkdirs/usr/ports/net/ceph14/work/ceph-14.2.21/src/xxHash -isystem /wrkdirs/usr/ports/net/ceph14/work/ceph-14.2.21/src/rapidjson/include -O2 -pipe  -fstack-protector-strong -Wl,-rpath=/usr/local/lib/gcc10 -DLDAP_DEPRECATED -fno-strict-aliasing -Wall -Wtype-limits -Wignored-qualifiers -Winit-self -Wpointer-arith -Werror=format-security -fno-strict-aliasing -fsigned-char -Wno-unknown-pragmas -rdynamic -U_FORTIFY_SOURCE -D_FORTIFY_SOURCE=2 -fstack-protector-strong -maltivec -maltivec -fdiagnostics-color=auto -fno-builtin-malloc -fno-builtin-calloc -fno-builtin-realloc -fno-builtin-free -O2 -pipe  -fstack-protector-strong -Wl,-rpath=/usr/local/lib/gcc10  -Wl,-rpat
 h=/usr/local/lib/gcc10 -std=gnu++17 -fPIC   -DHAVE_CONFIG_H -D__CEPH__ -D_REENTRANT -D_THREAD_SAFE -D__STDC_FORMAT_MACROS -std=c++17 -o CMakeFiles/common-msg-objs.dir/async/PosixStack.cc.o -c /wrkdirs/usr/ports/net/ceph14/work/ceph-14.2.21/src/msg/async/PosixStack.cc
[ 15%] Building CXX object src/common/CMakeFiles/common-common-objs.dir/snap_types.cc.o
cd /wrkdirs/usr/ports/net/ceph14/work/.build/src/common && /usr/local/bin/g++10 -DCEPH_DATADIR=\"/usr/local/share/ceph\" -DCEPH_LIBDIR=\"/usr/local/lib\" -DCEPH_PKGLIBDIR=\"/usr/local/lib/ceph\" -D_FILE_OFFSET_BITS=64 -I/wrkdirs/usr/ports/net/ceph14/work/.build/src/include -I/wrkdirs/usr/ports/net/ceph14/work/ceph-14.2.21/src -I/usr/local/include/nss -I/usr/local/include/nspr -isystem /wrkdirs/usr/ports/net/ceph14/work/.build/include -isystem /wrkdirs/usr/ports/net/ceph14/work/ceph-14.2.21/src/xxHash -isystem /wrkdirs/usr/ports/net/ceph14/work/ceph-14.2.21/src/rapidjson/include -O2 -pipe  -fstack-protector-strong -Wl,-rpath=/usr/local/lib/gcc10 -DLDAP_DEPRECATED -fno-strict-aliasing -Wall -Wtype-limits -Wignored-qualifiers -Winit-self -Wpointer-arith -Werror=format-security -fno-strict-aliasing -fsigned-char -Wno-unknown-pragmas -rdynamic -U_FORTIFY_SOURCE -D_FORTIFY_SOURCE=2 -fstack-protector-strong -maltivec -maltivec -fdiagnostics-color=auto -fno-builtin-malloc -fno-builtin-calloc
  -fno-builtin-realloc -fno-builtin-free -O2 -pipe  -fstack-protector-strong -Wl,-rpath=/usr/local/lib/gcc10  -Wl,-rpath=/usr/local/lib/gcc10 -std=gnu++17 -fPIC   -DHAVE_CONFIG_H -D__CEPH__ -D_REENTRANT -D_THREAD_SAFE -D__STDC_FORMAT_MACROS -std=c++17 -o CMakeFiles/common-common-objs.dir/snap_types.cc.o -c /wrkdirs/usr/ports/net/ceph14/work/ceph-14.2.21/src/common/snap_types.cc
[ 15%] Building CXX object src/common/CMakeFiles/common-common-objs.dir/str_list.cc.o
cd /wrkdirs/usr/ports/net/ceph14/work/.build/src/common && /usr/local/bin/g++10 -DCEPH_DATADIR=\"/usr/local/share/ceph\" -DCEPH_LIBDIR=\"/usr/local/lib\" -DCEPH_PKGLIBDIR=\"/usr/local/lib/ceph\" -D_FILE_OFFSET_BITS=64 -I/wrkdirs/usr/ports/net/ceph14/work/.build/src/include -I/wrkdirs/usr/ports/net/ceph14/work/ceph-14.2.21/src -I/usr/local/include/nss -I/usr/local/include/nspr -isystem /wrkdirs/usr/ports/net/ceph14/work/.build/include -isystem /wrkdirs/usr/ports/net/ceph14/work/ceph-14.2.21/src/xxHash -isystem /wrkdirs/usr/ports/net/ceph14/work/ceph-14.2.21/src/rapidjson/include -O2 -pipe  -fstack-protector-strong -Wl,-rpath=/usr/local/lib/gcc10 -DLDAP_DEPRECATED -fno-strict-aliasing -Wall -Wtype-limits -Wignored-qualifiers -Winit-self -Wpointer-arith -Werror=format-security -fno-strict-aliasing -fsigned-char -Wno-unknown-pragmas -rdynamic -U_FORTIFY_SOURCE -D_FORTIFY_SOURCE=2 -fstack-protector-strong -maltivec -maltivec -fdiagnostics-color=auto -fno-builtin-malloc -fno-builtin-calloc
  -fno-builtin-realloc -fno-builtin-free -O2 -pipe  -fstack-protector-strong -Wl,-rpath=/usr/local/lib/gcc10  -Wl,-rpath=/usr/local/lib/gcc10 -std=gnu++17 -fPIC   -DHAVE_CONFIG_H -D__CEPH__ -D_REENTRANT -D_THREAD_SAFE -D__STDC_FORMAT_MACROS -std=c++17 -o CMakeFiles/common-common-objs.dir/str_list.cc.o -c /wrkdirs/usr/ports/net/ceph14/work/ceph-14.2.21/src/common/str_list.cc
[ 15%] Building CXX object src/common/CMakeFiles/common-common-objs.dir/str_map.cc.o
cd /wrkdirs/usr/ports/net/ceph14/work/.build/src/common && /usr/local/bin/g++10 -DCEPH_DATADIR=\"/usr/local/share/ceph\" -DCEPH_LIBDIR=\"/usr/local/lib\" -DCEPH_PKGLIBDIR=\"/usr/local/lib/ceph\" -D_FILE_OFFSET_BITS=64 -I/wrkdirs/usr/ports/net/ceph14/work/.build/src/include -I/wrkdirs/usr/ports/net/ceph14/work/ceph-14.2.21/src -I/usr/local/include/nss -I/usr/local/include/nspr -isystem /wrkdirs/usr/ports/net/ceph14/work/.build/include -isystem /wrkdirs/usr/ports/net/ceph14/work/ceph-14.2.21/src/xxHash -isystem /wrkdirs/usr/ports/net/ceph14/work/ceph-14.2.21/src/rapidjson/include -O2 -pipe  -fstack-protector-strong -Wl,-rpath=/usr/local/lib/gcc10 -DLDAP_DEPRECATED -fno-strict-aliasing -Wall -Wtype-limits -Wignored-qualifiers -Winit-self -Wpointer-arith -Werror=format-security -fno-strict-aliasing -fsigned-char -Wno-unknown-pragmas -rdynamic -U_FORTIFY_SOURCE -D_FORTIFY_SOURCE=2 -fstack-protector-strong -maltivec -maltivec -fdiagnostics-color=auto -fno-builtin-malloc -fno-builtin-calloc
  -fno-builtin-realloc -fno-builtin-free -O2 -pipe  -fstack-protector-strong -Wl,-rpath=/usr/local/lib/gcc10  -Wl,-rpath=/usr/local/lib/gcc10 -std=gnu++17 -fPIC   -DHAVE_CONFIG_H -D__CEPH__ -D_REENTRANT -D_THREAD_SAFE -D__STDC_FORMAT_MACROS -std=c++17 -o CMakeFiles/common-common-objs.dir/str_map.cc.o -c /wrkdirs/usr/ports/net/ceph14/work/ceph-14.2.21/src/common/str_map.cc
[ 15%] Building CXX object src/msg/CMakeFiles/common-msg-objs.dir/async/Stack.cc.o
cd /wrkdirs/usr/ports/net/ceph14/work/.build/src/msg && /usr/local/bin/g++10 -D_FILE_OFFSET_BITS=64 -I/wrkdirs/usr/ports/net/ceph14/work/.build/src/include -I/wrkdirs/usr/ports/net/ceph14/work/ceph-14.2.21/src -I/usr/local/include/nss -I/usr/local/include/nspr -isystem /wrkdirs/usr/ports/net/ceph14/work/.build/include -isystem /wrkdirs/usr/ports/net/ceph14/work/ceph-14.2.21/src/xxHash -isystem /wrkdirs/usr/ports/net/ceph14/work/ceph-14.2.21/src/rapidjson/include -O2 -pipe  -fstack-protector-strong -Wl,-rpath=/usr/local/lib/gcc10 -DLDAP_DEPRECATED -fno-strict-aliasing -Wall -Wtype-limits -Wignored-qualifiers -Winit-self -Wpointer-arith -Werror=format-security -fno-strict-aliasing -fsigned-char -Wno-unknown-pragmas -rdynamic -U_FORTIFY_SOURCE -D_FORTIFY_SOURCE=2 -fstack-protector-strong -maltivec -maltivec -fdiagnostics-color=auto -fno-builtin-malloc -fno-builtin-calloc -fno-builtin-realloc -fno-builtin-free -O2 -pipe  -fstack-protector-strong -Wl,-rpath=/usr/local/lib/gcc10  -Wl,-rpat
 h=/usr/local/lib/gcc10 -std=gnu++17 -fPIC   -DHAVE_CONFIG_H -D__CEPH__ -D_REENTRANT -D_THREAD_SAFE -D__STDC_FORMAT_MACROS -std=c++17 -o CMakeFiles/common-msg-objs.dir/async/Stack.cc.o -c /wrkdirs/usr/ports/net/ceph14/work/ceph-14.2.21/src/msg/async/Stack.cc
[ 16%] Building CXX object src/common/CMakeFiles/common-common-objs.dir/strtol.cc.o
cd /wrkdirs/usr/ports/net/ceph14/work/.build/src/common && /usr/local/bin/g++10 -DCEPH_DATADIR=\"/usr/local/share/ceph\" -DCEPH_LIBDIR=\"/usr/local/lib\" -DCEPH_PKGLIBDIR=\"/usr/local/lib/ceph\" -D_FILE_OFFSET_BITS=64 -I/wrkdirs/usr/ports/net/ceph14/work/.build/src/include -I/wrkdirs/usr/ports/net/ceph14/work/ceph-14.2.21/src -I/usr/local/include/nss -I/usr/local/include/nspr -isystem /wrkdirs/usr/ports/net/ceph14/work/.build/include -isystem /wrkdirs/usr/ports/net/ceph14/work/ceph-14.2.21/src/xxHash -isystem /wrkdirs/usr/ports/net/ceph14/work/ceph-14.2.21/src/rapidjson/include -O2 -pipe  -fstack-protector-strong -Wl,-rpath=/usr/local/lib/gcc10 -DLDAP_DEPRECATED -fno-strict-aliasing -Wall -Wtype-limits -Wignored-qualifiers -Winit-self -Wpointer-arith -Werror=format-security -fno-strict-aliasing -fsigned-char -Wno-unknown-pragmas -rdynamic -U_FORTIFY_SOURCE -D_FORTIFY_SOURCE=2 -fstack-protector-strong -maltivec -maltivec -fdiagnostics-color=auto -fno-builtin-malloc -fno-builtin-calloc
  -fno-builtin-realloc -fno-builtin-free -O2 -pipe  -fstack-protector-strong -Wl,-rpath=/usr/local/lib/gcc10  -Wl,-rpath=/usr/local/lib/gcc10 -std=gnu++17 -fPIC   -DHAVE_CONFIG_H -D__CEPH__ -D_REENTRANT -D_THREAD_SAFE -D__STDC_FORMAT_MACROS -std=c++17 -o CMakeFiles/common-common-objs.dir/strtol.cc.o -c /wrkdirs/usr/ports/net/ceph14/work/ceph-14.2.21/src/common/strtol.cc
[ 16%] Building CXX object src/common/CMakeFiles/common-common-objs.dir/types.cc.o
cd /wrkdirs/usr/ports/net/ceph14/work/.build/src/common && /usr/local/bin/g++10 -DCEPH_DATADIR=\"/usr/local/share/ceph\" -DCEPH_LIBDIR=\"/usr/local/lib\" -DCEPH_PKGLIBDIR=\"/usr/local/lib/ceph\" -D_FILE_OFFSET_BITS=64 -I/wrkdirs/usr/ports/net/ceph14/work/.build/src/include -I/wrkdirs/usr/ports/net/ceph14/work/ceph-14.2.21/src -I/usr/local/include/nss -I/usr/local/include/nspr -isystem /wrkdirs/usr/ports/net/ceph14/work/.build/include -isystem /wrkdirs/usr/ports/net/ceph14/work/ceph-14.2.21/src/xxHash -isystem /wrkdirs/usr/ports/net/ceph14/work/ceph-14.2.21/src/rapidjson/include -O2 -pipe  -fstack-protector-strong -Wl,-rpath=/usr/local/lib/gcc10 -DLDAP_DEPRECATED -fno-strict-aliasing -Wall -Wtype-limits -Wignored-qualifiers -Winit-self -Wpointer-arith -Werror=format-security -fno-strict-aliasing -fsigned-char -Wno-unknown-pragmas -rdynamic -U_FORTIFY_SOURCE -D_FORTIFY_SOURCE=2 -fstack-protector-strong -maltivec -maltivec -fdiagnostics-color=auto -fno-builtin-malloc -fno-builtin-calloc
  -fno-builtin-realloc -fno-builtin-free -O2 -pipe  -fstack-protector-strong -Wl,-rpath=/usr/local/lib/gcc10  -Wl,-rpath=/usr/local/lib/gcc10 -std=gnu++17 -fPIC   -DHAVE_CONFIG_H -D__CEPH__ -D_REENTRANT -D_THREAD_SAFE -D__STDC_FORMAT_MACROS -std=c++17 -o CMakeFiles/common-common-objs.dir/types.cc.o -c /wrkdirs/usr/ports/net/ceph14/work/ceph-14.2.21/src/common/types.cc
[ 16%] Building CXX object src/common/CMakeFiles/common-common-objs.dir/url_escape.cc.o
cd /wrkdirs/usr/ports/net/ceph14/work/.build/src/common && /usr/local/bin/g++10 -DCEPH_DATADIR=\"/usr/local/share/ceph\" -DCEPH_LIBDIR=\"/usr/local/lib\" -DCEPH_PKGLIBDIR=\"/usr/local/lib/ceph\" -D_FILE_OFFSET_BITS=64 -I/wrkdirs/usr/ports/net/ceph14/work/.build/src/include -I/wrkdirs/usr/ports/net/ceph14/work/ceph-14.2.21/src -I/usr/local/include/nss -I/usr/local/include/nspr -isystem /wrkdirs/usr/ports/net/ceph14/work/.build/include -isystem /wrkdirs/usr/ports/net/ceph14/work/ceph-14.2.21/src/xxHash -isystem /wrkdirs/usr/ports/net/ceph14/work/ceph-14.2.21/src/rapidjson/include -O2 -pipe  -fstack-protector-strong -Wl,-rpath=/usr/local/lib/gcc10 -DLDAP_DEPRECATED -fno-strict-aliasing -Wall -Wtype-limits -Wignored-qualifiers -Winit-self -Wpointer-arith -Werror=format-security -fno-strict-aliasing -fsigned-char -Wno-unknown-pragmas -rdynamic -U_FORTIFY_SOURCE -D_FORTIFY_SOURCE=2 -fstack-protector-strong -maltivec -maltivec -fdiagnostics-color=auto -fno-builtin-malloc -fno-builtin-calloc
  -fno-builtin-realloc -fno-builtin-free -O2 -pipe  -fstack-protector-strong -Wl,-rpath=/usr/local/lib/gcc10  -Wl,-rpath=/usr/local/lib/gcc10 -std=gnu++17 -fPIC   -DHAVE_CONFIG_H -D__CEPH__ -D_REENTRANT -D_THREAD_SAFE -D__STDC_FORMAT_MACROS -std=c++17 -o CMakeFiles/common-common-objs.dir/url_escape.cc.o -c /wrkdirs/usr/ports/net/ceph14/work/ceph-14.2.21/src/common/url_escape.cc
[ 16%] Building CXX object src/msg/CMakeFiles/common-msg-objs.dir/async/crypto_onwire.cc.o
cd /wrkdirs/usr/ports/net/ceph14/work/.build/src/msg && /usr/local/bin/g++10 -D_FILE_OFFSET_BITS=64 -I/wrkdirs/usr/ports/net/ceph14/work/.build/src/include -I/wrkdirs/usr/ports/net/ceph14/work/ceph-14.2.21/src -I/usr/local/include/nss -I/usr/local/include/nspr -isystem /wrkdirs/usr/ports/net/ceph14/work/.build/include -isystem /wrkdirs/usr/ports/net/ceph14/work/ceph-14.2.21/src/xxHash -isystem /wrkdirs/usr/ports/net/ceph14/work/ceph-14.2.21/src/rapidjson/include -O2 -pipe  -fstack-protector-strong -Wl,-rpath=/usr/local/lib/gcc10 -DLDAP_DEPRECATED -fno-strict-aliasing -Wall -Wtype-limits -Wignored-qualifiers -Winit-self -Wpointer-arith -Werror=format-security -fno-strict-aliasing -fsigned-char -Wno-unknown-pragmas -rdynamic -U_FORTIFY_SOURCE -D_FORTIFY_SOURCE=2 -fstack-protector-strong -maltivec -maltivec -fdiagnostics-color=auto -fno-builtin-malloc -fno-builtin-calloc -fno-builtin-realloc -fno-builtin-free -O2 -pipe  -fstack-protector-strong -Wl,-rpath=/usr/local/lib/gcc10  -Wl,-rpat
 h=/usr/local/lib/gcc10 -std=gnu++17 -fPIC   -DHAVE_CONFIG_H -D__CEPH__ -D_REENTRANT -D_THREAD_SAFE -D__STDC_FORMAT_MACROS -std=c++17 -o CMakeFiles/common-msg-objs.dir/async/crypto_onwire.cc.o -c /wrkdirs/usr/ports/net/ceph14/work/ceph-14.2.21/src/msg/async/crypto_onwire.cc
[ 16%] Building C object src/common/CMakeFiles/common-common-objs.dir/utf8.c.o
cd /wrkdirs/usr/ports/net/ceph14/work/.build/src/common && /usr/local/bin/gcc10 -DCEPH_DATADIR=\"/usr/local/share/ceph\" -DCEPH_LIBDIR=\"/usr/local/lib\" -DCEPH_PKGLIBDIR=\"/usr/local/lib/ceph\" -D_FILE_OFFSET_BITS=64 -I/wrkdirs/usr/ports/net/ceph14/work/.build/src/include -I/wrkdirs/usr/ports/net/ceph14/work/ceph-14.2.21/src -I/usr/local/include/nss -I/usr/local/include/nspr -isystem /wrkdirs/usr/ports/net/ceph14/work/.build/include -isystem /wrkdirs/usr/ports/net/ceph14/work/ceph-14.2.21/src/xxHash -isystem /wrkdirs/usr/ports/net/ceph14/work/ceph-14.2.21/src/rapidjson/include -O2 -pipe  -fstack-protector-strong -Wl,-rpath=/usr/local/lib/gcc10 -DLDAP_DEPRECATED -fno-strict-aliasing -Wall -Wtype-limits -Wignored-qualifiers -Winit-self -Wpointer-arith -Werror=format-security -fno-strict-aliasing -fsigned-char -Wno-unknown-pragmas -rdynamic -U_FORTIFY_SOURCE -D_FORTIFY_SOURCE=2 -fstack-protector-strong -maltivec -fdiagnostics-color=auto -O2 -pipe  -fstack-protector-strong -Wl,-rpath=/u
 sr/local/lib/gcc10 -DLDAP_DEPRECATED -fno-strict-aliasing -fPIC   -DHAVE_CONFIG_H -D__CEPH__ -D_REENTRANT -D_THREAD_SAFE -D__STDC_FORMAT_MACROS -std=gnu99 -o CMakeFiles/common-common-objs.dir/utf8.c.o -c /wrkdirs/usr/ports/net/ceph14/work/ceph-14.2.21/src/common/utf8.c
[ 16%] Building CXX object src/common/CMakeFiles/common-common-objs.dir/util.cc.o
cd /wrkdirs/usr/ports/net/ceph14/work/.build/src/common && /usr/local/bin/g++10 -DCEPH_DATADIR=\"/usr/local/share/ceph\" -DCEPH_LIBDIR=\"/usr/local/lib\" -DCEPH_PKGLIBDIR=\"/usr/local/lib/ceph\" -D_FILE_OFFSET_BITS=64 -I/wrkdirs/usr/ports/net/ceph14/work/.build/src/include -I/wrkdirs/usr/ports/net/ceph14/work/ceph-14.2.21/src -I/usr/local/include/nss -I/usr/local/include/nspr -isystem /wrkdirs/usr/ports/net/ceph14/work/.build/include -isystem /wrkdirs/usr/ports/net/ceph14/work/ceph-14.2.21/src/xxHash -isystem /wrkdirs/usr/ports/net/ceph14/work/ceph-14.2.21/src/rapidjson/include -O2 -pipe  -fstack-protector-strong -Wl,-rpath=/usr/local/lib/gcc10 -DLDAP_DEPRECATED -fno-strict-aliasing -Wall -Wtype-limits -Wignored-qualifiers -Winit-self -Wpointer-arith -Werror=format-security -fno-strict-aliasing -fsigned-char -Wno-unknown-pragmas -rdynamic -U_FORTIFY_SOURCE -D_FORTIFY_SOURCE=2 -fstack-protector-strong -maltivec -maltivec -fdiagnostics-color=auto -fno-builtin-malloc -fno-builtin-calloc
  -fno-builtin-realloc -fno-builtin-free -O2 -pipe  -fstack-protector-strong -Wl,-rpath=/usr/local/lib/gcc10  -Wl,-rpath=/usr/local/lib/gcc10 -std=gnu++17 -fPIC   -DHAVE_CONFIG_H -D__CEPH__ -D_REENTRANT -D_THREAD_SAFE -D__STDC_FORMAT_MACROS -std=c++17 -o CMakeFiles/common-common-objs.dir/util.cc.o -c /wrkdirs/usr/ports/net/ceph14/work/ceph-14.2.21/src/common/util.cc
[ 16%] Building CXX object src/msg/CMakeFiles/common-msg-objs.dir/async/frames_v2.cc.o
cd /wrkdirs/usr/ports/net/ceph14/work/.build/src/msg && /usr/local/bin/g++10 -D_FILE_OFFSET_BITS=64 -I/wrkdirs/usr/ports/net/ceph14/work/.build/src/include -I/wrkdirs/usr/ports/net/ceph14/work/ceph-14.2.21/src -I/usr/local/include/nss -I/usr/local/include/nspr -isystem /wrkdirs/usr/ports/net/ceph14/work/.build/include -isystem /wrkdirs/usr/ports/net/ceph14/work/ceph-14.2.21/src/xxHash -isystem /wrkdirs/usr/ports/net/ceph14/work/ceph-14.2.21/src/rapidjson/include -O2 -pipe  -fstack-protector-strong -Wl,-rpath=/usr/local/lib/gcc10 -DLDAP_DEPRECATED -fno-strict-aliasing -Wall -Wtype-limits -Wignored-qualifiers -Winit-self -Wpointer-arith -Werror=format-security -fno-strict-aliasing -fsigned-char -Wno-unknown-pragmas -rdynamic -U_FORTIFY_SOURCE -D_FORTIFY_SOURCE=2 -fstack-protector-strong -maltivec -maltivec -fdiagnostics-color=auto -fno-builtin-malloc -fno-builtin-calloc -fno-builtin-realloc -fno-builtin-free -O2 -pipe  -fstack-protector-strong -Wl,-rpath=/usr/local/lib/gcc10  -Wl,-rpat
 h=/usr/local/lib/gcc10 -std=gnu++17 -fPIC   -DHAVE_CONFIG_H -D__CEPH__ -D_REENTRANT -D_THREAD_SAFE -D__STDC_FORMAT_MACROS -std=c++17 -o CMakeFiles/common-msg-objs.dir/async/frames_v2.cc.o -c /wrkdirs/usr/ports/net/ceph14/work/ceph-14.2.21/src/msg/async/frames_v2.cc
/wrkdirs/usr/ports/net/ceph14/work/ceph-14.2.21/src/common/util.cc:85:13: warning: 'void file_values_parse(const std::map<std::__cxx11::basic_string<char>, std::__cxx11::basic_string<char> >&, FILE*, std::map<std::__cxx11::basic_string<char>, std::__cxx11::basic_string<char> >*, CephContext*)' defined but not used [-Wunused-function]
   85 | static void file_values_parse(const map<string, string>& kvm, FILE *fp, map<string, string> *m, CephContext *cct) {
      |             ^~~~~~~~~~~~~~~~~
[ 16%] Building CXX object src/common/CMakeFiles/common-common-objs.dir/version.cc.o
cd /wrkdirs/usr/ports/net/ceph14/work/.build/src/common && /usr/local/bin/g++10 -DCEPH_DATADIR=\"/usr/local/share/ceph\" -DCEPH_LIBDIR=\"/usr/local/lib\" -DCEPH_PKGLIBDIR=\"/usr/local/lib/ceph\" -D_FILE_OFFSET_BITS=64 -I/wrkdirs/usr/ports/net/ceph14/work/.build/src/include -I/wrkdirs/usr/ports/net/ceph14/work/ceph-14.2.21/src -I/usr/local/include/nss -I/usr/local/include/nspr -isystem /wrkdirs/usr/ports/net/ceph14/work/.build/include -isystem /wrkdirs/usr/ports/net/ceph14/work/ceph-14.2.21/src/xxHash -isystem /wrkdirs/usr/ports/net/ceph14/work/ceph-14.2.21/src/rapidjson/include -O2 -pipe  -fstack-protector-strong -Wl,-rpath=/usr/local/lib/gcc10 -DLDAP_DEPRECATED -fno-strict-aliasing -Wall -Wtype-limits -Wignored-qualifiers -Winit-self -Wpointer-arith -Werror=format-security -fno-strict-aliasing -fsigned-char -Wno-unknown-pragmas -rdynamic -U_FORTIFY_SOURCE -D_FORTIFY_SOURCE=2 -fstack-protector-strong -maltivec -maltivec -fdiagnostics-color=auto -fno-builtin-malloc -fno-builtin-calloc
  -fno-builtin-realloc -fno-builtin-free -O2 -pipe  -fstack-protector-strong -Wl,-rpath=/usr/local/lib/gcc10  -Wl,-rpath=/usr/local/lib/gcc10 -std=gnu++17 -fPIC   -DHAVE_CONFIG_H -D__CEPH__ -D_REENTRANT -D_THREAD_SAFE -D__STDC_FORMAT_MACROS -std=c++17 -o CMakeFiles/common-common-objs.dir/version.cc.o -c /wrkdirs/usr/ports/net/ceph14/work/ceph-14.2.21/src/common/version.cc
[ 16%] Building C object src/common/CMakeFiles/common-common-objs.dir/xattr.c.o
cd /wrkdirs/usr/ports/net/ceph14/work/.build/src/common && /usr/local/bin/gcc10 -DCEPH_DATADIR=\"/usr/local/share/ceph\" -DCEPH_LIBDIR=\"/usr/local/lib\" -DCEPH_PKGLIBDIR=\"/usr/local/lib/ceph\" -D_FILE_OFFSET_BITS=64 -I/wrkdirs/usr/ports/net/ceph14/work/.build/src/include -I/wrkdirs/usr/ports/net/ceph14/work/ceph-14.2.21/src -I/usr/local/include/nss -I/usr/local/include/nspr -isystem /wrkdirs/usr/ports/net/ceph14/work/.build/include -isystem /wrkdirs/usr/ports/net/ceph14/work/ceph-14.2.21/src/xxHash -isystem /wrkdirs/usr/ports/net/ceph14/work/ceph-14.2.21/src/rapidjson/include -O2 -pipe  -fstack-protector-strong -Wl,-rpath=/usr/local/lib/gcc10 -DLDAP_DEPRECATED -fno-strict-aliasing -Wall -Wtype-limits -Wignored-qualifiers -Winit-self -Wpointer-arith -Werror=format-security -fno-strict-aliasing -fsigned-char -Wno-unknown-pragmas -rdynamic -U_FORTIFY_SOURCE -D_FORTIFY_SOURCE=2 -fstack-protector-strong -maltivec -fdiagnostics-color=auto -O2 -pipe  -fstack-protector-strong -Wl,-rpath=/u
 sr/local/lib/gcc10 -DLDAP_DEPRECATED -fno-strict-aliasing -fPIC   -DHAVE_CONFIG_H -D__CEPH__ -D_REENTRANT -D_THREAD_SAFE -D__STDC_FORMAT_MACROS -std=gnu99 -o CMakeFiles/common-common-objs.dir/xattr.c.o -c /wrkdirs/usr/ports/net/ceph14/work/ceph-14.2.21/src/common/xattr.c
[ 16%] Building CXX object src/common/CMakeFiles/common-common-objs.dir/freebsd_errno.cc.o
cd /wrkdirs/usr/ports/net/ceph14/work/.build/src/common && /usr/local/bin/g++10 -DCEPH_DATADIR=\"/usr/local/share/ceph\" -DCEPH_LIBDIR=\"/usr/local/lib\" -DCEPH_PKGLIBDIR=\"/usr/local/lib/ceph\" -D_FILE_OFFSET_BITS=64 -I/wrkdirs/usr/ports/net/ceph14/work/.build/src/include -I/wrkdirs/usr/ports/net/ceph14/work/ceph-14.2.21/src -I/usr/local/include/nss -I/usr/local/include/nspr -isystem /wrkdirs/usr/ports/net/ceph14/work/.build/include -isystem /wrkdirs/usr/ports/net/ceph14/work/ceph-14.2.21/src/xxHash -isystem /wrkdirs/usr/ports/net/ceph14/work/ceph-14.2.21/src/rapidjson/include -O2 -pipe  -fstack-protector-strong -Wl,-rpath=/usr/local/lib/gcc10 -DLDAP_DEPRECATED -fno-strict-aliasing -Wall -Wtype-limits -Wignored-qualifiers -Winit-self -Wpointer-arith -Werror=format-security -fno-strict-aliasing -fsigned-char -Wno-unknown-pragmas -rdynamic -U_FORTIFY_SOURCE -D_FORTIFY_SOURCE=2 -fstack-protector-strong -maltivec -maltivec -fdiagnostics-color=auto -fno-builtin-malloc -fno-builtin-calloc
  -fno-builtin-realloc -fno-builtin-free -O2 -pipe  -fstack-protector-strong -Wl,-rpath=/usr/local/lib/gcc10  -Wl,-rpath=/usr/local/lib/gcc10 -std=gnu++17 -fPIC   -DHAVE_CONFIG_H -D__CEPH__ -D_REENTRANT -D_THREAD_SAFE -D__STDC_FORMAT_MACROS -std=c++17 -o CMakeFiles/common-common-objs.dir/freebsd_errno.cc.o -c /wrkdirs/usr/ports/net/ceph14/work/ceph-14.2.21/src/common/freebsd_errno.cc
In file included from /usr/local/include/fmt/format.h:3955,
                 from /wrkdirs/usr/ports/net/ceph14/work/ceph-14.2.21/src/msg/async/frames_v2.cc:21:
/usr/local/include/fmt/format-inl.h: In function 'uint64_t fmt::v7::detail::dragonbox::umul192_upper64(uint64_t, fmt::v7::detail::uint128_wrapper)':
/usr/local/include/fmt/format-inl.h:1692:33: note: the ABI of passing aggregates with 16-byte alignment has changed in GCC 5
 1692 | FMT_SAFEBUFFERS inline uint64_t umul192_upper64(uint64_t x, uint128_wrapper y)
      |                                 ^~~~~~~~~~~~~~~
/wrkdirs/usr/ports/net/ceph14/work/ceph-14.2.21/src/common/freebsd_errno.cc:52:23: error: 'ENOSTR' was not declared in this scope; did you mean 'ENOTTY'?
   52 |        C2H_ERRNO(60,  ENOSTR),
      |                       ^~~~~~
/wrkdirs/usr/ports/net/ceph14/work/ceph-14.2.21/src/common/freebsd_errno.cc:20:30: note: in definition of macro 'C2H_ERRNO'
   20 | #define C2H_ERRNO(a,b) [a] = b
      |                              ^
/wrkdirs/usr/ports/net/ceph14/work/ceph-14.2.21/src/common/freebsd_errno.cc:54:23: error: 'ETIME' was not declared in this scope
   54 |        C2H_ERRNO(62,  ETIME),
      |                       ^~~~~
/wrkdirs/usr/ports/net/ceph14/work/ceph-14.2.21/src/common/freebsd_errno.cc:20:30: note: in definition of macro 'C2H_ERRNO'
   20 | #define C2H_ERRNO(a,b) [a] = b
      |                              ^
/wrkdirs/usr/ports/net/ceph14/work/ceph-14.2.21/src/common/freebsd_errno.cc:55:23: error: 'ENOSR' was not declared in this scope; did you mean 'ENOMSG'?
   55 |        C2H_ERRNO(63,  ENOSR),
      |                       ^~~~~
/wrkdirs/usr/ports/net/ceph14/work/ceph-14.2.21/src/common/freebsd_errno.cc:20:30: note: in definition of macro 'C2H_ERRNO'
   20 | #define C2H_ERRNO(a,b) [a] = b
      |                              ^
/wrkdirs/usr/ports/net/ceph14/work/ceph-14.2.21/src/common/freebsd_errno.cc:126:5: sorry, unimplemented: non-trivial designated initializers not supported
  126 |     };
      |     ^
/wrkdirs/usr/ports/net/ceph14/work/ceph-14.2.21/src/common/freebsd_errno.cc:126:5: sorry, unimplemented: non-trivial designated initializers not supported
/wrkdirs/usr/ports/net/ceph14/work/ceph-14.2.21/src/common/freebsd_errno.cc:126:5: sorry, unimplemented: non-trivial designated initializers not supported
/wrkdirs/usr/ports/net/ceph14/work/ceph-14.2.21/src/common/freebsd_errno.cc:126:5: sorry, unimplemented: non-trivial designated initializers not supported
/wrkdirs/usr/ports/net/ceph14/work/ceph-14.2.21/src/common/freebsd_errno.cc:126:5: sorry, unimplemented: non-trivial designated initializers not supported
/wrkdirs/usr/ports/net/ceph14/work/ceph-14.2.21/src/common/freebsd_errno.cc:126:5: sorry, unimplemented: non-trivial designated initializers not supported
/wrkdirs/usr/ports/net/ceph14/work/ceph-14.2.21/src/common/freebsd_errno.cc:126:5: sorry, unimplemented: non-trivial designated initializers not supported
/wrkdirs/usr/ports/net/ceph14/work/ceph-14.2.21/src/common/freebsd_errno.cc:126:5: sorry, unimplemented: non-trivial designated initializers not supported
/wrkdirs/usr/ports/net/ceph14/work/ceph-14.2.21/src/common/freebsd_errno.cc:126:5: sorry, unimplemented: non-trivial designated initializers not supported
/wrkdirs/usr/ports/net/ceph14/work/ceph-14.2.21/src/common/freebsd_errno.cc:126:5: sorry, unimplemented: non-trivial designated initializers not supported
/wrkdirs/usr/ports/net/ceph14/work/ceph-14.2.21/src/common/freebsd_errno.cc:126:5: sorry, unimplemented: non-trivial designated initializers not supported
/wrkdirs/usr/ports/net/ceph14/work/ceph-14.2.21/src/common/freebsd_errno.cc:126:5: sorry, unimplemented: non-trivial designated initializers not supported
/wrkdirs/usr/ports/net/ceph14/work/ceph-14.2.21/src/common/freebsd_errno.cc:126:5: sorry, unimplemented: non-trivial designated initializers not supported
/wrkdirs/usr/ports/net/ceph14/work/ceph-14.2.21/src/common/freebsd_errno.cc:126:5: sorry, unimplemented: non-trivial designated initializers not supported
/wrkdirs/usr/ports/net/ceph14/work/ceph-14.2.21/src/common/freebsd_errno.cc:126:5: sorry, unimplemented: non-trivial designated initializers not supported
/wrkdirs/usr/ports/net/ceph14/work/ceph-14.2.21/src/common/freebsd_errno.cc:126:5: sorry, unimplemented: non-trivial designated initializers not supported
/wrkdirs/usr/ports/net/ceph14/work/ceph-14.2.21/src/common/freebsd_errno.cc:126:5: sorry, unimplemented: non-trivial designated initializers not supported
/wrkdirs/usr/ports/net/ceph14/work/ceph-14.2.21/src/common/freebsd_errno.cc:126:5: sorry, unimplemented: non-trivial designated initializers not supported
/wrkdirs/usr/ports/net/ceph14/work/ceph-14.2.21/src/common/freebsd_errno.cc:126:5: sorry, unimplemented: non-trivial designated initializers not supported
/wrkdirs/usr/ports/net/ceph14/work/ceph-14.2.21/src/common/freebsd_errno.cc:126:5: sorry, unimplemented: non-trivial designated initializers not supported
/wrkdirs/usr/ports/net/ceph14/work/ceph-14.2.21/src/common/freebsd_errno.cc:126:5: sorry, unimplemented: non-trivial designated initializers not supported
/wrkdirs/usr/ports/net/ceph14/work/ceph-14.2.21/src/common/freebsd_errno.cc:126:5: sorry, unimplemented: non-trivial designated initializers not supported
/wrkdirs/usr/ports/net/ceph14/work/ceph-14.2.21/src/common/freebsd_errno.cc:126:5: sorry, unimplemented: non-trivial designated initializers not supported
/wrkdirs/usr/ports/net/ceph14/work/ceph-14.2.21/src/common/freebsd_errno.cc:126:5: sorry, unimplemented: non-trivial designated initializers not supported
/wrkdirs/usr/ports/net/ceph14/work/ceph-14.2.21/src/common/freebsd_errno.cc:126:5: sorry, unimplemented: non-trivial designated initializers not supported
/wrkdirs/usr/ports/net/ceph14/work/ceph-14.2.21/src/common/freebsd_errno.cc:197:2: sorry, unimplemented: non-trivial designated initializers not supported
  197 |  };
      |  ^
/wrkdirs/usr/ports/net/ceph14/work/ceph-14.2.21/src/common/freebsd_errno.cc:197:2: sorry, unimplemented: non-trivial designated initializers not supported
/wrkdirs/usr/ports/net/ceph14/work/ceph-14.2.21/src/common/freebsd_errno.cc:197:2: sorry, unimplemented: non-trivial designated initializers not supported
/wrkdirs/usr/ports/net/ceph14/work/ceph-14.2.21/src/common/freebsd_errno.cc:197:2: sorry, unimplemented: non-trivial designated initializers not supported
/wrkdirs/usr/ports/net/ceph14/work/ceph-14.2.21/src/common/freebsd_errno.cc:197:2: sorry, unimplemented: non-trivial designated initializers not supported
/wrkdirs/usr/ports/net/ceph14/work/ceph-14.2.21/src/common/freebsd_errno.cc:197:2: sorry, unimplemented: non-trivial designated initializers not supported
/wrkdirs/usr/ports/net/ceph14/work/ceph-14.2.21/src/common/freebsd_errno.cc:197:2: sorry, unimplemented: non-trivial designated initializers not supported
/wrkdirs/usr/ports/net/ceph14/work/ceph-14.2.21/src/common/freebsd_errno.cc:197:2: sorry, unimplemented: non-trivial designated initializers not supported
/wrkdirs/usr/ports/net/ceph14/work/ceph-14.2.21/src/common/freebsd_errno.cc:197:2: sorry, unimplemented: non-trivial designated initializers not supported
/wrkdirs/usr/ports/net/ceph14/work/ceph-14.2.21/src/common/freebsd_errno.cc:197:2: sorry, unimplemented: non-trivial designated initializers not supported
/wrkdirs/usr/ports/net/ceph14/work/ceph-14.2.21/src/common/freebsd_errno.cc:197:2: sorry, unimplemented: non-trivial designated initializers not supported
/wrkdirs/usr/ports/net/ceph14/work/ceph-14.2.21/src/common/freebsd_errno.cc:197:2: sorry, unimplemented: non-trivial designated initializers not supported
/wrkdirs/usr/ports/net/ceph14/work/ceph-14.2.21/src/common/freebsd_errno.cc:197:2: sorry, unimplemented: non-trivial designated initializers not supported
/wrkdirs/usr/ports/net/ceph14/work/ceph-14.2.21/src/common/freebsd_errno.cc:197:2: sorry, unimplemented: non-trivial designated initializers not supported
/wrkdirs/usr/ports/net/ceph14/work/ceph-14.2.21/src/common/freebsd_errno.cc:197:2: sorry, unimplemented: non-trivial designated initializers not supported
/wrkdirs/usr/ports/net/ceph14/work/ceph-14.2.21/src/common/freebsd_errno.cc:197:2: sorry, unimplemented: non-trivial designated initializers not supported
/wrkdirs/usr/ports/net/ceph14/work/ceph-14.2.21/src/common/freebsd_errno.cc:197:2: sorry, unimplemented: non-trivial designated initializers not supported
/wrkdirs/usr/ports/net/ceph14/work/ceph-14.2.21/src/common/freebsd_errno.cc:197:2: sorry, unimplemented: non-trivial designated initializers not supported
/wrkdirs/usr/ports/net/ceph14/work/ceph-14.2.21/src/common/freebsd_errno.cc:197:2: sorry, unimplemented: non-trivial designated initializers not supported
/wrkdirs/usr/ports/net/ceph14/work/ceph-14.2.21/src/common/freebsd_errno.cc:197:2: sorry, unimplemented: non-trivial designated initializers not supported
/wrkdirs/usr/ports/net/ceph14/work/ceph-14.2.21/src/common/freebsd_errno.cc:197:2: sorry, unimplemented: non-trivial designated initializers not supported
/wrkdirs/usr/ports/net/ceph14/work/ceph-14.2.21/src/common/freebsd_errno.cc:197:2: sorry, unimplemented: non-trivial designated initializers not supported
/wrkdirs/usr/ports/net/ceph14/work/ceph-14.2.21/src/common/freebsd_errno.cc:197:2: sorry, unimplemented: non-trivial designated initializers not supported
/wrkdirs/usr/ports/net/ceph14/work/ceph-14.2.21/src/common/freebsd_errno.cc:197:2: sorry, unimplemented: non-trivial designated initializers not supported
/wrkdirs/usr/ports/net/ceph14/work/ceph-14.2.21/src/common/freebsd_errno.cc:197:2: sorry, unimplemented: non-trivial designated initializers not supported
/wrkdirs/usr/ports/net/ceph14/work/ceph-14.2.21/src/common/freebsd_errno.cc:197:2: sorry, unimplemented: non-trivial designated initializers not supported
/wrkdirs/usr/ports/net/ceph14/work/ceph-14.2.21/src/common/freebsd_errno.cc:197:2: sorry, unimplemented: non-trivial designated initializers not supported
/wrkdirs/usr/ports/net/ceph14/work/ceph-14.2.21/src/common/freebsd_errno.cc:197:2: sorry, unimplemented: non-trivial designated initializers not supported
/wrkdirs/usr/ports/net/ceph14/work/ceph-14.2.21/src/common/freebsd_errno.cc:197:2: sorry, unimplemented: non-trivial designated initializers not supported
/wrkdirs/usr/ports/net/ceph14/work/ceph-14.2.21/src/common/freebsd_errno.cc:197:2: sorry, unimplemented: non-trivial designated initializers not supported
/wrkdirs/usr/ports/net/ceph14/work/ceph-14.2.21/src/common/freebsd_errno.cc:197:2: sorry, unimplemented: non-trivial designated initializers not supported
/wrkdirs/usr/ports/net/ceph14/work/ceph-14.2.21/src/common/freebsd_errno.cc:197:2: sorry, unimplemented: non-trivial designated initializers not supported
/wrkdirs/usr/ports/net/ceph14/work/ceph-14.2.21/src/common/freebsd_errno.cc:197:2: sorry, unimplemented: non-trivial designated initializers not supported
/wrkdirs/usr/ports/net/ceph14/work/ceph-14.2.21/src/common/freebsd_errno.cc:197:2: sorry, unimplemented: non-trivial designated initializers not supported
/wrkdirs/usr/ports/net/ceph14/work/ceph-14.2.21/src/common/freebsd_errno.cc:197:2: sorry, unimplemented: non-trivial designated initializers not supported
/wrkdirs/usr/ports/net/ceph14/work/ceph-14.2.21/src/common/freebsd_errno.cc:197:2: sorry, unimplemented: non-trivial designated initializers not supported
/wrkdirs/usr/ports/net/ceph14/work/ceph-14.2.21/src/common/freebsd_errno.cc:197:2: sorry, unimplemented: non-trivial designated initializers not supported
/wrkdirs/usr/ports/net/ceph14/work/ceph-14.2.21/src/common/freebsd_errno.cc:197:2: sorry, unimplemented: non-trivial designated initializers not supported
/wrkdirs/usr/ports/net/ceph14/work/ceph-14.2.21/src/common/freebsd_errno.cc:197:2: sorry, unimplemented: non-trivial designated initializers not supported
/wrkdirs/usr/ports/net/ceph14/work/ceph-14.2.21/src/common/freebsd_errno.cc:197:2: sorry, unimplemented: non-trivial designated initializers not supported
/wrkdirs/usr/ports/net/ceph14/work/ceph-14.2.21/src/common/freebsd_errno.cc:197:2: sorry, unimplemented: non-trivial designated initializers not supported
/wrkdirs/usr/ports/net/ceph14/work/ceph-14.2.21/src/common/freebsd_errno.cc:197:2: sorry, unimplemented: non-trivial designated initializers not supported
/wrkdirs/usr/ports/net/ceph14/work/ceph-14.2.21/src/common/freebsd_errno.cc:197:2: sorry, unimplemented: non-trivial designated initializers not supported
/wrkdirs/usr/ports/net/ceph14/work/ceph-14.2.21/src/common/freebsd_errno.cc:197:2: sorry, unimplemented: non-trivial designated initializers not supported
/wrkdirs/usr/ports/net/ceph14/work/ceph-14.2.21/src/common/freebsd_errno.cc:197:2: sorry, unimplemented: non-trivial designated initializers not supported
/wrkdirs/usr/ports/net/ceph14/work/ceph-14.2.21/src/common/freebsd_errno.cc:197:2: sorry, unimplemented: non-trivial designated initializers not supported
/wrkdirs/usr/ports/net/ceph14/work/ceph-14.2.21/src/common/freebsd_errno.cc:197:2: sorry, unimplemented: non-trivial designated initializers not supported
/wrkdirs/usr/ports/net/ceph14/work/ceph-14.2.21/src/common/freebsd_errno.cc:197:2: sorry, unimplemented: non-trivial designated initializers not supported
/wrkdirs/usr/ports/net/ceph14/work/ceph-14.2.21/src/common/freebsd_errno.cc:197:2: sorry, unimplemented: non-trivial designated initializers not supported
/wrkdirs/usr/ports/net/ceph14/work/ceph-14.2.21/src/common/freebsd_errno.cc:197:2: sorry, unimplemented: non-trivial designated initializers not supported
/wrkdirs/usr/ports/net/ceph14/work/ceph-14.2.21/src/common/freebsd_errno.cc:197:2: sorry, unimplemented: non-trivial designated initializers not supported
/wrkdirs/usr/ports/net/ceph14/work/ceph-14.2.21/src/common/freebsd_errno.cc:197:2: sorry, unimplemented: non-trivial designated initializers not supported
/wrkdirs/usr/ports/net/ceph14/work/ceph-14.2.21/src/common/freebsd_errno.cc:197:2: sorry, unimplemented: non-trivial designated initializers not supported
/wrkdirs/usr/ports/net/ceph14/work/ceph-14.2.21/src/common/freebsd_errno.cc:197:2: sorry, unimplemented: non-trivial designated initializers not supported
/wrkdirs/usr/ports/net/ceph14/work/ceph-14.2.21/src/common/freebsd_errno.cc:197:2: sorry, unimplemented: non-trivial designated initializers not supported
/wrkdirs/usr/ports/net/ceph14/work/ceph-14.2.21/src/common/freebsd_errno.cc:197:2: sorry, unimplemented: non-trivial designated initializers not supported
/wrkdirs/usr/ports/net/ceph14/work/ceph-14.2.21/src/common/freebsd_errno.cc:197:2: sorry, unimplemented: non-trivial designated initializers not supported
/wrkdirs/usr/ports/net/ceph14/work/ceph-14.2.21/src/common/freebsd_errno.cc:197:2: sorry, unimplemented: non-trivial designated initializers not supported
/wrkdirs/usr/ports/net/ceph14/work/ceph-14.2.21/src/common/freebsd_errno.cc:197:2: sorry, unimplemented: non-trivial designated initializers not supported
/wrkdirs/usr/ports/net/ceph14/work/ceph-14.2.21/src/common/freebsd_errno.cc:197:2: sorry, unimplemented: non-trivial designated initializers not supported
/wrkdirs/usr/ports/net/ceph14/work/ceph-14.2.21/src/common/freebsd_errno.cc:197:2: sorry, unimplemented: non-trivial designated initializers not supported
/wrkdirs/usr/ports/net/ceph14/work/ceph-14.2.21/src/common/freebsd_errno.cc:197:2: sorry, unimplemented: non-trivial designated initializers not supported
/wrkdirs/usr/ports/net/ceph14/work/ceph-14.2.21/src/common/freebsd_errno.cc:197:2: sorry, unimplemented: non-trivial designated initializers not supported
gmake[3]: *** [src/common/CMakeFiles/common-common-objs.dir/build.make:1256: src/common/CMakeFiles/common-common-objs.dir/freebsd_errno.cc.o] Error 1
gmake[3]: Leaving directory '/wrkdirs/usr/ports/net/ceph14/work/.build'
gmake[2]: *** [CMakeFiles/Makefile2:2504: src/common/CMakeFiles/common-common-objs.dir/all] Error 2
gmake[2]: *** Waiting for unfinished jobs....
[ 16%] Building CXX object src/msg/CMakeFiles/common-msg-objs.dir/async/net_handler.cc.o
cd /wrkdirs/usr/ports/net/ceph14/work/.build/src/msg && /usr/local/bin/g++10 -D_FILE_OFFSET_BITS=64 -I/wrkdirs/usr/ports/net/ceph14/work/.build/src/include -I/wrkdirs/usr/ports/net/ceph14/work/ceph-14.2.21/src -I/usr/local/include/nss -I/usr/local/include/nspr -isystem /wrkdirs/usr/ports/net/ceph14/work/.build/include -isystem /wrkdirs/usr/ports/net/ceph14/work/ceph-14.2.21/src/xxHash -isystem /wrkdirs/usr/ports/net/ceph14/work/ceph-14.2.21/src/rapidjson/include -O2 -pipe  -fstack-protector-strong -Wl,-rpath=/usr/local/lib/gcc10 -DLDAP_DEPRECATED -fno-strict-aliasing -Wall -Wtype-limits -Wignored-qualifiers -Winit-self -Wpointer-arith -Werror=format-security -fno-strict-aliasing -fsigned-char -Wno-unknown-pragmas -rdynamic -U_FORTIFY_SOURCE -D_FORTIFY_SOURCE=2 -fstack-protector-strong -maltivec -maltivec -fdiagnostics-color=auto -fno-builtin-malloc -fno-builtin-calloc -fno-builtin-realloc -fno-builtin-free -O2 -pipe  -fstack-protector-strong -Wl,-rpath=/usr/local/lib/gcc10  -Wl,-rpat
 h=/usr/local/lib/gcc10 -std=gnu++17 -fPIC   -DHAVE_CONFIG_H -D__CEPH__ -D_REENTRANT -D_THREAD_SAFE -D__STDC_FORMAT_MACROS -std=c++17 -o CMakeFiles/common-msg-objs.dir/async/net_handler.cc.o -c /wrkdirs/usr/ports/net/ceph14/work/ceph-14.2.21/src/msg/async/net_handler.cc
[ 16%] Building CXX object src/msg/CMakeFiles/common-msg-objs.dir/async/EventKqueue.cc.o
cd /wrkdirs/usr/ports/net/ceph14/work/.build/src/msg && /usr/local/bin/g++10 -D_FILE_OFFSET_BITS=64 -I/wrkdirs/usr/ports/net/ceph14/work/.build/src/include -I/wrkdirs/usr/ports/net/ceph14/work/ceph-14.2.21/src -I/usr/local/include/nss -I/usr/local/include/nspr -isystem /wrkdirs/usr/ports/net/ceph14/work/.build/include -isystem /wrkdirs/usr/ports/net/ceph14/work/ceph-14.2.21/src/xxHash -isystem /wrkdirs/usr/ports/net/ceph14/work/ceph-14.2.21/src/rapidjson/include -O2 -pipe  -fstack-protector-strong -Wl,-rpath=/usr/local/lib/gcc10 -DLDAP_DEPRECATED -fno-strict-aliasing -Wall -Wtype-limits -Wignored-qualifiers -Winit-self -Wpointer-arith -Werror=format-security -fno-strict-aliasing -fsigned-char -Wno-unknown-pragmas -rdynamic -U_FORTIFY_SOURCE -D_FORTIFY_SOURCE=2 -fstack-protector-strong -maltivec -maltivec -fdiagnostics-color=auto -fno-builtin-malloc -fno-builtin-calloc -fno-builtin-realloc -fno-builtin-free -O2 -pipe  -fstack-protector-strong -Wl,-rpath=/usr/local/lib/gcc10  -Wl,-rpat
 h=/usr/local/lib/gcc10 -std=gnu++17 -fPIC   -DHAVE_CONFIG_H -D__CEPH__ -D_REENTRANT -D_THREAD_SAFE -D__STDC_FORMAT_MACROS -std=c++17 -o CMakeFiles/common-msg-objs.dir/async/EventKqueue.cc.o -c /wrkdirs/usr/ports/net/ceph14/work/ceph-14.2.21/src/msg/async/EventKqueue.cc
gmake[3]: Leaving directory '/wrkdirs/usr/ports/net/ceph14/work/.build'
[ 16%] Built target common-msg-objs
gmake[2]: Leaving directory '/wrkdirs/usr/ports/net/ceph14/work/.build'
gmake[1]: *** [Makefile:163: all] Error 2
gmake[1]: Leaving directory '/wrkdirs/usr/ports/net/ceph14/work/.build'
===> Compilation failed unexpectedly.
Try to set MAKE_JOBS_UNSAFE=yes and rebuild before reporting the failure to
the maintainer.
*** Error code 1

Stop.
make: stopped in /usr/ports/net/ceph14
Received on Tue Jun 22 2021 - 03:56:52 UTC

Original text of this message